{"text_format":"3","workbook":"xlsx","n_sheets":12,"sheets":["Instruções","Dashboard","Vendedores","Clientes","Produtos","Pipeline","Vendas","Comissões","Forecast","Metas","Agenda","Base de Cálculos"],"not_rendered":{"images":6,"macros":1,"defined_names":12},"read":"whole","date_system":"1900"}

{"sheet":"Instruções","index":0,"n_rows":99,"n_cols":13,"rows_kept":99,"merged":[[13,2,13,19],[18,2,18,19],[32,2,32,19],[42,2,42,19],[48,2,48,19],[64,2,64,19],[72,2,72,19],[82,2,82,19],[91,2,91,19]]}
["http://authenticator.sapphirebusinesstech.com:8080/access/v1/validate"]
["123456789",{"$nulls":4},"Any use for this file other than sample using and technical analysis without authorization is stricly prohibited and protected by copyright"]
["contact@sapphirebusinesstech.com",{"$nulls":4},"Qualquer uso desse arquivo sem autorização outro que uso de exemplo e análise técnica é extritamente proibida e protegida por direitos autorais."]
[{"$nulls":5},"Cualquier uso de este archivo sin autorización que no sea para fines de ejemplo o análisis técnico está estrictamente prohibido y está protegido por derechos de autor."]
[200]
[]
[{"$f":"IF(A12=\"\",0,TODAY()-A12)","v":0}]
[]
[]
[null,null,"INSTRUÇÕES DE USO"]
[null,null,"Solução de Gestão de Operações Comerciais"]
[null,null,"Instruções","Dashboard","Vendedores","Clientes","Produtos","Pipeline","Vendas","Comissões","Forecast","Metas","Agenda"]
[]
[null,null,"1. OBJETIVO DA PLANILHA"]
[{"$nulls":3},"Controlar todo o ciclo comercial — da oportunidade ao pagamento da comissão — em uma única ferramenta."]
[{"$nulls":3},"Substitui controles paralelos em Word, e-mail e planilhas soltas, oferecendo indicadores gerenciais e previsão de faturamento."]
[{"$nulls":3},"Nenhuma macro ou VBA é utilizada. Todo o cálculo é feito por fórmulas nativas, compatíveis com Excel 2019 ou superior."]
[]
[null,null,"2. ESTRUTURA DAS ABAS"]
[null,null,"Instruções","Esta aba. Manual de uso, fluxo de preenchimento e glossário dos indicadores."]
[null,null,"Dashboard","Painel executivo 100% automático: 12 indicadores, destaques, funil e 8 gráficos gerenciais."]
[null,null,"Vendedores","Cadastro da equipe comercial: código, nome, equipe, comissão padrão, meta mensal e status."]
[null,null,"Clientes","Cadastro da base de clientes: dados de contato, cidade/estado, segmento, origem e status."]
[null,null,"Produtos","Catálogo de produtos, serviços, planos, assinaturas e consultorias, com preço base e comissão."]
[null,null,"Pipeline","Tela operacional principal. Todas as oportunidades em andamento, por estágio e probabilidade."]
[null,null,"Vendas","Registro das vendas fechadas. Comissão calculada automaticamente a partir do produto vendido."]
[null,null,"Comissões","Espelho das vendas com status de pagamento e totais de comissão paga e pendente."]
[null,null,"Forecast","Previsão de receita a partir do pipeline aberto, com cenários otimista e conservador."]
[null,null,"Metas","Metas por vendedor comparadas ao realizado, com percentual atingido e situação."]
[null,null,"Agenda","Agenda de atividades comerciais: ligações, visitas, follow-ups, reuniões e renovações."]
[null,null,"Base de Cálculos","Aba auxiliar. Concentra listas de validação e todas as agregações. Não editar manualmente."]
[]
[null,null,"3. ORDEM CORRETA DE PREENCHIMENTO"]
[null,null,"1º — Vendedores","Cadastre a equipe. A comissão padrão e a meta mensal alimentam as abas Metas e Comissões."]
[null,null,"2º — Clientes","Cadastre a base. Os nomes das empresas são usados nas listas do Pipeline, Vendas e Agenda."]
[null,null,"3º — Produtos","Cadastre o catálogo. A comissão específica do produto é o que define a comissão da venda."]
[null,null,"4º — Pipeline","Lance as oportunidades. Este é o dia a dia da operação — atualize semanalmente."]
[null,null,"5º — Vendas","Registre as oportunidades ganhas. A comissão é calculada sozinha."]
[null,null,"6º — Metas","Defina as metas do período. O realizado vem automaticamente das Vendas."]
[null,null,"7º — Agenda","Programe as atividades de relacionamento e follow-up."]
[null,null,"Automático","Dashboard, Comissões e Forecast não são preenchidos: eles se atualizam sozinhos."]
[]
[null,null,"4. FLUXO DE UTILIZAÇÃO"]
[null,null,"Diário","Atualizar a coluna Última Atualização do Pipeline e registrar as atividades da Agenda."]
[null,null,"Semanal","Revisar oportunidades paradas (destacadas em vermelho no Pipeline) e mover os estágios."]
[null,null,"No fechamento","Marcar o estágio como Fechado Ganho no Pipeline e lançar a linha correspondente em Vendas."]
[null,null,"Mensal","Conferir o Dashboard, validar o Forecast e liquidar as comissões marcando Pago = Sim em Vendas."]
[]
[null,null,"5. SIGNIFICADO DOS INDICADORES"]
[null,null,"Total Vendido","Soma do Valor Líquido de todas as vendas registradas (já descontados os descontos concedidos)."]
[null,null,"Em Negociação","Valor bruto das oportunidades do Pipeline com status Em aberto. É o tamanho do funil hoje."]
[null,null,"Receita Ponderada","Soma de Valor × Probabilidade das oportunidades abertas. É a previsão realista de receita."]
[null,null,"Ticket Médio","Valor Líquido médio por venda. Serve para dimensionar quantas vendas faltam para a meta."]
[null,null,"Taxa de Conversão","Ganhas ÷ (Ganhas + Perdidas). Mede a eficiência do time no fechamento."]
[null,null,"Valor Ganho / Perdido","Valor total das oportunidades fechadas como ganhas e como perdidas."]
[null,null,"Comissão Total","Soma das comissões geradas por todas as vendas do período."]
[null,null,"Comissão Paga","Comissões de vendas marcadas com Pago = Sim."]
[null,null,"Comissão Pendente","Comissões de vendas com Pago = Não. É o passivo em aberto com a equipe."]
[null,null,"Dias até Fechamento","Tempo médio, em dias, entre a entrada da oportunidade e o seu fechamento como ganha."]
[null,null,"Vendedor Destaque","Vendedor com maior receita líquida no período."]
[null,null,"Produto Mais Vendido","Produto com maior receita acumulada no período."]
[null,null,"Pipeline Parado","Quantidade de oportunidades abertas sem atualização há mais de 15 dias. Exige ação imediata."]
[null,null,"Funil Comercial","Quantidade e valor das oportunidades em cada estágio, do Lead ao fechamento."]
[]
[null,null,"6. COMO ADICIONAR NOVOS REGISTROS"]
[null,null,"Onde escrever","Todas as tabelas começam na célula C7 (cabeçalho) e os dados a partir da linha 8."]
[null,null,"Nova linha","Escreva na primeira linha vazia abaixo do último registro. Não insira linhas no meio da tabela."]
[null,null,"Listas suspensas","Campos como Estágio, Origem, Segmento e Prioridade têm lista suspensa. Clique na seta e escolha."]
[null,null,"Colunas calculadas","Não digite nas colunas de fundo cinza ou texto preto (ex.: Valor Ponderado, Comissão). Elas se calculam."]
[null,null,"Limite atual","As fórmulas cobrem até a linha 37 no Pipeline/Forecast e até a linha 32 em Vendas/Comissões."]
[null,null,"Para ampliar","Selecione a última linha com fórmula e arraste a alça de preenchimento para baixo."]
[]
[null,null,"7. CÓDIGO DE CORES E FORMATAÇÃO CONDICIONAL"]
[null,null,"Texto azul","Campo de digitação. É onde você escreve — valores, descontos, metas, preços."]
[null,null,"Texto preto","Fórmula de cálculo. Não altere."]
[null,null,"Texto verde","Fórmula que busca dados em outra aba. Não altere."]
[null,null,"Fundo vermelho","Pipeline sem atualização há mais de 15 dias, ou meta abaixo de 70%."]
[null,null,"Fundo amarelo","Pipeline sem atualização entre 8 e 15 dias. Atenção."]
[null,null,"Fundo verde","Pipeline atualizado (até 7 dias), ou meta atingida."]
[null,null,"Fundo laranja","Comissão pendente de pagamento."]
[null,null,"Fundo azul claro","Venda acima do ticket médio."]
[]
[null,null,"8. DÚVIDAS FREQUENTES"]
[null,null,"A comissão está zerada","Verifique se o nome do produto na aba Vendas é idêntico ao cadastrado na aba Produtos."]
[null,null,"O Dashboard não mudou","Pressione F9 para recalcular. Se persistir, confira se o registro foi lançado abaixo da linha 8."]
[null,null,"Preciso apagar uma venda","Apague apenas o conteúdo das colunas azuis. Não exclua a linha inteira, para não quebrar as fórmulas."]
[null,null,"Novo vendedor não aparece","O Dashboard e as Metas cobrem 7 vendedores. Amplie arrastando as fórmulas na Base de Cálculos."]
[null,null,"Como mudar as listas","Edite as listas na aba Base de Cálculos (linhas 8 a 20). Elas alimentam todas as validações."]
[null,null,"Quero mudar a comissão","Altere na aba Produtos (comissão por produto) ou Vendedores (comissão padrão do vendedor)."]
[]
[]
[null,null,"9. BOAS PRÁTICAS"]
[null,null,"Atualize o Pipeline","Uma oportunidade sem atualização há 15 dias é, na prática, uma oportunidade perdida."]
[null,null,"Não duplique nomes","Use sempre as listas suspensas. Nomes digitados manualmente quebram os totais por vendedor e produto."]
[null,null,"Não edite a Base de Cálculos","Toda a inteligência da planilha está lá. Alterações manuais quebram o Dashboard."]
[null,null,"Feche o mês","Antes de virar o mês, confira Dashboard, liquide comissões e arquive as oportunidades canceladas."]
[null,null,"Faça backup","Salve uma cópia mensal do arquivo antes de grandes alterações."]
[]
[{"$nulls":3},"Planilha desenvolvida sem uso de VBA. Compatível com Excel 2019, 2021, 365 e Excel Online."]

{"sheet":"Dashboard","index":1,"n_rows":32,"n_cols":15,"rows_kept":32,"hidden":true,"merged":[[7,2,7,4],[7,5,7,7],[7,8,7,10],[7,11,7,13],[8,2,8,4],[8,5,8,7],[8,8,8,10],[8,11,8,13],[11,2,11,4],[11,5,11,7],[11,8,11,10],[11,11,11,13],[12,2,12,4],[12,5,12,7],[12,8,12,10],[12,11,12,13],[15,2,15,4],[15,5,15,7],[15,8,15,10],[15,11,15,13],[16,2,16,4],[16,5,16,7],[16,8,16,10],[16,11,16,13],[20,2,20,4],[20,5,20,7],[20,8,20,9],[20,11,20,12],[21,2,21,4],[21,5,21,7],[21,8,21,9],[21,11,21,12],[22,2,22,4],[22,5,22,7],[22,8,22,9],[22,11,22,12],[23,2,23,4],[23,5,23,7],[23,8,23,9],[23,11,23,12],[24,2,24,4],[24,5,24,7],[24,8,24,9],[24,11,24,12],[25,11,25,12],[26,11,26,12],[27,11,27,12],[28,11,28,12]]}
[]
[null,null,"DASHBOARD EXECUTIVO"]
[null,null,"Solução de Gestão de Operações Comerciais"]
[null,null,"Instruções","Dashboard","Vendedores","Clientes","Produtos","Pipeline","Vendas","Comissões","Forecast","Metas","Agenda"]
[]
[null,null,"INDICADORES PRINCIPAIS"]
[]
[null,null,"Total Vendido",null,null,"Em Negociação",null,null,"Receita Ponderada",null,null,"Ticket Médio"]
[null,null,{"$f":"'Base de Cálculos'!$C$69","v":{"v":520760.94999999995,"d":"R$ 520,761"}},null,null,{"$f":"'Base de Cálculos'!$C$70","v":{"v":578640,"d":"R$ 578,640"}},null,null,{"$f":"'Base de Cálculos'!$C$72","v":{"v":214528,"d":"R$ 214,528"}},null,null,{"$f":"'Base de Cálculos'!$C$73","v":{"v":20830.438,"d":"R$ 20,830"}}]
[]
[]
[null,null,"Taxa de Conversão",null,null,"Qtd. Oportunidades",null,null,"Valor Ganho",null,null,"Valor Perdido"]
[null,null,{"$f":"'Base de Cálculos'!$C$77","v":{"v":0.7272727272727273,"d":"72.7%"}},null,null,{"$f":"'Base de Cálculos'!$C$74","v":30},null,null,{"$f":"'Base de Cálculos'!$C$78","v":{"v":258880,"d":"R$ 258,880"}},null,null,{"$f":"'Base de Cálculos'!$C$79","v":{"v":113040,"d":"R$ 113,040"}}]
[]
[]
[null,null,"Comissão Total",null,null,"Comissão Paga",null,null,"Comissão Pendente",null,null,"Dias até Fechamento"]
[null,null,{"$f":"'Base de Cálculos'!$C$80","v":{"v":30792.130000000005,"d":"R$ 30,792"}},null,null,{"$f":"'Base de Cálculos'!$C$81","v":{"v":24373.370000000003,"d":"R$ 24,373"}},null,null,{"$f":"'Base de Cálculos'!$C$82","v":{"v":6418.76,"d":"R$ 6,419"}},null,null,{"$f":"'Base de Cálculos'!$C$83","v":{"v":43,"d":"43 dias"}}]
[]
[null,null,"DESTAQUES E FUNIL COMERCIAL"]
[]
[null,null,"Indicador",null,null,"Resultado",null,null,"Valor / Total",null,null,"Estágio",null,"Qtd.","Valor"]
[null,null,"Vendedor Destaque",null,null,{"$f":"'Base de Cálculos'!$C$84","v":"Camila Souza"},null,null,{"$f":"'Base de Cálculos'!$C$85","v":{"v":111354.75,"d":"R$ 111,355"}},null,null,{"$f":"'Base de Cálculos'!$C$61","v":"Lead"},null,{"$f":"'Base de Cálculos'!$D$61","v":4},{"$f":"'Base de Cálculos'!$E$61","v":{"v":132480,"d":"R$ 132,480"}}]
[null,null,"Produto Mais Vendido",null,null,{"$f":"'Base de Cálculos'!$C$86","v":"Licença ERP Corporate"},null,null,{"$f":"'Base de Cálculos'!$C$87","v":{"v":130440,"d":"R$ 130,440"}},null,null,{"$f":"'Base de Cálculos'!$C$62","v":"Contato"},null,{"$f":"'Base de Cálculos'!$D$62","v":4},{"$f":"'Base de Cálculos'!$E$62","v":{"v":126480,"d":"R$ 126,480"}}]
[null,null,"Clientes Ativos",null,null,{"$f":"'Base de Cálculos'!$C$88","v":11},null,null,{"$f":"'Base de Cálculos'!$C$89","v":12},null,null,{"$f":"'Base de Cálculos'!$C$63","v":"Diagnóstico"},null,{"$f":"'Base de Cálculos'!$D$63","v":3},{"$f":"'Base de Cálculos'!$E$63","v":{"v":89360,"d":"R$ 89,360"}}]
[null,null,"Pipeline Parado (>15d)",null,null,{"$f":"'Base de Cálculos'!$C$90","v":18},{"$nulls":5},{"$f":"'Base de Cálculos'!$C$64","v":"Proposta"},null,{"$f":"'Base de Cálculos'!$D$64","v":4},{"$f":"'Base de Cálculos'!$E$64","v":{"v":140160,"d":"R$ 140,160"}}]
[{"$nulls":11},{"$f":"'Base de Cálculos'!$C$65","v":"Negociação"},null,{"$f":"'Base de Cálculos'!$D$65","v":3},{"$f":"'Base de Cálculos'!$E$65","v":{"v":90160,"d":"R$ 90,160"}}]
[{"$nulls":11},{"$f":"'Base de Cálculos'!$C$66","v":"Fechado Ganho"},null,{"$f":"'Base de Cálculos'!$D$66","v":8},{"$f":"'Base de Cálculos'!$E$66","v":{"v":258880,"d":"R$ 258,880"}}]
[{"$nulls":11},{"$f":"'Base de Cálculos'!$C$67","v":"Fechado Perdido"},null,{"$f":"'Base de Cálculos'!$D$67","v":3},{"$f":"'Base de Cálculos'!$E$67","v":{"v":113040,"d":"R$ 113,040"}}]
[{"$nulls":11},{"$f":"'Base de Cálculos'!$C$68","v":"Cancelado"},null,{"$f":"'Base de Cálculos'!$D$68","v":1},{"$f":"'Base de Cálculos'!$E$68","v":{"v":30800,"d":"R$ 30,800"}}]
[]
[null,null,"GRÁFICOS GERENCIAIS"]
[null,null,"Todos os gráficos são atualizados automaticamente a partir das abas operacionais."]

{"sheet":"Vendedores","index":2,"n_rows":15,"n_cols":13,"rows_kept":15,"hidden":true}
[]
[null,null,"CADASTRO DE VENDEDORES"]
[null,null,"Solução de Gestão de Operações Comerciais"]
[null,null,"Instruções","Dashboard","Vendedores","Clientes","Produtos","Pipeline","Vendas","Comissões","Forecast","Metas","Agenda"]
[]
[null,null,"Preencha os campos em azul. Código, Nome e Comissão Padrão são obrigatórios."]
[null,null,"Código","Nome","Equipe","Comissão Padrão","Meta Mensal","Ativo"]
[null,null,"V001","Ana Ribeiro","Equipe A",{"v":0.05,"d":"5.0%"},{"v":80000,"d":"R$ 80,000"},"Ativo"]
[null,null,"V002","Bruno Carvalho","Equipe A",{"v":0.045,"d":"4.5%"},{"v":70000,"d":"R$ 70,000"},"Ativo"]
[null,null,"V003","Camila Souza","Equipe B",{"v":0.06,"d":"6.0%"},{"v":95000,"d":"R$ 95,000"},"Ativo"]
[null,null,"V004","Diego Martins","Equipe B",{"v":0.04,"d":"4.0%"},{"v":60000,"d":"R$ 60,000"},"Ativo"]
[null,null,"V005","Elisa Nogueira","Inside Sales",{"v":0.035,"d":"3.5%"},{"v":45000,"d":"R$ 45,000"},"Ativo"]
[null,null,"V006","Fábio Lima","Key Accounts",{"v":0.07,"d":"7.0%"},{"v":120000,"d":"R$ 120,000"},"Ativo"]
[null,null,"V007","Gabriela Pinto","Equipe C",{"v":0.05,"d":"5.0%"},{"v":75000,"d":"R$ 75,000"},"Ativo"]
[null,null,"V008","Henrique Alves","Inside Sales",{"v":0.035,"d":"3.5%"},{"v":40000,"d":"R$ 40,000"},"Inativo"]

{"sheet":"Clientes","index":3,"n_rows":19,"n_cols":13,"rows_kept":19,"hidden":true}
[]
[null,null,"CADASTRO DE CLIENTES"]
[null,null,"Solução de Gestão de Operações Comerciais"]
[null,null,"Instruções","Dashboard","Vendedores","Clientes","Produtos","Pipeline","Vendas","Comissões","Forecast","Metas","Agenda"]
[]
[null,null,"Preencha os campos em azul. Use as listas suspensas em Segmento, Origem e Ativo."]
[null,null,"Código","Empresa","Contato","Telefone","Email","Cidade","Estado","Segmento","Origem","Ativo"]
[null,null,"C001","Alfa Indústria Ltda","Marcos Reis","(11) 3255-1010","marcos@alfaind.com.br","São Paulo","SP","Indústria","Indicação","Sim"]
[null,null,"C002","Beta Comércio SA","Patrícia Gomes","(21) 3777-2020","patricia@betacom.com.br","Rio de Janeiro","RJ","Comércio","Inbound","Sim"]
[null,null,"C003","Gamma Tech","Rodrigo Dias","(31) 3444-3030","rodrigo@gammatech.io","Belo Horizonte","MG","Tecnologia","Site","Sim"]
[null,null,"C004","Delta Saúde","Juliana Prado","(41) 3222-4040","juliana@deltasaude.com.br","Curitiba","PR","Saúde","Outbound","Sim"]
[null,null,"C005","Epsilon Educação","Tiago Moura","(51) 3111-5050","tiago@epsiloned.com.br","Porto Alegre","RS","Educação","Evento","Sim"]
[null,null,"C006","Zeta Agro","Marina Castro","(62) 3999-6060","marina@zetaagro.com.br","Goiânia","GO","Agronegócio","Parceiro","Sim"]
[null,null,"C007","Eta Serviços","Bruno Teles","(85) 3888-7070","bruno@etaserv.com.br","Fortaleza","CE","Serviços","Base Ativa","Sim"]
[null,null,"C008","Theta Financeira","Renata Luz","(11) 3666-8080","renata@thetafin.com.br","São Paulo","SP","Financeiro","Indicação","Sim"]
[null,null,"C009","Iota Distribuidora","Carlos Menezes","(48) 3555-9090","carlos@iotadist.com.br","Florianópolis","SC","Comércio","Redes Sociais","Sim"]
[null,null,"C010","Kappa Logística","Sandra Vieira","(71) 3444-1122","sandra@kappalog.com.br","Salvador","BA","Serviços","Inbound","Sim"]
[null,null,"C011","Lambda Metais","Otávio Freitas","(19) 3333-2233","otavio@lambdametais.com.br","Campinas","SP","Indústria","Outbound","Sim"]
[null,null,"C012","Mu Consultoria","Helena Braga","(61) 3222-3344","helena@muconsult.com.br","Brasília","DF","Serviços","Site","Não"]

{"sheet":"Produtos","index":4,"n_rows":17,"n_cols":13,"rows_kept":17,"hidden":true}
[]
[null,null,"CADASTRO DE PRODUTOS / SERVIÇOS"]
[null,null,"Solução de Gestão de Operações Comerciais"]
[null,null,"Instruções","Dashboard","Vendedores","Clientes","Produtos","Pipeline","Vendas","Comissões","Forecast","Metas","Agenda"]
[]
[null,null,"A Comissão Específica definida aqui é a que será usada no cálculo da comissão da venda."]
[null,null,"Código","Produto","Categoria","Preço Base","Comissão Específica","Ativo"]
[null,null,"P001","Licença ERP Corporate","Produto",{"v":48000,"d":"R$ 48,000"},{"v":0.05,"d":"5.0%"},"Ativo"]
[null,null,"P002","Licença ERP Starter","Produto",{"v":18000,"d":"R$ 18,000"},{"v":0.05,"d":"5.0%"},"Ativo"]
[null,null,"P003","Implantação Técnica","Serviço",{"v":26000,"d":"R$ 26,000"},{"v":0.04,"d":"4.0%"},"Ativo"]
[null,null,"P004","Plano Suporte Premium","Plano",{"v":12000,"d":"R$ 12,000"},{"v":0.06,"d":"6.0%"},"Ativo"]
[null,null,"P005","Plano Suporte Básico","Plano",{"v":4800,"d":"R$ 4,800"},{"v":0.06,"d":"6.0%"},"Ativo"]
[null,null,"P006","Assinatura BI Analytics","Assinatura",{"v":15600,"d":"R$ 15,600"},{"v":0.07,"d":"7.0%"},"Ativo"]
[null,null,"P007","Consultoria Estratégica","Consultoria",{"v":35000,"d":"R$ 35,000"},{"v":0.08,"d":"8.0%"},"Ativo"]
[null,null,"P008","Consultoria Processos","Consultoria",{"v":22000,"d":"R$ 22,000"},{"v":0.08,"d":"8.0%"},"Ativo"]
[null,null,"P009","Treinamento Equipe","Serviço",{"v":9500,"d":"R$ 9,500"},{"v":0.04,"d":"4.0%"},"Ativo"]
[null,null,"P010","Módulo Fiscal Adicional","Produto",{"v":7200,"d":"R$ 7,200"},{"v":0.05,"d":"5.0%"},"Inativo"]

{"sheet":"Pipeline","index":5,"n_rows":37,"n_cols":17,"rows_kept":37,"hidden":true}
[]
[null,null,"PIPELINE COMERCIAL"]
[null,null,"Solução de Gestão de Operações Comerciais"]
[null,null,"Instruções","Dashboard","Vendedores","Clientes","Produtos","Pipeline","Vendas","Comissões","Forecast","Metas","Agenda"]
[]
[null,null,"Atualize a coluna Última Atualização semanalmente. Linhas em vermelho estão paradas há mais de 15 dias."]
[null,null,"Cód. Oport.","Cliente","Produto","Responsável","Origem","Data Entrada","Estágio","Probabilidade","Valor","Valor Ponderado","Próxima Ação","Data Próx. Ação","Última Atualização","Dias sem Atualização","Status"]
[null,null,"OP001","Alfa Indústria Ltda","Licença ERP Corporate","Ana Ribeiro","Indicação","2026-03-30","Lead",{"v":0.1,"d":"10%"},{"v":38400,"d":"R$ 38,400"},{"$f":"IFERROR(K8*J8,0)","v":{"v":3840,"d":"R$ 3,840"}},"Ligar para retomar","2026-11-05","2026-07-26",{"$f":"IF(O8=\"\",\"\",IFERROR(TODAY()-O8,\"\"))","v":18},"Em aberto"]
[null,null,"OP002","Beta Comércio SA","Plano Suporte Premium","Bruno Carvalho","Redes Sociais","2026-04-02","Lead",{"v":0.1,"d":"10%"},{"v":10560,"d":"R$ 10,560"},{"$f":"IFERROR(K9*J9,0)","v":{"v":1056,"d":"R$ 1,056"}},"Enviar proposta","2026-12-06","2026-07-23",{"$f":"IF(O9=\"\",\"\",IFERROR(TODAY()-O9,\"\"))","v":21},"Em aberto"]
[null,null,"OP003","Gamma Tech","Consultoria Estratégica","Camila Souza","Inbound","2026-04-05","Lead",{"v":0.1,"d":"10%"},{"v":33600,"d":"R$ 33,600"},{"v":3360,"d":"R$ 3,360"},"Agendar reunião","2026-11-07","2026-07-19",25,"Em aberto"]
[null,null,"OP004","Delta Saúde","Licença ERP Corporate","Diego Martins","Base Ativa","2026-04-08","Lead",{"v":0.1,"d":"10%"},{"v":49920,"d":"R$ 49,920"},{"v":4992,"d":"R$ 4,992"},"Follow-up comercial","2026-12-08","2026-07-14",30,"Em aberto"]
[null,null,"OP005","Epsilon Educação","Plano Suporte Premium","Elisa Nogueira","Evento","2026-04-11","Contato",{"v":0.2,"d":"20%"},{"v":13440,"d":"R$ 13,440"},{"v":2688,"d":"R$ 2,688"},"Aguardar retorno","2026-11-09","2026-07-10",34,"Em aberto"]
[null,null,"OP006","Zeta Agro","Consultoria Estratégica","Fábio Lima","Site","2026-04-14","Contato",{"v":0.2,"d":"20%"},{"v":42000,"d":"R$ 42,000"},{"v":8400,"d":"R$ 8,400"},"Negociar desconto","2026-11-10","2026-07-03",41,"Em aberto"]
[null,null,"OP007","Eta Serviços","Licença ERP Corporate","Gabriela Pinto","Parceiro","2026-04-17","Contato",{"v":0.2,"d":"20%"},{"v":61440,"d":"R$ 61,440"},{"v":12288,"d":"R$ 12,288"},"Enviar contrato","2026-11-11","2026-06-26",48,"Em aberto"]
[null,null,"OP008","Theta Financeira","Plano Suporte Premium","Ana Ribeiro","Outbound","2026-04-20","Contato",{"v":0.2,"d":"20%"},{"v":9600,"d":"R$ 9,600"},{"v":1920,"d":"R$ 1,920"},"Ligar para retomar","2026-11-12","2026-07-21",23,"Em aberto"]
[null,null,"OP009","Iota Distribuidora","Consultoria Estratégica","Bruno Carvalho","Indicação","2026-04-23","Diagnóstico",{"v":0.35,"d":"35%"},{"v":30800,"d":"R$ 30,800"},{"v":10780,"d":"R$ 10,780"},"Enviar proposta","2026-10-13","2026-07-25",19,"Em aberto"]
[null,null,"OP010","Kappa Logística","Licença ERP Corporate","Camila Souza","Redes Sociais","2026-04-26","Diagnóstico",{"v":0.35,"d":"35%"},{"v":46080,"d":"R$ 46,080"},{"v":16127.999999999998,"d":"R$ 16,128"},"Agendar reunião","2026-10-14","2026-07-07",37,"Em aberto"]
[null,null,"OP011","Lambda Metais","Plano Suporte Premium","Diego Martins","Inbound","2026-04-29","Diagnóstico",{"v":0.35,"d":"35%"},{"v":12480,"d":"R$ 12,480"},{"v":4368,"d":"R$ 4,368"},"Follow-up comercial","2026-10-15","2026-07-26",18,"Em aberto"]
[null,null,"OP012","Alfa Indústria Ltda","Consultoria Estratégica","Elisa Nogueira","Base Ativa","2026-05-02","Proposta",{"v":0.55,"d":"55%"},{"v":39200,"d":"R$ 39,200"},{"v":21560,"d":"R$ 21,560"},"Aguardar retorno","2026-09-16","2026-07-23",21,"Em aberto"]
[null,null,"OP013","Beta Comércio SA","Licença ERP Corporate","Fábio Lima","Evento","2026-05-05","Proposta",{"v":0.55,"d":"55%"},{"v":57600,"d":"R$ 57,600"},{"v":31680.000000000004,"d":"R$ 31,680"},"Negociar desconto","2026-09-17","2026-07-19",25,"Em aberto"]
[null,null,"OP014","Gamma Tech","Plano Suporte Premium","Gabriela Pinto","Site","2026-05-08","Proposta",{"v":0.55,"d":"55%"},{"v":15360,"d":"R$ 15,360"},{"v":8448,"d":"R$ 8,448"},"Enviar contrato","2026-09-18","2026-07-14",30,"Em aberto"]
[null,null,"OP015","Delta Saúde","Consultoria Estratégica","Ana Ribeiro","Parceiro","2026-05-11","Proposta",{"v":0.55,"d":"55%"},{"v":28000,"d":"R$ 28,000"},{"v":15400.000000000002,"d":"R$ 15,400"},"Ligar para retomar","2026-09-19","2026-07-10",34,"Em aberto"]
[null,null,"OP016","Epsilon Educação","Licença ERP Corporate","Bruno Carvalho","Outbound","2026-05-14","Negociação",{"v":0.75,"d":"75%"},{"v":42240,"d":"R$ 42,240"},{"v":31680,"d":"R$ 31,680"},"Enviar proposta","2026-08-20","2026-07-03",41,"Em aberto"]
[null,null,"OP017","Zeta Agro","Plano Suporte Premium","Camila Souza","Indicação","2026-05-17","Negociação",{"v":0.75,"d":"75%"},{"v":11520,"d":"R$ 11,520"},{"v":8640,"d":"R$ 8,640"},"Agendar reunião","2026-08-21","2026-06-26",48,"Em aberto"]
[null,null,"OP018","Eta Serviços","Consultoria Estratégica","Diego Martins","Redes Sociais","2026-05-20","Negociação",{"v":0.75,"d":"75%"},{"v":36400,"d":"R$ 36,400"},{"v":27300,"d":"R$ 27,300"},"Follow-up comercial","2026-08-22","2026-07-21",23,"Em aberto"]
[null,null,"OP019","Theta Financeira","Licença ERP Corporate","Elisa Nogueira","Inbound","2026-05-23","Fechado Ganho",{"v":1,"d":"100%"},{"v":53760,"d":"R$ 53,760"},{"v":53760,"d":"R$ 53,760"},null,null,"2026-07-25",19,"Encerrada"]
[null,null,"OP020","Iota Distribuidora","Plano Suporte Premium","Fábio Lima","Base Ativa","2026-05-26","Fechado Ganho",{"v":1,"d":"100%"},{"v":14400,"d":"R$ 14,400"},{"v":14400,"d":"R$ 14,400"},null,null,"2026-07-07",37,"Encerrada"]
[null,null,"OP021","Kappa Logística","Consultoria Estratégica","Gabriela Pinto","Evento","2026-05-29","Fechado Ganho",{"v":1,"d":"100%"},{"v":44800,"d":"R$ 44,800"},{"v":44800,"d":"R$ 44,800"},null,null,"2026-07-26",18,"Encerrada"]
[null,null,"OP022","Lambda Metais","Licença ERP Corporate","Ana Ribeiro","Site","2026-06-01","Fechado Ganho",{"v":1,"d":"100%"},{"v":38400,"d":"R$ 38,400"},{"v":38400,"d":"R$ 38,400"},null,null,"2026-07-23",21,"Encerrada"]
[null,null,"OP023","Alfa Indústria Ltda","Plano Suporte Premium","Bruno Carvalho","Parceiro","2026-06-04","Fechado Ganho",{"v":1,"d":"100%"},{"v":10560,"d":"R$ 10,560"},{"v":10560,"d":"R$ 10,560"},null,null,"2026-07-19",25,"Encerrada"]
[null,null,"OP024","Beta Comércio SA","Consultoria Estratégica","Camila Souza","Outbound","2026-06-07","Fechado Ganho",{"v":1,"d":"100%"},{"v":33600,"d":"R$ 33,600"},{"v":33600,"d":"R$ 33,600"},null,null,"2026-07-14",30,"Encerrada"]
[null,null,"OP025","Gamma Tech","Licença ERP Corporate","Diego Martins","Indicação","2026-06-10","Fechado Ganho",{"v":1,"d":"100%"},{"v":49920,"d":"R$ 49,920"},{"v":49920,"d":"R$ 49,920"},null,null,"2026-07-10",34,"Encerrada"]
[null,null,"OP026","Delta Saúde","Plano Suporte Premium","Elisa Nogueira","Redes Sociais","2026-06-13","Fechado Ganho",{"v":1,"d":"100%"},{"v":13440,"d":"R$ 13,440"},{"v":13440,"d":"R$ 13,440"},null,null,"2026-07-03",41,"Encerrada"]
[null,null,"OP027","Epsilon Educação","Consultoria Estratégica","Fábio Lima","Inbound","2026-06-16","Fechado Perdido",{"v":0,"d":"0%"},{"v":42000,"d":"R$ 42,000"},0,null,null,"2026-06-26",48,"Encerrada"]
[null,null,"OP028","Zeta Agro","Licença ERP Corporate","Gabriela Pinto","Base Ativa","2026-06-19","Fechado Perdido",{"v":0,"d":"0%"},{"v":61440,"d":"R$ 61,440"},0,null,null,"2026-07-21",23,"Encerrada"]
[null,null,"OP029","Eta Serviços","Plano Suporte Premium","Ana Ribeiro","Evento","2026-06-22","Fechado Perdido",{"v":0,"d":"0%"},{"v":9600,"d":"R$ 9,600"},0,null,null,"2026-07-25",19,"Encerrada"]
[null,null,"OP030","Theta Financeira","Consultoria Estratégica","Bruno Carvalho","Site","2026-06-25","Cancelado",{"v":0,"d":"0%"},{"v":30800,"d":"R$ 30,800"},0,null,null,"2026-07-07",37,"Encerrada"]

{"sheet":"Vendas","index":6,"n_rows":32,"n_cols":13,"rows_kept":32,"hidden":true}
[]
[null,null,"REGISTRO DE VENDAS"]
[null,null,"Solução de Gestão de Operações Comerciais"]
[null,null,"Instruções","Dashboard","Vendedores","Clientes","Produtos","Pipeline","Vendas","Comissões","Forecast","Metas","Agenda"]
[]
[null,null,"Informe Valor e Desconto. Valor Líquido, Comissão % e Comissão são calculados automaticamente."]
[null,null,"Venda","Data","Cliente","Produto","Vendedor","Valor","Desconto","Valor Líquido","Comissão %","Comissão","Pago"]
[null,null,"VD001","2026-01-03","Alfa Indústria Ltda","Licença ERP Corporate","Ana Ribeiro",{"v":40800,"d":"R$ 40,800"},{"v":0,"d":"0.0%"},{"$f":"IFERROR(H8*(1-I8),0)","v":{"v":40800,"d":"R$ 40,800"}},{"$f":"IFERROR(VLOOKUP(F8,Produtos!$D$8:$G$17,4,FALSE),IFERROR(VLOOKUP(G8,Vendedores!$D$8:$F$15,3,FALSE),0))","v":{"v":0.05,"d":"5.0%"}},{"$f":"ROUND(J8*K8,2)","v":{"v":2040,"d":"R$ 2,040"}},"Sim"]
[null,null,"VD002","2026-01-10","Gamma Tech","Plano Suporte Básico","Bruno Carvalho",{"v":4416,"d":"R$ 4,416"},{"v":0,"d":"0.0%"},{"$f":"IFERROR(H9*(1-I9),0)","v":{"v":4416,"d":"R$ 4,416"}},{"$f":"IFERROR(VLOOKUP(F9,Produtos!$D$8:$G$17,4,FALSE),IFERROR(VLOOKUP(G9,Vendedores!$D$8:$F$15,3,FALSE),0))","v":{"v":0.06,"d":"6.0%"}},{"$f":"ROUND(J9*K9,2)","v":{"v":264.96,"d":"R$ 265"}},"Sim"]
[null,null,"VD003","2026-02-17","Epsilon Educação","Treinamento Equipe","Camila Souza",{"v":9405,"d":"R$ 9,405"},{"v":0.05,"d":"5.0%"},{"v":8934.75,"d":"R$ 8,935"},{"$f":"IFERROR(VLOOKUP(F10,Produtos!$D$8:$G$17,4,FALSE),IFERROR(VLOOKUP(G10,Vendedores!$D$8:$F$15,3,FALSE),0))","v":{"v":0.04,"d":"4.0%"}},{"v":357.39,"d":"R$ 357"},"Sim"]
[null,null,"VD004","2026-02-24","Eta Serviços","Plano Suporte Premium","Diego Martins",{"v":12720,"d":"R$ 12,720"},{"v":0,"d":"0.0%"},{"v":12720,"d":"R$ 12,720"},{"$f":"IFERROR(VLOOKUP(F11,Produtos!$D$8:$G$17,4,FALSE),IFERROR(VLOOKUP(G11,Vendedores!$D$8:$F$15,3,FALSE),0))","v":{"v":0.06,"d":"6.0%"}},{"v":763.2,"d":"R$ 763"},"Sim"]
[null,null,"VD005","2026-02-09","Iota Distribuidora","Consultoria Processos","Elisa Nogueira",{"v":24860,"d":"R$ 24,860"},{"v":0.1,"d":"10.0%"},{"v":22374,"d":"R$ 22,374"},{"$f":"IFERROR(VLOOKUP(F12,Produtos!$D$8:$G$17,4,FALSE),IFERROR(VLOOKUP(G12,Vendedores!$D$8:$F$15,3,FALSE),0))","v":{"v":0.08,"d":"8.0%"}},{"v":1789.92,"d":"R$ 1,790"},"Sim"]
[null,null,"VD006","2026-03-16","Lambda Metais","Implantação Técnica","Fábio Lima",{"v":31200,"d":"R$ 31,200"},{"v":0.03,"d":"3.0%"},{"v":30264,"d":"R$ 30,264"},{"$f":"IFERROR(VLOOKUP(F13,Produtos!$D$8:$G$17,4,FALSE),IFERROR(VLOOKUP(G13,Vendedores!$D$8:$F$15,3,FALSE),0))","v":{"v":0.04,"d":"4.0%"}},{"v":1210.56,"d":"R$ 1,211"},"Sim"]
[null,null,"VD007","2026-03-23","Beta Comércio SA","Consultoria Estratégica","Gabriela Pinto",{"v":29750,"d":"R$ 29,750"},{"v":0,"d":"0.0%"},{"v":29750,"d":"R$ 29,750"},{"$f":"IFERROR(VLOOKUP(F14,Produtos!$D$8:$G$17,4,FALSE),IFERROR(VLOOKUP(G14,Vendedores!$D$8:$F$15,3,FALSE),0))","v":{"v":0.08,"d":"8.0%"}},{"v":2380,"d":"R$ 2,380"},"Sim"]
[null,null,"VD008","2026-03-08","Delta Saúde","Licença ERP Starter","Ana Ribeiro",{"v":16560,"d":"R$ 16,560"},{"v":0.07,"d":"7.0%"},{"v":15400.8,"d":"R$ 15,401"},{"$f":"IFERROR(VLOOKUP(F15,Produtos!$D$8:$G$17,4,FALSE),IFERROR(VLOOKUP(G15,Vendedores!$D$8:$F$15,3,FALSE),0))","v":{"v":0.05,"d":"5.0%"}},{"v":770.04,"d":"R$ 770"},"Sim"]
[null,null,"VD009","2026-04-15","Zeta Agro","Assinatura BI Analytics","Bruno Carvalho",{"v":15444,"d":"R$ 15,444"},{"v":0.05,"d":"5.0%"},{"v":14671.8,"d":"R$ 14,672"},{"$f":"IFERROR(VLOOKUP(F16,Produtos!$D$8:$G$17,4,FALSE),IFERROR(VLOOKUP(G16,Vendedores!$D$8:$F$15,3,FALSE),0))","v":{"v":0.07,"d":"7.0%"}},{"v":1027.03,"d":"R$ 1,027"},"Sim"]
[null,null,"VD010","2026-04-22","Theta Financeira","Licença ERP Corporate","Camila Souza",{"v":50880,"d":"R$ 50,880"},{"v":0,"d":"0.0%"},{"v":50880,"d":"R$ 50,880"},{"$f":"IFERROR(VLOOKUP(F17,Produtos!$D$8:$G$17,4,FALSE),IFERROR(VLOOKUP(G17,Vendedores!$D$8:$F$15,3,FALSE),0))","v":{"v":0.05,"d":"5.0%"}},{"v":2544,"d":"R$ 2,544"},"Sim"]
[null,null,"VD011","2026-04-07","Kappa Logística","Plano Suporte Básico","Diego Martins",{"v":5424,"d":"R$ 5,424"},{"v":0,"d":"0.0%"},{"v":5424,"d":"R$ 5,424"},{"$f":"IFERROR(VLOOKUP(F18,Produtos!$D$8:$G$17,4,FALSE),IFERROR(VLOOKUP(G18,Vendedores!$D$8:$F$15,3,FALSE),0))","v":{"v":0.06,"d":"6.0%"}},{"v":325.44,"d":"R$ 325"},"Sim"]
[null,null,"VD012","2026-04-14","Alfa Indústria Ltda","Treinamento Equipe","Elisa Nogueira",{"v":11400,"d":"R$ 11,400"},{"v":0,"d":"0.0%"},{"v":11400,"d":"R$ 11,400"},{"$f":"IFERROR(VLOOKUP(F19,Produtos!$D$8:$G$17,4,FALSE),IFERROR(VLOOKUP(G19,Vendedores!$D$8:$F$15,3,FALSE),0))","v":{"v":0.04,"d":"4.0%"}},{"v":456,"d":"R$ 456"},"Sim"]
[null,null,"VD013","2026-05-21","Gamma Tech","Plano Suporte Premium","Fábio Lima",{"v":10200,"d":"R$ 10,200"},{"v":0.05,"d":"5.0%"},{"v":9690,"d":"R$ 9,690"},{"$f":"IFERROR(VLOOKUP(F20,Produtos!$D$8:$G$17,4,FALSE),IFERROR(VLOOKUP(G20,Vendedores!$D$8:$F$15,3,FALSE),0))","v":{"v":0.06,"d":"6.0%"}},{"v":581.4,"d":"R$ 581"},"Sim"]
[null,null,"VD014","2026-05-06","Epsilon Educação","Consultoria Processos","Gabriela Pinto",{"v":20240,"d":"R$ 20,240"},{"v":0,"d":"0.0%"},{"v":20240,"d":"R$ 20,240"},{"$f":"IFERROR(VLOOKUP(F21,Produtos!$D$8:$G$17,4,FALSE),IFERROR(VLOOKUP(G21,Vendedores!$D$8:$F$15,3,FALSE),0))","v":{"v":0.08,"d":"8.0%"}},{"v":1619.2,"d":"R$ 1,619"},"Sim"]
[null,null,"VD015","2026-05-13","Eta Serviços","Implantação Técnica","Ana Ribeiro",{"v":25740,"d":"R$ 25,740"},{"v":0.1,"d":"10.0%"},{"v":23166,"d":"R$ 23,166"},{"$f":"IFERROR(VLOOKUP(F22,Produtos!$D$8:$G$17,4,FALSE),IFERROR(VLOOKUP(G22,Vendedores!$D$8:$F$15,3,FALSE),0))","v":{"v":0.04,"d":"4.0%"}},{"v":926.64,"d":"R$ 927"},"Sim"]
[null,null,"VD016","2026-06-20","Iota Distribuidora","Consultoria Estratégica","Bruno Carvalho",{"v":37100,"d":"R$ 37,100"},{"v":0.03,"d":"3.0%"},{"v":35987,"d":"R$ 35,987"},{"$f":"IFERROR(VLOOKUP(F23,Produtos!$D$8:$G$17,4,FALSE),IFERROR(VLOOKUP(G23,Vendedores!$D$8:$F$15,3,FALSE),0))","v":{"v":0.08,"d":"8.0%"}},{"v":2878.96,"d":"R$ 2,879"},"Sim"]
[null,null,"VD017","2026-06-05","Lambda Metais","Licença ERP Starter","Camila Souza",{"v":20340,"d":"R$ 20,340"},{"v":0,"d":"0.0%"},{"v":20340,"d":"R$ 20,340"},{"$f":"IFERROR(VLOOKUP(F24,Produtos!$D$8:$G$17,4,FALSE),IFERROR(VLOOKUP(G24,Vendedores!$D$8:$F$15,3,FALSE),0))","v":{"v":0.05,"d":"5.0%"}},{"v":1017,"d":"R$ 1,017"},"Sim"]
[null,null,"VD018","2026-06-12","Beta Comércio SA","Assinatura BI Analytics","Diego Martins",{"v":18720,"d":"R$ 18,720"},{"v":0.07,"d":"7.0%"},{"v":17409.6,"d":"R$ 17,410"},{"$f":"IFERROR(VLOOKUP(F25,Produtos!$D$8:$G$17,4,FALSE),IFERROR(VLOOKUP(G25,Vendedores!$D$8:$F$15,3,FALSE),0))","v":{"v":0.07,"d":"7.0%"}},{"v":1218.67,"d":"R$ 1,219"},"Sim"]
[null,null,"VD019","2026-06-19","Delta Saúde","Licença ERP Corporate","Elisa Nogueira",{"v":40800,"d":"R$ 40,800"},{"v":0.05,"d":"5.0%"},{"v":38760,"d":"R$ 38,760"},{"$f":"IFERROR(VLOOKUP(F26,Produtos!$D$8:$G$17,4,FALSE),IFERROR(VLOOKUP(G26,Vendedores!$D$8:$F$15,3,FALSE),0))","v":{"v":0.05,"d":"5.0%"}},{"v":1938,"d":"R$ 1,938"},"Sim"]
[null,null,"VD020","2026-07-04","Zeta Agro","Plano Suporte Básico","Fábio Lima",{"v":4416,"d":"R$ 4,416"},{"v":0,"d":"0.0%"},{"v":4416,"d":"R$ 4,416"},{"$f":"IFERROR(VLOOKUP(F27,Produtos!$D$8:$G$17,4,FALSE),IFERROR(VLOOKUP(G27,Vendedores!$D$8:$F$15,3,FALSE),0))","v":{"v":0.06,"d":"6.0%"}},{"v":264.96,"d":"R$ 265"},"Sim"]
[null,null,"VD021","2026-07-11","Theta Financeira","Treinamento Equipe","Gabriela Pinto",{"v":9405,"d":"R$ 9,405"},{"v":0,"d":"0.0%"},{"v":9405,"d":"R$ 9,405"},{"$f":"IFERROR(VLOOKUP(F28,Produtos!$D$8:$G$17,4,FALSE),IFERROR(VLOOKUP(G28,Vendedores!$D$8:$F$15,3,FALSE),0))","v":{"v":0.04,"d":"4.0%"}},{"v":376.2,"d":"R$ 376"},"Não"]
[null,null,"VD022","2026-07-18","Kappa Logística","Plano Suporte Premium","Ana Ribeiro",{"v":12720,"d":"R$ 12,720"},{"v":0,"d":"0.0%"},{"v":12720,"d":"R$ 12,720"},{"$f":"IFERROR(VLOOKUP(F29,Produtos!$D$8:$G$17,4,FALSE),IFERROR(VLOOKUP(G29,Vendedores!$D$8:$F$15,3,FALSE),0))","v":{"v":0.06,"d":"6.0%"}},{"v":763.2,"d":"R$ 763"},"Não"]
[null,null,"VD023","2026-07-03","Alfa Indústria Ltda","Consultoria Processos","Bruno Carvalho",{"v":24860,"d":"R$ 24,860"},{"v":0.05,"d":"5.0%"},{"v":23617,"d":"R$ 23,617"},{"$f":"IFERROR(VLOOKUP(F30,Produtos!$D$8:$G$17,4,FALSE),IFERROR(VLOOKUP(G30,Vendedores!$D$8:$F$15,3,FALSE),0))","v":{"v":0.08,"d":"8.0%"}},{"v":1889.36,"d":"R$ 1,889"},"Não"]
[null,null,"VD024","2026-07-10","Gamma Tech","Implantação Técnica","Camila Souza",{"v":31200,"d":"R$ 31,200"},{"v":0,"d":"0.0%"},{"v":31200,"d":"R$ 31,200"},{"$f":"IFERROR(VLOOKUP(F31,Produtos!$D$8:$G$17,4,FALSE),IFERROR(VLOOKUP(G31,Vendedores!$D$8:$F$15,3,FALSE),0))","v":{"v":0.04,"d":"4.0%"}},{"v":1248,"d":"R$ 1,248"},"Não"]
[null,null,"VD025","2026-07-17","Epsilon Educação","Consultoria Estratégica","Diego Martins",{"v":29750,"d":"R$ 29,750"},{"v":0.1,"d":"10.0%"},{"v":26775,"d":"R$ 26,775"},{"$f":"IFERROR(VLOOKUP(F32,Produtos!$D$8:$G$17,4,FALSE),IFERROR(VLOOKUP(G32,Vendedores!$D$8:$F$15,3,FALSE),0))","v":{"v":0.08,"d":"8.0%"}},{"v":2142,"d":"R$ 2,142"},"Não"]

{"sheet":"Comissões","index":7,"n_rows":36,"n_cols":13,"rows_kept":36,"hidden":true,"merged":[[7,2,7,3],[7,4,7,5],[7,6,7,7],[8,2,8,3],[8,4,8,5],[8,6,8,7]]}
[]
[null,null,"CONTROLE DE COMISSÕES"]
[null,null,"Solução de Gestão de Operações Comerciais"]
[null,null,"Instruções","Dashboard","Vendedores","Clientes","Produtos","Pipeline","Vendas","Comissões","Forecast","Metas","Agenda"]
[]
[null,null,"INDICADORES DE COMISSÃO"]
[]
[null,null,"Comissão Total",null,"Comissão Paga",null,"Comissão Pendente"]
[null,null,{"$f":"IFERROR(SUM(E12:E36),0)","v":{"v":30792.130000000005,"d":"R$ 30,792"}},null,{"$f":"IFERROR(SUMIF(G12:G36,\"Pago\",E12:E36),0)","v":{"v":24373.370000000003,"d":"R$ 24,373"}},null,{"$f":"IFERROR(SUMIF(G12:G36,\"Pendente\",E12:E36),0)","v":{"v":6418.76,"d":"R$ 6,419"}}]
[]
[null,null,"Venda","Vendedor","Comissão","Data Pagamento","Status","Observações"]
[null,null,{"$f":"IFERROR(Vendas!C8,\"\")","v":"VD001"},{"$f":"IFERROR(Vendas!G8,\"\")","v":"Ana Ribeiro"},{"$f":"IFERROR(Vendas!L8,0)","v":{"v":2040,"d":"R$ 2,040"}},{"$f":"IF(Vendas!M8=\"Sim\",Vendas!D8+30,\"\")","v":"2026-02-02"},{"$f":"IF(Vendas!M8=\"Sim\",\"Pago\",\"Pendente\")","v":"Pago"},{"$f":"IF(Vendas!M8=\"Sim\",\"Comissão liquidada\",\"Aguardando liquidação da venda\")","v":"Comissão liquidada"}]
[null,null,{"$f":"IFERROR(Vendas!C9,\"\")","v":"VD002"},{"$f":"IFERROR(Vendas!G9,\"\")","v":"Bruno Carvalho"},{"$f":"IFERROR(Vendas!L9,0)","v":{"v":264.96,"d":"R$ 265"}},{"$f":"IF(Vendas!M9=\"Sim\",Vendas!D9+30,\"\")","v":"2026-02-09"},{"$f":"IF(Vendas!M9=\"Sim\",\"Pago\",\"Pendente\")","v":"Pago"},{"$f":"IF(Vendas!M9=\"Sim\",\"Comissão liquidada\",\"Aguardando liquidação da venda\")","v":"Comissão liquidada"}]
[null,null,{"$f":"IFERROR(Vendas!C10,\"\")","v":"VD003"},{"$f":"IFERROR(Vendas!G10,\"\")","v":"Camila Souza"},{"$f":"IFERROR(Vendas!L10,0)","v":{"v":357.39,"d":"R$ 357"}},{"$f":"IF(Vendas!M10=\"Sim\",Vendas!D10+30,\"\")","v":"2026-03-19"},{"$f":"IF(Vendas!M10=\"Sim\",\"Pago\",\"Pendente\")","v":"Pago"},{"$f":"IF(Vendas!M10=\"Sim\",\"Comissão liquidada\",\"Aguardando liquidação da venda\")","v":"Comissão liquidada"}]
[null,null,{"$f":"IFERROR(Vendas!C11,\"\")","v":"VD004"},{"$f":"IFERROR(Vendas!G11,\"\")","v":"Diego Martins"},{"$f":"IFERROR(Vendas!L11,0)","v":{"v":763.2,"d":"R$ 763"}},{"$f":"IF(Vendas!M11=\"Sim\",Vendas!D11+30,\"\")","v":"2026-03-26"},{"$f":"IF(Vendas!M11=\"Sim\",\"Pago\",\"Pendente\")","v":"Pago"},{"$f":"IF(Vendas!M11=\"Sim\",\"Comissão liquidada\",\"Aguardando liquidação da venda\")","v":"Comissão liquidada"}]
[null,null,{"$f":"IFERROR(Vendas!C12,\"\")","v":"VD005"},{"$f":"IFERROR(Vendas!G12,\"\")","v":"Elisa Nogueira"},{"$f":"IFERROR(Vendas!L12,0)","v":{"v":1789.92,"d":"R$ 1,790"}},{"$f":"IF(Vendas!M12=\"Sim\",Vendas!D12+30,\"\")","v":"2026-03-11"},{"$f":"IF(Vendas!M12=\"Sim\",\"Pago\",\"Pendente\")","v":"Pago"},{"$f":"IF(Vendas!M12=\"Sim\",\"Comissão liquidada\",\"Aguardando liquidação da venda\")","v":"Comissão liquidada"}]
[null,null,{"$f":"IFERROR(Vendas!C13,\"\")","v":"VD006"},{"$f":"IFERROR(Vendas!G13,\"\")","v":"Fábio Lima"},{"$f":"IFERROR(Vendas!L13,0)","v":{"v":1210.56,"d":"R$ 1,211"}},{"$f":"IF(Vendas!M13=\"Sim\",Vendas!D13+30,\"\")","v":"2026-04-15"},{"$f":"IF(Vendas!M13=\"Sim\",\"Pago\",\"Pendente\")","v":"Pago"},{"$f":"IF(Vendas!M13=\"Sim\",\"Comissão liquidada\",\"Aguardando liquidação da venda\")","v":"Comissão liquidada"}]
[null,null,{"$f":"IFERROR(Vendas!C14,\"\")","v":"VD007"},{"$f":"IFERROR(Vendas!G14,\"\")","v":"Gabriela Pinto"},{"$f":"IFERROR(Vendas!L14,0)","v":{"v":2380,"d":"R$ 2,380"}},{"$f":"IF(Vendas!M14=\"Sim\",Vendas!D14+30,\"\")","v":"2026-04-22"},{"$f":"IF(Vendas!M14=\"Sim\",\"Pago\",\"Pendente\")","v":"Pago"},{"$f":"IF(Vendas!M14=\"Sim\",\"Comissão liquidada\",\"Aguardando liquidação da venda\")","v":"Comissão liquidada"}]
[null,null,{"$f":"IFERROR(Vendas!C15,\"\")","v":"VD008"},{"$f":"IFERROR(Vendas!G15,\"\")","v":"Ana Ribeiro"},{"$f":"IFERROR(Vendas!L15,0)","v":{"v":770.04,"d":"R$ 770"}},{"$f":"IF(Vendas!M15=\"Sim\",Vendas!D15+30,\"\")","v":"2026-04-07"},{"$f":"IF(Vendas!M15=\"Sim\",\"Pago\",\"Pendente\")","v":"Pago"},{"$f":"IF(Vendas!M15=\"Sim\",\"Comissão liquidada\",\"Aguardando liquidação da venda\")","v":"Comissão liquidada"}]
[null,null,{"$f":"IFERROR(Vendas!C16,\"\")","v":"VD009"},{"$f":"IFERROR(Vendas!G16,\"\")","v":"Bruno Carvalho"},{"$f":"IFERROR(Vendas!L16,0)","v":{"v":1027.03,"d":"R$ 1,027"}},{"$f":"IF(Vendas!M16=\"Sim\",Vendas!D16+30,\"\")","v":"2026-05-15"},{"$f":"IF(Vendas!M16=\"Sim\",\"Pago\",\"Pendente\")","v":"Pago"},{"$f":"IF(Vendas!M16=\"Sim\",\"Comissão liquidada\",\"Aguardando liquidação da venda\")","v":"Comissão liquidada"}]
[null,null,{"$f":"IFERROR(Vendas!C17,\"\")","v":"VD010"},{"$f":"IFERROR(Vendas!G17,\"\")","v":"Camila Souza"},{"$f":"IFERROR(Vendas!L17,0)","v":{"v":2544,"d":"R$ 2,544"}},{"$f":"IF(Vendas!M17=\"Sim\",Vendas!D17+30,\"\")","v":"2026-05-22"},{"$f":"IF(Vendas!M17=\"Sim\",\"Pago\",\"Pendente\")","v":"Pago"},{"$f":"IF(Vendas!M17=\"Sim\",\"Comissão liquidada\",\"Aguardando liquidação da venda\")","v":"Comissão liquidada"}]
[null,null,{"$f":"IFERROR(Vendas!C18,\"\")","v":"VD011"},{"$f":"IFERROR(Vendas!G18,\"\")","v":"Diego Martins"},{"$f":"IFERROR(Vendas!L18,0)","v":{"v":325.44,"d":"R$ 325"}},{"$f":"IF(Vendas!M18=\"Sim\",Vendas!D18+30,\"\")","v":"2026-05-07"},{"$f":"IF(Vendas!M18=\"Sim\",\"Pago\",\"Pendente\")","v":"Pago"},{"$f":"IF(Vendas!M18=\"Sim\",\"Comissão liquidada\",\"Aguardando liquidação da venda\")","v":"Comissão liquidada"}]
[null,null,{"$f":"IFERROR(Vendas!C19,\"\")","v":"VD012"},{"$f":"IFERROR(Vendas!G19,\"\")","v":"Elisa Nogueira"},{"$f":"IFERROR(Vendas!L19,0)","v":{"v":456,"d":"R$ 456"}},{"$f":"IF(Vendas!M19=\"Sim\",Vendas!D19+30,\"\")","v":"2026-05-14"},{"$f":"IF(Vendas!M19=\"Sim\",\"Pago\",\"Pendente\")","v":"Pago"},{"$f":"IF(Vendas!M19=\"Sim\",\"Comissão liquidada\",\"Aguardando liquidação da venda\")","v":"Comissão liquidada"}]
[null,null,{"$f":"IFERROR(Vendas!C20,\"\")","v":"VD013"},{"$f":"IFERROR(Vendas!G20,\"\")","v":"Fábio Lima"},{"$f":"IFERROR(Vendas!L20,0)","v":{"v":581.4,"d":"R$ 581"}},{"$f":"IF(Vendas!M20=\"Sim\",Vendas!D20+30,\"\")","v":"2026-06-20"},{"$f":"IF(Vendas!M20=\"Sim\",\"Pago\",\"Pendente\")","v":"Pago"},{"$f":"IF(Vendas!M20=\"Sim\",\"Comissão liquidada\",\"Aguardando liquidação da venda\")","v":"Comissão liquidada"}]
[null,null,{"$f":"IFERROR(Vendas!C21,\"\")","v":"VD014"},{"$f":"IFERROR(Vendas!G21,\"\")","v":"Gabriela Pinto"},{"$f":"IFERROR(Vendas!L21,0)","v":{"v":1619.2,"d":"R$ 1,619"}},{"$f":"IF(Vendas!M21=\"Sim\",Vendas!D21+30,\"\")","v":"2026-06-05"},{"$f":"IF(Vendas!M21=\"Sim\",\"Pago\",\"Pendente\")","v":"Pago"},{"$f":"IF(Vendas!M21=\"Sim\",\"Comissão liquidada\",\"Aguardando liquidação da venda\")","v":"Comissão liquidada"}]
[null,null,{"$f":"IFERROR(Vendas!C22,\"\")","v":"VD015"},{"$f":"IFERROR(Vendas!G22,\"\")","v":"Ana Ribeiro"},{"$f":"IFERROR(Vendas!L22,0)","v":{"v":926.64,"d":"R$ 927"}},{"$f":"IF(Vendas!M22=\"Sim\",Vendas!D22+30,\"\")","v":"2026-06-12"},{"$f":"IF(Vendas!M22=\"Sim\",\"Pago\",\"Pendente\")","v":"Pago"},{"$f":"IF(Vendas!M22=\"Sim\",\"Comissão liquidada\",\"Aguardando liquidação da venda\")","v":"Comissão liquidada"}]
[null,null,{"$f":"IFERROR(Vendas!C23,\"\")","v":"VD016"},{"$f":"IFERROR(Vendas!G23,\"\")","v":"Bruno Carvalho"},{"$f":"IFERROR(Vendas!L23,0)","v":{"v":2878.96,"d":"R$ 2,879"}},{"$f":"IF(Vendas!M23=\"Sim\",Vendas!D23+30,\"\")","v":"2026-07-20"},{"$f":"IF(Vendas!M23=\"Sim\",\"Pago\",\"Pendente\")","v":"Pago"},{"$f":"IF(Vendas!M23=\"Sim\",\"Comissão liquidada\",\"Aguardando liquidação da venda\")","v":"Comissão liquidada"}]
[null,null,{"$f":"IFERROR(Vendas!C24,\"\")","v":"VD017"},{"$f":"IFERROR(Vendas!G24,\"\")","v":"Camila Souza"},{"$f":"IFERROR(Vendas!L24,0)","v":{"v":1017,"d":"R$ 1,017"}},{"$f":"IF(Vendas!M24=\"Sim\",Vendas!D24+30,\"\")","v":"2026-07-05"},{"$f":"IF(Vendas!M24=\"Sim\",\"Pago\",\"Pendente\")","v":"Pago"},{"$f":"IF(Vendas!M24=\"Sim\",\"Comissão liquidada\",\"Aguardando liquidação da venda\")","v":"Comissão liquidada"}]
[null,null,{"$f":"IFERROR(Vendas!C25,\"\")","v":"VD018"},{"$f":"IFERROR(Vendas!G25,\"\")","v":"Diego Martins"},{"$f":"IFERROR(Vendas!L25,0)","v":{"v":1218.67,"d":"R$ 1,219"}},{"$f":"IF(Vendas!M25=\"Sim\",Vendas!D25+30,\"\")","v":"2026-07-12"},{"$f":"IF(Vendas!M25=\"Sim\",\"Pago\",\"Pendente\")","v":"Pago"},{"$f":"IF(Vendas!M25=\"Sim\",\"Comissão liquidada\",\"Aguardando liquidação da venda\")","v":"Comissão liquidada"}]
[null,null,{"$f":"IFERROR(Vendas!C26,\"\")","v":"VD019"},{"$f":"IFERROR(Vendas!G26,\"\")","v":"Elisa Nogueira"},{"$f":"IFERROR(Vendas!L26,0)","v":{"v":1938,"d":"R$ 1,938"}},{"$f":"IF(Vendas!M26=\"Sim\",Vendas!D26+30,\"\")","v":"2026-07-19"},{"$f":"IF(Vendas!M26=\"Sim\",\"Pago\",\"Pendente\")","v":"Pago"},{"$f":"IF(Vendas!M26=\"Sim\",\"Comissão liquidada\",\"Aguardando liquidação da venda\")","v":"Comissão liquidada"}]
[null,null,{"$f":"IFERROR(Vendas!C27,\"\")","v":"VD020"},{"$f":"IFERROR(Vendas!G27,\"\")","v":"Fábio Lima"},{"$f":"IFERROR(Vendas!L27,0)","v":{"v":264.96,"d":"R$ 265"}},{"$f":"IF(Vendas!M27=\"Sim\",Vendas!D27+30,\"\")","v":"2026-08-03"},{"$f":"IF(Vendas!M27=\"Sim\",\"Pago\",\"Pendente\")","v":"Pago"},{"$f":"IF(Vendas!M27=\"Sim\",\"Comissão liquidada\",\"Aguardando liquidação da venda\")","v":"Comissão liquidada"}]
[null,null,{"$f":"IFERROR(Vendas!C28,\"\")","v":"VD021"},{"$f":"IFERROR(Vendas!G28,\"\")","v":"Gabriela Pinto"},{"$f":"IFERROR(Vendas!L28,0)","v":{"v":376.2,"d":"R$ 376"}},{"$f":"IF(Vendas!M28=\"Sim\",Vendas!D28+30,\"\")","v":""},{"$f":"IF(Vendas!M28=\"Sim\",\"Pago\",\"Pendente\")","v":"Pendente"},{"$f":"IF(Vendas!M28=\"Sim\",\"Comissão liquidada\",\"Aguardando liquidação da venda\")","v":"Aguardando liquidação da venda"}]
[null,null,{"$f":"IFERROR(Vendas!C29,\"\")","v":"VD022"},{"$f":"IFERROR(Vendas!G29,\"\")","v":"Ana Ribeiro"},{"$f":"IFERROR(Vendas!L29,0)","v":{"v":763.2,"d":"R$ 763"}},{"$f":"IF(Vendas!M29=\"Sim\",Vendas!D29+30,\"\")","v":""},{"$f":"IF(Vendas!M29=\"Sim\",\"Pago\",\"Pendente\")","v":"Pendente"},{"$f":"IF(Vendas!M29=\"Sim\",\"Comissão liquidada\",\"Aguardando liquidação da venda\")","v":"Aguardando liquidação da venda"}]
[null,null,{"$f":"IFERROR(Vendas!C30,\"\")","v":"VD023"},{"$f":"IFERROR(Vendas!G30,\"\")","v":"Bruno Carvalho"},{"$f":"IFERROR(Vendas!L30,0)","v":{"v":1889.36,"d":"R$ 1,889"}},{"$f":"IF(Vendas!M30=\"Sim\",Vendas!D30+30,\"\")","v":""},{"$f":"IF(Vendas!M30=\"Sim\",\"Pago\",\"Pendente\")","v":"Pendente"},{"$f":"IF(Vendas!M30=\"Sim\",\"Comissão liquidada\",\"Aguardando liquidação da venda\")","v":"Aguardando liquidação da venda"}]
[null,null,{"$f":"IFERROR(Vendas!C31,\"\")","v":"VD024"},{"$f":"IFERROR(Vendas!G31,\"\")","v":"Camila Souza"},{"$f":"IFERROR(Vendas!L31,0)","v":{"v":1248,"d":"R$ 1,248"}},{"$f":"IF(Vendas!M31=\"Sim\",Vendas!D31+30,\"\")","v":""},{"$f":"IF(Vendas!M31=\"Sim\",\"Pago\",\"Pendente\")","v":"Pendente"},{"$f":"IF(Vendas!M31=\"Sim\",\"Comissão liquidada\",\"Aguardando liquidação da venda\")","v":"Aguardando liquidação da venda"}]
[null,null,{"$f":"IFERROR(Vendas!C32,\"\")","v":"VD025"},{"$f":"IFERROR(Vendas!G32,\"\")","v":"Diego Martins"},{"$f":"IFERROR(Vendas!L32,0)","v":{"v":2142,"d":"R$ 2,142"}},{"$f":"IF(Vendas!M32=\"Sim\",Vendas!D32+30,\"\")","v":""},{"$f":"IF(Vendas!M32=\"Sim\",\"Pago\",\"Pendente\")","v":"Pendente"},{"$f":"IF(Vendas!M32=\"Sim\",\"Comissão liquidada\",\"Aguardando liquidação da venda\")","v":"Aguardando liquidação da venda"}]

{"sheet":"Forecast","index":8,"n_rows":37,"n_cols":13,"rows_kept":37,"hidden":true}
[]
[null,null,"FORECAST COMERCIAL"]
[null,null,"Solução de Gestão de Operações Comerciais"]
[null,null,"Instruções","Dashboard","Vendedores","Clientes","Produtos","Pipeline","Vendas","Comissões","Forecast","Metas","Agenda"]
[]
[null,null,"Aba automática. Espelha as oportunidades em aberto do Pipeline. Não editar."]
[null,null,"Oportunidade","Cliente","Valor","Probabilidade","Valor Ponderado","Mês Previsto",null,"RESUMO DO FORECAST"]
[null,null,{"$f":"IF(OR(Pipeline!I8=\"Fechado Ganho\",Pipeline!I8=\"Fechado Perdido\",Pipeline!I8=\"Cancelado\",Pipeline!C8=\"\"),\"\",Pipeline!C8)","v":"OP001"},{"$f":"IF($C8=\"\",\"\",Pipeline!D8)","v":"Alfa Indústria Ltda"},{"$f":"IF($C8=\"\",\"\",Pipeline!K8)","v":{"v":38400,"d":"R$ 38,400"}},{"$f":"IF($C8=\"\",\"\",Pipeline!J8)","v":{"v":0.1,"d":"10%"}},{"$f":"IF($C8=\"\",\"\",E8*F8)","v":{"v":3840,"d":"R$ 3,840"}},{"$f":"IF($C8=\"\",\"\",IFERROR(CHOOSE(MONTH(Pipeline!N8),\"jan\",\"fev\",\"mar\",\"abr\",\"mai\",\"jun\",\"jul\",\"ago\",\"set\",\"out\",\"nov\",\"dez\")&\"/\"&TEXT(YEAR(Pipeline!N8)-2000,\"00\"),\"\"))","v":"nov/26"}]
[null,null,{"$f":"IF(OR(Pipeline!I9=\"Fechado Ganho\",Pipeline!I9=\"Fechado Perdido\",Pipeline!I9=\"Cancelado\",Pipeline!C9=\"\"),\"\",Pipeline!C9)","v":"OP002"},{"$f":"IF($C9=\"\",\"\",Pipeline!D9)","v":"Beta Comércio SA"},{"$f":"IF($C9=\"\",\"\",Pipeline!K9)","v":{"v":10560,"d":"R$ 10,560"}},{"$f":"IF($C9=\"\",\"\",Pipeline!J9)","v":{"v":0.1,"d":"10%"}},{"v":1056,"d":"R$ 1,056"},{"$f":"IF($C9=\"\",\"\",IFERROR(CHOOSE(MONTH(Pipeline!N9),\"jan\",\"fev\",\"mar\",\"abr\",\"mai\",\"jun\",\"jul\",\"ago\",\"set\",\"out\",\"nov\",\"dez\")&\"/\"&TEXT(YEAR(Pipeline!N9)-2000,\"00\"),\"\"))","v":"dez/26"},null,"Forecast Total (bruto)",null,{"$f":"IFERROR(SUM(E8:E37),0)","v":{"v":578640,"d":"R$ 578,640"}}]
[null,null,{"$f":"IF(OR(Pipeline!I10=\"Fechado Ganho\",Pipeline!I10=\"Fechado Perdido\",Pipeline!I10=\"Cancelado\",Pipeline!C10=\"\"),\"\",Pipeline!C10)","v":"OP003"},{"$f":"IF($C10=\"\",\"\",Pipeline!D10)","v":"Gamma Tech"},{"$f":"IF($C10=\"\",\"\",Pipeline!K10)","v":{"v":33600,"d":"R$ 33,600"}},{"$f":"IF($C10=\"\",\"\",Pipeline!J10)","v":{"v":0.1,"d":"10%"}},{"v":3360,"d":"R$ 3,360"},{"$f":"IF($C10=\"\",\"\",IFERROR(CHOOSE(MONTH(Pipeline!N10),\"jan\",\"fev\",\"mar\",\"abr\",\"mai\",\"jun\",\"jul\",\"ago\",\"set\",\"out\",\"nov\",\"dez\")&\"/\"&TEXT(YEAR(Pipeline!N10)-2000,\"00\"),\"\"))","v":"nov/26"},null,"Forecast Ponderado",null,{"$f":"IFERROR(SUM(G8:G37),0)","v":{"v":214528,"d":"R$ 214,528"}}]
[null,null,{"$f":"IF(OR(Pipeline!I11=\"Fechado Ganho\",Pipeline!I11=\"Fechado Perdido\",Pipeline!I11=\"Cancelado\",Pipeline!C11=\"\"),\"\",Pipeline!C11)","v":"OP004"},{"$f":"IF($C11=\"\",\"\",Pipeline!D11)","v":"Delta Saúde"},{"$f":"IF($C11=\"\",\"\",Pipeline!K11)","v":{"v":49920,"d":"R$ 49,920"}},{"$f":"IF($C11=\"\",\"\",Pipeline!J11)","v":{"v":0.1,"d":"10%"}},{"v":4992,"d":"R$ 4,992"},{"$f":"IF($C11=\"\",\"\",IFERROR(CHOOSE(MONTH(Pipeline!N11),\"jan\",\"fev\",\"mar\",\"abr\",\"mai\",\"jun\",\"jul\",\"ago\",\"set\",\"out\",\"nov\",\"dez\")&\"/\"&TEXT(YEAR(Pipeline!N11)-2000,\"00\"),\"\"))","v":"dez/26"},null,"Forecast Otimista (x1,20)",null,{"$f":"L10*1.2","v":{"v":257433.59999999998,"d":"R$ 257,434"}}]
[null,null,{"$f":"IF(OR(Pipeline!I12=\"Fechado Ganho\",Pipeline!I12=\"Fechado Perdido\",Pipeline!I12=\"Cancelado\",Pipeline!C12=\"\"),\"\",Pipeline!C12)","v":"OP005"},{"$f":"IF($C12=\"\",\"\",Pipeline!D12)","v":"Epsilon Educação"},{"$f":"IF($C12=\"\",\"\",Pipeline!K12)","v":{"v":13440,"d":"R$ 13,440"}},{"$f":"IF($C12=\"\",\"\",Pipeline!J12)","v":{"v":0.2,"d":"20%"}},{"v":2688,"d":"R$ 2,688"},{"$f":"IF($C12=\"\",\"\",IFERROR(CHOOSE(MONTH(Pipeline!N12),\"jan\",\"fev\",\"mar\",\"abr\",\"mai\",\"jun\",\"jul\",\"ago\",\"set\",\"out\",\"nov\",\"dez\")&\"/\"&TEXT(YEAR(Pipeline!N12)-2000,\"00\"),\"\"))","v":"nov/26"},null,"Forecast Conservador (x0,70)",null,{"$f":"L10*0.7","v":{"v":150169.59999999998,"d":"R$ 150,170"}}]
[null,null,{"$f":"IF(OR(Pipeline!I13=\"Fechado Ganho\",Pipeline!I13=\"Fechado Perdido\",Pipeline!I13=\"Cancelado\",Pipeline!C13=\"\"),\"\",Pipeline!C13)","v":"OP006"},{"$f":"IF($C13=\"\",\"\",Pipeline!D13)","v":"Zeta Agro"},{"$f":"IF($C13=\"\",\"\",Pipeline!K13)","v":{"v":42000,"d":"R$ 42,000"}},{"$f":"IF($C13=\"\",\"\",Pipeline!J13)","v":{"v":0.2,"d":"20%"}},{"v":8400,"d":"R$ 8,400"},{"$f":"IF($C13=\"\",\"\",IFERROR(CHOOSE(MONTH(Pipeline!N13),\"jan\",\"fev\",\"mar\",\"abr\",\"mai\",\"jun\",\"jul\",\"ago\",\"set\",\"out\",\"nov\",\"dez\")&\"/\"&TEXT(YEAR(Pipeline!N13)-2000,\"00\"),\"\"))","v":"nov/26"},null,"Qtd. Oportunidades Abertas",null,{"$f":"COUNTIF(C8:C37,\"OP*\")","v":18}]
[null,null,{"$f":"IF(OR(Pipeline!I14=\"Fechado Ganho\",Pipeline!I14=\"Fechado Perdido\",Pipeline!I14=\"Cancelado\",Pipeline!C14=\"\"),\"\",Pipeline!C14)","v":"OP007"},{"$f":"IF($C14=\"\",\"\",Pipeline!D14)","v":"Eta Serviços"},{"$f":"IF($C14=\"\",\"\",Pipeline!K14)","v":{"v":61440,"d":"R$ 61,440"}},{"$f":"IF($C14=\"\",\"\",Pipeline!J14)","v":{"v":0.2,"d":"20%"}},{"v":12288,"d":"R$ 12,288"},{"$f":"IF($C14=\"\",\"\",IFERROR(CHOOSE(MONTH(Pipeline!N14),\"jan\",\"fev\",\"mar\",\"abr\",\"mai\",\"jun\",\"jul\",\"ago\",\"set\",\"out\",\"nov\",\"dez\")&\"/\"&TEXT(YEAR(Pipeline!N14)-2000,\"00\"),\"\"))","v":"nov/26"}]
[null,null,{"$f":"IF(OR(Pipeline!I15=\"Fechado Ganho\",Pipeline!I15=\"Fechado Perdido\",Pipeline!I15=\"Cancelado\",Pipeline!C15=\"\"),\"\",Pipeline!C15)","v":"OP008"},{"$f":"IF($C15=\"\",\"\",Pipeline!D15)","v":"Theta Financeira"},{"$f":"IF($C15=\"\",\"\",Pipeline!K15)","v":{"v":9600,"d":"R$ 9,600"}},{"$f":"IF($C15=\"\",\"\",Pipeline!J15)","v":{"v":0.2,"d":"20%"}},{"v":1920,"d":"R$ 1,920"},{"$f":"IF($C15=\"\",\"\",IFERROR(CHOOSE(MONTH(Pipeline!N15),\"jan\",\"fev\",\"mar\",\"abr\",\"mai\",\"jun\",\"jul\",\"ago\",\"set\",\"out\",\"nov\",\"dez\")&\"/\"&TEXT(YEAR(Pipeline!N15)-2000,\"00\"),\"\"))","v":"nov/26"}]
[null,null,{"$f":"IF(OR(Pipeline!I16=\"Fechado Ganho\",Pipeline!I16=\"Fechado Perdido\",Pipeline!I16=\"Cancelado\",Pipeline!C16=\"\"),\"\",Pipeline!C16)","v":"OP009"},{"$f":"IF($C16=\"\",\"\",Pipeline!D16)","v":"Iota Distribuidora"},{"$f":"IF($C16=\"\",\"\",Pipeline!K16)","v":{"v":30800,"d":"R$ 30,800"}},{"$f":"IF($C16=\"\",\"\",Pipeline!J16)","v":{"v":0.35,"d":"35%"}},{"v":10780,"d":"R$ 10,780"},{"$f":"IF($C16=\"\",\"\",IFERROR(CHOOSE(MONTH(Pipeline!N16),\"jan\",\"fev\",\"mar\",\"abr\",\"mai\",\"jun\",\"jul\",\"ago\",\"set\",\"out\",\"nov\",\"dez\")&\"/\"&TEXT(YEAR(Pipeline!N16)-2000,\"00\"),\"\"))","v":"out/26"}]
[null,null,{"$f":"IF(OR(Pipeline!I17=\"Fechado Ganho\",Pipeline!I17=\"Fechado Perdido\",Pipeline!I17=\"Cancelado\",Pipeline!C17=\"\"),\"\",Pipeline!C17)","v":"OP010"},{"$f":"IF($C17=\"\",\"\",Pipeline!D17)","v":"Kappa Logística"},{"$f":"IF($C17=\"\",\"\",Pipeline!K17)","v":{"v":46080,"d":"R$ 46,080"}},{"$f":"IF($C17=\"\",\"\",Pipeline!J17)","v":{"v":0.35,"d":"35%"}},{"v":16127.999999999998,"d":"R$ 16,128"},{"$f":"IF($C17=\"\",\"\",IFERROR(CHOOSE(MONTH(Pipeline!N17),\"jan\",\"fev\",\"mar\",\"abr\",\"mai\",\"jun\",\"jul\",\"ago\",\"set\",\"out\",\"nov\",\"dez\")&\"/\"&TEXT(YEAR(Pipeline!N17)-2000,\"00\"),\"\"))","v":"out/26"}]
[null,null,{"$f":"IF(OR(Pipeline!I18=\"Fechado Ganho\",Pipeline!I18=\"Fechado Perdido\",Pipeline!I18=\"Cancelado\",Pipeline!C18=\"\"),\"\",Pipeline!C18)","v":"OP011"},{"$f":"IF($C18=\"\",\"\",Pipeline!D18)","v":"Lambda Metais"},{"$f":"IF($C18=\"\",\"\",Pipeline!K18)","v":{"v":12480,"d":"R$ 12,480"}},{"$f":"IF($C18=\"\",\"\",Pipeline!J18)","v":{"v":0.35,"d":"35%"}},{"v":4368,"d":"R$ 4,368"},{"$f":"IF($C18=\"\",\"\",IFERROR(CHOOSE(MONTH(Pipeline!N18),\"jan\",\"fev\",\"mar\",\"abr\",\"mai\",\"jun\",\"jul\",\"ago\",\"set\",\"out\",\"nov\",\"dez\")&\"/\"&TEXT(YEAR(Pipeline!N18)-2000,\"00\"),\"\"))","v":"out/26"}]
[null,null,{"$f":"IF(OR(Pipeline!I19=\"Fechado Ganho\",Pipeline!I19=\"Fechado Perdido\",Pipeline!I19=\"Cancelado\",Pipeline!C19=\"\"),\"\",Pipeline!C19)","v":"OP012"},{"$f":"IF($C19=\"\",\"\",Pipeline!D19)","v":"Alfa Indústria Ltda"},{"$f":"IF($C19=\"\",\"\",Pipeline!K19)","v":{"v":39200,"d":"R$ 39,200"}},{"$f":"IF($C19=\"\",\"\",Pipeline!J19)","v":{"v":0.55,"d":"55%"}},{"v":21560,"d":"R$ 21,560"},{"$f":"IF($C19=\"\",\"\",IFERROR(CHOOSE(MONTH(Pipeline!N19),\"jan\",\"fev\",\"mar\",\"abr\",\"mai\",\"jun\",\"jul\",\"ago\",\"set\",\"out\",\"nov\",\"dez\")&\"/\"&TEXT(YEAR(Pipeline!N19)-2000,\"00\"),\"\"))","v":"set/26"}]
[null,null,{"$f":"IF(OR(Pipeline!I20=\"Fechado Ganho\",Pipeline!I20=\"Fechado Perdido\",Pipeline!I20=\"Cancelado\",Pipeline!C20=\"\"),\"\",Pipeline!C20)","v":"OP013"},{"$f":"IF($C20=\"\",\"\",Pipeline!D20)","v":"Beta Comércio SA"},{"$f":"IF($C20=\"\",\"\",Pipeline!K20)","v":{"v":57600,"d":"R$ 57,600"}},{"$f":"IF($C20=\"\",\"\",Pipeline!J20)","v":{"v":0.55,"d":"55%"}},{"v":31680.000000000004,"d":"R$ 31,680"},{"$f":"IF($C20=\"\",\"\",IFERROR(CHOOSE(MONTH(Pipeline!N20),\"jan\",\"fev\",\"mar\",\"abr\",\"mai\",\"jun\",\"jul\",\"ago\",\"set\",\"out\",\"nov\",\"dez\")&\"/\"&TEXT(YEAR(Pipeline!N20)-2000,\"00\"),\"\"))","v":"set/26"}]
[null,null,{"$f":"IF(OR(Pipeline!I21=\"Fechado Ganho\",Pipeline!I21=\"Fechado Perdido\",Pipeline!I21=\"Cancelado\",Pipeline!C21=\"\"),\"\",Pipeline!C21)","v":"OP014"},{"$f":"IF($C21=\"\",\"\",Pipeline!D21)","v":"Gamma Tech"},{"$f":"IF($C21=\"\",\"\",Pipeline!K21)","v":{"v":15360,"d":"R$ 15,360"}},{"$f":"IF($C21=\"\",\"\",Pipeline!J21)","v":{"v":0.55,"d":"55%"}},{"v":8448,"d":"R$ 8,448"},{"$f":"IF($C21=\"\",\"\",IFERROR(CHOOSE(MONTH(Pipeline!N21),\"jan\",\"fev\",\"mar\",\"abr\",\"mai\",\"jun\",\"jul\",\"ago\",\"set\",\"out\",\"nov\",\"dez\")&\"/\"&TEXT(YEAR(Pipeline!N21)-2000,\"00\"),\"\"))","v":"set/26"}]
[null,null,{"$f":"IF(OR(Pipeline!I22=\"Fechado Ganho\",Pipeline!I22=\"Fechado Perdido\",Pipeline!I22=\"Cancelado\",Pipeline!C22=\"\"),\"\",Pipeline!C22)","v":"OP015"},{"$f":"IF($C22=\"\",\"\",Pipeline!D22)","v":"Delta Saúde"},{"$f":"IF($C22=\"\",\"\",Pipeline!K22)","v":{"v":28000,"d":"R$ 28,000"}},{"$f":"IF($C22=\"\",\"\",Pipeline!J22)","v":{"v":0.55,"d":"55%"}},{"v":15400.000000000002,"d":"R$ 15,400"},{"$f":"IF($C22=\"\",\"\",IFERROR(CHOOSE(MONTH(Pipeline!N22),\"jan\",\"fev\",\"mar\",\"abr\",\"mai\",\"jun\",\"jul\",\"ago\",\"set\",\"out\",\"nov\",\"dez\")&\"/\"&TEXT(YEAR(Pipeline!N22)-2000,\"00\"),\"\"))","v":"set/26"}]
[null,null,{"$f":"IF(OR(Pipeline!I23=\"Fechado Ganho\",Pipeline!I23=\"Fechado Perdido\",Pipeline!I23=\"Cancelado\",Pipeline!C23=\"\"),\"\",Pipeline!C23)","v":"OP016"},{"$f":"IF($C23=\"\",\"\",Pipeline!D23)","v":"Epsilon Educação"},{"$f":"IF($C23=\"\",\"\",Pipeline!K23)","v":{"v":42240,"d":"R$ 42,240"}},{"$f":"IF($C23=\"\",\"\",Pipeline!J23)","v":{"v":0.75,"d":"75%"}},{"v":31680,"d":"R$ 31,680"},{"$f":"IF($C23=\"\",\"\",IFERROR(CHOOSE(MONTH(Pipeline!N23),\"jan\",\"fev\",\"mar\",\"abr\",\"mai\",\"jun\",\"jul\",\"ago\",\"set\",\"out\",\"nov\",\"dez\")&\"/\"&TEXT(YEAR(Pipeline!N23)-2000,\"00\"),\"\"))","v":"ago/26"}]
[null,null,{"$f":"IF(OR(Pipeline!I24=\"Fechado Ganho\",Pipeline!I24=\"Fechado Perdido\",Pipeline!I24=\"Cancelado\",Pipeline!C24=\"\"),\"\",Pipeline!C24)","v":"OP017"},{"$f":"IF($C24=\"\",\"\",Pipeline!D24)","v":"Zeta Agro"},{"$f":"IF($C24=\"\",\"\",Pipeline!K24)","v":{"v":11520,"d":"R$ 11,520"}},{"$f":"IF($C24=\"\",\"\",Pipeline!J24)","v":{"v":0.75,"d":"75%"}},{"v":8640,"d":"R$ 8,640"},{"$f":"IF($C24=\"\",\"\",IFERROR(CHOOSE(MONTH(Pipeline!N24),\"jan\",\"fev\",\"mar\",\"abr\",\"mai\",\"jun\",\"jul\",\"ago\",\"set\",\"out\",\"nov\",\"dez\")&\"/\"&TEXT(YEAR(Pipeline!N24)-2000,\"00\"),\"\"))","v":"ago/26"}]
[null,null,{"$f":"IF(OR(Pipeline!I25=\"Fechado Ganho\",Pipeline!I25=\"Fechado Perdido\",Pipeline!I25=\"Cancelado\",Pipeline!C25=\"\"),\"\",Pipeline!C25)","v":"OP018"},{"$f":"IF($C25=\"\",\"\",Pipeline!D25)","v":"Eta Serviços"},{"$f":"IF($C25=\"\",\"\",Pipeline!K25)","v":{"v":36400,"d":"R$ 36,400"}},{"$f":"IF($C25=\"\",\"\",Pipeline!J25)","v":{"v":0.75,"d":"75%"}},{"v":27300,"d":"R$ 27,300"},{"$f":"IF($C25=\"\",\"\",IFERROR(CHOOSE(MONTH(Pipeline!N25),\"jan\",\"fev\",\"mar\",\"abr\",\"mai\",\"jun\",\"jul\",\"ago\",\"set\",\"out\",\"nov\",\"dez\")&\"/\"&TEXT(YEAR(Pipeline!N25)-2000,\"00\"),\"\"))","v":"ago/26"}]
[null,null,{"$f":"IF(OR(Pipeline!I26=\"Fechado Ganho\",Pipeline!I26=\"Fechado Perdido\",Pipeline!I26=\"Cancelado\",Pipeline!C26=\"\"),\"\",Pipeline!C26)","v":""},{"$f":"IF($C26=\"\",\"\",Pipeline!D26)","v":""},{"$f":"IF($C26=\"\",\"\",Pipeline!K26)","v":""},{"$f":"IF($C26=\"\",\"\",Pipeline!J26)","v":""},"",{"$f":"IF($C26=\"\",\"\",IFERROR(CHOOSE(MONTH(Pipeline!N26),\"jan\",\"fev\",\"mar\",\"abr\",\"mai\",\"jun\",\"jul\",\"ago\",\"set\",\"out\",\"nov\",\"dez\")&\"/\"&TEXT(YEAR(Pipeline!N26)-2000,\"00\"),\"\"))","v":""}]
[null,null,{"$f":"IF(OR(Pipeline!I27=\"Fechado Ganho\",Pipeline!I27=\"Fechado Perdido\",Pipeline!I27=\"Cancelado\",Pipeline!C27=\"\"),\"\",Pipeline!C27)","v":""},{"$f":"IF($C27=\"\",\"\",Pipeline!D27)","v":""},{"$f":"IF($C27=\"\",\"\",Pipeline!K27)","v":""},{"$f":"IF($C27=\"\",\"\",Pipeline!J27)","v":""},"",{"$f":"IF($C27=\"\",\"\",IFERROR(CHOOSE(MONTH(Pipeline!N27),\"jan\",\"fev\",\"mar\",\"abr\",\"mai\",\"jun\",\"jul\",\"ago\",\"set\",\"out\",\"nov\",\"dez\")&\"/\"&TEXT(YEAR(Pipeline!N27)-2000,\"00\"),\"\"))","v":""}]
[null,null,{"$f":"IF(OR(Pipeline!I28=\"Fechado Ganho\",Pipeline!I28=\"Fechado Perdido\",Pipeline!I28=\"Cancelado\",Pipeline!C28=\"\"),\"\",Pipeline!C28)","v":""},{"$f":"IF($C28=\"\",\"\",Pipeline!D28)","v":""},{"$f":"IF($C28=\"\",\"\",Pipeline!K28)","v":""},{"$f":"IF($C28=\"\",\"\",Pipeline!J28)","v":""},"",{"$f":"IF($C28=\"\",\"\",IFERROR(CHOOSE(MONTH(Pipeline!N28),\"jan\",\"fev\",\"mar\",\"abr\",\"mai\",\"jun\",\"jul\",\"ago\",\"set\",\"out\",\"nov\",\"dez\")&\"/\"&TEXT(YEAR(Pipeline!N28)-2000,\"00\"),\"\"))","v":""}]
[null,null,{"$f":"IF(OR(Pipeline!I29=\"Fechado Ganho\",Pipeline!I29=\"Fechado Perdido\",Pipeline!I29=\"Cancelado\",Pipeline!C29=\"\"),\"\",Pipeline!C29)","v":""},{"$f":"IF($C29=\"\",\"\",Pipeline!D29)","v":""},{"$f":"IF($C29=\"\",\"\",Pipeline!K29)","v":""},{"$f":"IF($C29=\"\",\"\",Pipeline!J29)","v":""},"",{"$f":"IF($C29=\"\",\"\",IFERROR(CHOOSE(MONTH(Pipeline!N29),\"jan\",\"fev\",\"mar\",\"abr\",\"mai\",\"jun\",\"jul\",\"ago\",\"set\",\"out\",\"nov\",\"dez\")&\"/\"&TEXT(YEAR(Pipeline!N29)-2000,\"00\"),\"\"))","v":""}]
[null,null,{"$f":"IF(OR(Pipeline!I30=\"Fechado Ganho\",Pipeline!I30=\"Fechado Perdido\",Pipeline!I30=\"Cancelado\",Pipeline!C30=\"\"),\"\",Pipeline!C30)","v":""},{"$f":"IF($C30=\"\",\"\",Pipeline!D30)","v":""},{"$f":"IF($C30=\"\",\"\",Pipeline!K30)","v":""},{"$f":"IF($C30=\"\",\"\",Pipeline!J30)","v":""},"",{"$f":"IF($C30=\"\",\"\",IFERROR(CHOOSE(MONTH(Pipeline!N30),\"jan\",\"fev\",\"mar\",\"abr\",\"mai\",\"jun\",\"jul\",\"ago\",\"set\",\"out\",\"nov\",\"dez\")&\"/\"&TEXT(YEAR(Pipeline!N30)-2000,\"00\"),\"\"))","v":""}]
[null,null,{"$f":"IF(OR(Pipeline!I31=\"Fechado Ganho\",Pipeline!I31=\"Fechado Perdido\",Pipeline!I31=\"Cancelado\",Pipeline!C31=\"\"),\"\",Pipeline!C31)","v":""},{"$f":"IF($C31=\"\",\"\",Pipeline!D31)","v":""},{"$f":"IF($C31=\"\",\"\",Pipeline!K31)","v":""},{"$f":"IF($C31=\"\",\"\",Pipeline!J31)","v":""},"",{"$f":"IF($C31=\"\",\"\",IFERROR(CHOOSE(MONTH(Pipeline!N31),\"jan\",\"fev\",\"mar\",\"abr\",\"mai\",\"jun\",\"jul\",\"ago\",\"set\",\"out\",\"nov\",\"dez\")&\"/\"&TEXT(YEAR(Pipeline!N31)-2000,\"00\"),\"\"))","v":""}]
[null,null,{"$f":"IF(OR(Pipeline!I32=\"Fechado Ganho\",Pipeline!I32=\"Fechado Perdido\",Pipeline!I32=\"Cancelado\",Pipeline!C32=\"\"),\"\",Pipeline!C32)","v":""},{"$f":"IF($C32=\"\",\"\",Pipeline!D32)","v":""},{"$f":"IF($C32=\"\",\"\",Pipeline!K32)","v":""},{"$f":"IF($C32=\"\",\"\",Pipeline!J32)","v":""},"",{"$f":"IF($C32=\"\",\"\",IFERROR(CHOOSE(MONTH(Pipeline!N32),\"jan\",\"fev\",\"mar\",\"abr\",\"mai\",\"jun\",\"jul\",\"ago\",\"set\",\"out\",\"nov\",\"dez\")&\"/\"&TEXT(YEAR(Pipeline!N32)-2000,\"00\"),\"\"))","v":""}]
[null,null,{"$f":"IF(OR(Pipeline!I33=\"Fechado Ganho\",Pipeline!I33=\"Fechado Perdido\",Pipeline!I33=\"Cancelado\",Pipeline!C33=\"\"),\"\",Pipeline!C33)","v":""},{"$f":"IF($C33=\"\",\"\",Pipeline!D33)","v":""},{"$f":"IF($C33=\"\",\"\",Pipeline!K33)","v":""},{"$f":"IF($C33=\"\",\"\",Pipeline!J33)","v":""},"",{"$f":"IF($C33=\"\",\"\",IFERROR(CHOOSE(MONTH(Pipeline!N33),\"jan\",\"fev\",\"mar\",\"abr\",\"mai\",\"jun\",\"jul\",\"ago\",\"set\",\"out\",\"nov\",\"dez\")&\"/\"&TEXT(YEAR(Pipeline!N33)-2000,\"00\"),\"\"))","v":""}]
[null,null,{"$f":"IF(OR(Pipeline!I34=\"Fechado Ganho\",Pipeline!I34=\"Fechado Perdido\",Pipeline!I34=\"Cancelado\",Pipeline!C34=\"\"),\"\",Pipeline!C34)","v":""},{"$f":"IF($C34=\"\",\"\",Pipeline!D34)","v":""},{"$f":"IF($C34=\"\",\"\",Pipeline!K34)","v":""},{"$f":"IF($C34=\"\",\"\",Pipeline!J34)","v":""},"",{"$f":"IF($C34=\"\",\"\",IFERROR(CHOOSE(MONTH(Pipeline!N34),\"jan\",\"fev\",\"mar\",\"abr\",\"mai\",\"jun\",\"jul\",\"ago\",\"set\",\"out\",\"nov\",\"dez\")&\"/\"&TEXT(YEAR(Pipeline!N34)-2000,\"00\"),\"\"))","v":""}]
[null,null,{"$f":"IF(OR(Pipeline!I35=\"Fechado Ganho\",Pipeline!I35=\"Fechado Perdido\",Pipeline!I35=\"Cancelado\",Pipeline!C35=\"\"),\"\",Pipeline!C35)","v":""},{"$f":"IF($C35=\"\",\"\",Pipeline!D35)","v":""},{"$f":"IF($C35=\"\",\"\",Pipeline!K35)","v":""},{"$f":"IF($C35=\"\",\"\",Pipeline!J35)","v":""},"",{"$f":"IF($C35=\"\",\"\",IFERROR(CHOOSE(MONTH(Pipeline!N35),\"jan\",\"fev\",\"mar\",\"abr\",\"mai\",\"jun\",\"jul\",\"ago\",\"set\",\"out\",\"nov\",\"dez\")&\"/\"&TEXT(YEAR(Pipeline!N35)-2000,\"00\"),\"\"))","v":""}]
[null,null,{"$f":"IF(OR(Pipeline!I36=\"Fechado Ganho\",Pipeline!I36=\"Fechado Perdido\",Pipeline!I36=\"Cancelado\",Pipeline!C36=\"\"),\"\",Pipeline!C36)","v":""},{"$f":"IF($C36=\"\",\"\",Pipeline!D36)","v":""},{"$f":"IF($C36=\"\",\"\",Pipeline!K36)","v":""},{"$f":"IF($C36=\"\",\"\",Pipeline!J36)","v":""},"",{"$f":"IF($C36=\"\",\"\",IFERROR(CHOOSE(MONTH(Pipeline!N36),\"jan\",\"fev\",\"mar\",\"abr\",\"mai\",\"jun\",\"jul\",\"ago\",\"set\",\"out\",\"nov\",\"dez\")&\"/\"&TEXT(YEAR(Pipeline!N36)-2000,\"00\"),\"\"))","v":""}]
[null,null,{"$f":"IF(OR(Pipeline!I37=\"Fechado Ganho\",Pipeline!I37=\"Fechado Perdido\",Pipeline!I37=\"Cancelado\",Pipeline!C37=\"\"),\"\",Pipeline!C37)","v":""},{"$f":"IF($C37=\"\",\"\",Pipeline!D37)","v":""},{"$f":"IF($C37=\"\",\"\",Pipeline!K37)","v":""},{"$f":"IF($C37=\"\",\"\",Pipeline!J37)","v":""},"",{"$f":"IF($C37=\"\",\"\",IFERROR(CHOOSE(MONTH(Pipeline!N37),\"jan\",\"fev\",\"mar\",\"abr\",\"mai\",\"jun\",\"jul\",\"ago\",\"set\",\"out\",\"nov\",\"dez\")&\"/\"&TEXT(YEAR(Pipeline!N37)-2000,\"00\"),\"\"))","v":""}]

{"sheet":"Metas","index":9,"n_rows":14,"n_cols":13,"rows_kept":14,"hidden":true}
[]
[null,null,"METAS COMERCIAIS"]
[null,null,"Solução de Gestão de Operações Comerciais"]
[null,null,"Instruções","Dashboard","Vendedores","Clientes","Produtos","Pipeline","Vendas","Comissões","Forecast","Metas","Agenda"]
[]
[null,null,"Defina as metas nos campos em azul. As colunas de realizado vêm das Vendas."]
[null,null,"Vendedor","Meta Receita","Meta Quantidade","Meta Comissão","Receita Realizada","Qtd. Realizada","Comissão Realizada","% Meta Receita","Falta Atingir","Situação"]
[null,null,"Ana Ribeiro",{"v":85000,"d":"R$ 85,000"},4,{"v":4200,"d":"R$ 4,200"},{"$f":"IFERROR(SUMIF(Vendas!$G$8:$G$32,$C8,Vendas!$J$8:$J$32),0)","v":{"v":92086.8,"d":"R$ 92,087"}},{"$f":"IFERROR(COUNTIF(Vendas!$G$8:$G$32,$C8),0)","v":4},{"$f":"IFERROR(SUMIF(Vendas!$G$8:$G$32,$C8,Vendas!$L$8:$L$32),0)","v":{"v":4499.88,"d":"R$ 4,500"}},{"$f":"IFERROR(G8/D8,0)","v":{"v":1.0833741176470588,"d":"108.3%"}},{"$f":"MAX(0,D8-G8)","v":0},{"$f":"IF(J8>=1,\"Meta atingida\",IF(J8>=0.7,\"Em rota\",\"Abaixo do esperado\"))","v":"Meta atingida"}]
[null,null,"Bruno Carvalho",{"v":95000,"d":"R$ 95,000"},5,{"v":5500,"d":"R$ 5,500"},{"$f":"IFERROR(SUMIF(Vendas!$G$8:$G$32,$C9,Vendas!$J$8:$J$32),0)","v":{"v":78691.8,"d":"R$ 78,692"}},{"$f":"IFERROR(COUNTIF(Vendas!$G$8:$G$32,$C9),0)","v":4},{"$f":"IFERROR(SUMIF(Vendas!$G$8:$G$32,$C9,Vendas!$L$8:$L$32),0)","v":{"v":6060.3099999999995,"d":"R$ 6,060"}},{"v":0.8283347368421053,"d":"82.8%"},{"v":16308.199999999997,"d":"R$ 16,308"},"Em rota"]
[null,null,"Camila Souza",{"v":105000,"d":"R$ 105,000"},4,{"v":5000,"d":"R$ 5,000"},{"$f":"IFERROR(SUMIF(Vendas!$G$8:$G$32,$C10,Vendas!$J$8:$J$32),0)","v":{"v":111354.75,"d":"R$ 111,355"}},{"$f":"IFERROR(COUNTIF(Vendas!$G$8:$G$32,$C10),0)","v":4},{"$f":"IFERROR(SUMIF(Vendas!$G$8:$G$32,$C10,Vendas!$L$8:$L$32),0)","v":{"v":5166.389999999999,"d":"R$ 5,166"}},{"v":1.0605214285714286,"d":"106.1%"},0,"Meta atingida"]
[null,null,"Diego Martins",{"v":60000,"d":"R$ 60,000"},3,{"v":4000,"d":"R$ 4,000"},{"$f":"IFERROR(SUMIF(Vendas!$G$8:$G$32,$C11,Vendas!$J$8:$J$32),0)","v":{"v":62328.6,"d":"R$ 62,329"}},{"$f":"IFERROR(COUNTIF(Vendas!$G$8:$G$32,$C11),0)","v":4},{"$f":"IFERROR(SUMIF(Vendas!$G$8:$G$32,$C11,Vendas!$L$8:$L$32),0)","v":{"v":4449.31,"d":"R$ 4,449"}},{"v":1.03881,"d":"103.9%"},0,"Meta atingida"]
[null,null,"Elisa Nogueira",{"v":70000,"d":"R$ 70,000"},3,{"v":4000,"d":"R$ 4,000"},{"$f":"IFERROR(SUMIF(Vendas!$G$8:$G$32,$C12,Vendas!$J$8:$J$32),0)","v":{"v":72534,"d":"R$ 72,534"}},{"$f":"IFERROR(COUNTIF(Vendas!$G$8:$G$32,$C12),0)","v":3},{"$f":"IFERROR(SUMIF(Vendas!$G$8:$G$32,$C12,Vendas!$L$8:$L$32),0)","v":{"v":4183.92,"d":"R$ 4,184"}},{"v":1.0362,"d":"103.6%"},0,"Meta atingida"]
[null,null,"Fábio Lima",{"v":80000,"d":"R$ 80,000"},4,{"v":4500,"d":"R$ 4,500"},{"$f":"IFERROR(SUMIF(Vendas!$G$8:$G$32,$C13,Vendas!$J$8:$J$32),0)","v":{"v":44370,"d":"R$ 44,370"}},{"$f":"IFERROR(COUNTIF(Vendas!$G$8:$G$32,$C13),0)","v":3},{"$f":"IFERROR(SUMIF(Vendas!$G$8:$G$32,$C13,Vendas!$L$8:$L$32),0)","v":{"v":2056.92,"d":"R$ 2,057"}},{"v":0.554625,"d":"55.5%"},{"v":35630,"d":"R$ 35,630"},"Abaixo do esperado"]
[null,null,"Gabriela Pinto",{"v":85000,"d":"R$ 85,000"},4,{"v":4800,"d":"R$ 4,800"},{"$f":"IFERROR(SUMIF(Vendas!$G$8:$G$32,$C14,Vendas!$J$8:$J$32),0)","v":{"v":59395,"d":"R$ 59,395"}},{"$f":"IFERROR(COUNTIF(Vendas!$G$8:$G$32,$C14),0)","v":3},{"$f":"IFERROR(SUMIF(Vendas!$G$8:$G$32,$C14,Vendas!$L$8:$L$32),0)","v":{"v":4375.4,"d":"R$ 4,375"}},{"v":0.698764705882353,"d":"69.9%"},{"v":25605,"d":"R$ 25,605"},"Abaixo do esperado"]

{"sheet":"Agenda","index":10,"n_rows":27,"n_cols":13,"rows_kept":27,"hidden":true}
[]
[null,null,"AGENDA COMERCIAL"]
[null,null,"Solução de Gestão de Operações Comerciais"]
[null,null,"Instruções","Dashboard","Vendedores","Clientes","Produtos","Pipeline","Vendas","Comissões","Forecast","Metas","Agenda"]
[]
[null,null,"Programe as atividades. Linhas em vermelho estão com data vencida e pendentes."]
[null,null,"Data","Cliente","Responsável","Atividade","Prioridade","Status","Observações"]
[null,null,"2026-07-20","Alfa Indústria Ltda","Ana Ribeiro","Ligação","Alta","Pendente","Confirmar disponibilidade"]
[null,null,"2026-07-22","Beta Comércio SA","Bruno Carvalho","Visita","Média","Em andamento","Levar apresentação comercial"]
[null,null,"2026-07-24","Gamma Tech","Camila Souza","Follow-up","Baixa","Concluída","Retomar após feriado"]
[null,null,"2026-07-26","Delta Saúde","Diego Martins","Reunião","Alta","Cancelada","Alinhar escopo técnico"]
[null,null,"2026-07-28","Epsilon Educação","Elisa Nogueira","Envio proposta","Média","Pendente","Enviar versão revisada"]
[null,null,"2026-07-30","Zeta Agro","Fábio Lima","Renovação","Baixa","Em andamento","Checar renovação de contrato"]
[null,null,"2026-08-01","Eta Serviços","Gabriela Pinto","Ligação","Alta","Concluída"]
[null,null,"2026-08-03","Theta Financeira","Ana Ribeiro","Visita","Média","Cancelada","Confirmar disponibilidade"]
[null,null,"2026-08-05","Iota Distribuidora","Bruno Carvalho","Follow-up","Baixa","Pendente","Levar apresentação comercial"]
[null,null,"2026-08-07","Kappa Logística","Camila Souza","Reunião","Alta","Em andamento","Retomar após feriado"]
[null,null,"2026-07-20","Lambda Metais","Diego Martins","Envio proposta","Média","Concluída","Alinhar escopo técnico"]
[null,null,"2026-07-22","Alfa Indústria Ltda","Elisa Nogueira","Renovação","Baixa","Cancelada","Enviar versão revisada"]
[null,null,"2026-07-24","Beta Comércio SA","Fábio Lima","Ligação","Alta","Pendente","Checar renovação de contrato"]
[null,null,"2026-07-26","Gamma Tech","Gabriela Pinto","Visita","Média","Em andamento"]
[null,null,"2026-07-28","Delta Saúde","Ana Ribeiro","Follow-up","Baixa","Concluída","Confirmar disponibilidade"]
[null,null,"2026-07-30","Epsilon Educação","Bruno Carvalho","Reunião","Alta","Cancelada","Levar apresentação comercial"]
[null,null,"2026-08-01","Zeta Agro","Camila Souza","Envio proposta","Média","Pendente","Retomar após feriado"]
[null,null,"2026-08-03","Eta Serviços","Diego Martins","Renovação","Baixa","Em andamento","Alinhar escopo técnico"]
[null,null,"2026-08-05","Theta Financeira","Elisa Nogueira","Ligação","Alta","Concluída","Enviar versão revisada"]
[null,null,"2026-08-07","Iota Distribuidora","Fábio Lima","Visita","Média","Cancelada","Checar renovação de contrato"]

{"sheet":"Base de Cálculos","index":11,"n_rows":90,"n_cols":14,"rows_kept":90,"hidden":true}
[]
[null,null,"BASE DE CÁLCULOS (AUXILIAR)"]
[null,null,"Solução de Gestão de Operações Comerciais"]
[null,null,"Instruções","Dashboard","Vendedores","Clientes","Produtos","Pipeline","Vendas","Comissões","Forecast","Metas","Agenda"]
[]
[null,null,"Aba auxiliar — concentra listas de validação e todas as agregações. Não editar manualmente."]
[]
[null,null,"Equipes","SimNao","Segmentos","Origens","Estagios","Categorias","Prioridades","Atividades","StatusAtiv","StatusComissao","FormasPagto","StatusCadastro"]
[null,null,"Equipe A","Sim","Indústria","Indicação","Lead","Produto","Alta","Ligação","Pendente","Pendente","Boleto","Ativo"]
[null,null,"Equipe B","Não","Comércio","Site","Contato","Serviço","Média","Visita","Em andamento","Pago","PIX","Inativo"]
[null,null,"Equipe C",null,"Serviços","Inbound","Diagnóstico","Plano","Baixa","Follow-up","Concluída","Cancelado","Cartão"]
[null,null,"Inside Sales",null,"Tecnologia","Outbound","Proposta","Assinatura",null,"Reunião","Cancelada",null,"Transferência"]
[null,null,"Key Accounts",null,"Saúde","Evento","Negociação","Consultoria",null,"Envio proposta",null,null,"Parcelado"]
[{"$nulls":4},"Educação","Redes Sociais","Fechado Ganho",null,null,"Renovação"]
[{"$nulls":4},"Agronegócio","Parceiro","Fechado Perdido"]
[{"$nulls":4},"Financeiro","Base Ativa","Cancelado"]
[]
[]
[]
[null,null,"1. RECEITA POR MÊS (base gráfico)",{"$nulls":4},"6. BASES CONTÍGUAS PARA GRÁFICOS"]
[null,"Mês#","Mês","Receita Realizada","Forecast Ponderado",null,null,"Vendedor","Comissão",null,"Mês","Forecast Ponderado"]
[null,1,"jan/26",{"$f":"IFERROR(SUMPRODUCT((MONTH(Vendas!$D$8:$D$32)=$B22)*(YEAR(Vendas!$D$8:$D$32)=2026)*Vendas!$J$8:$J$32),0)","v":{"v":45216,"d":"R$ 45,216"}},{"$f":"IFERROR(SUMPRODUCT((MONTH(Pipeline!$N$8:$N$37)=$B22)*(YEAR(Pipeline!$N$8:$N$37)=2026)*Pipeline!$L$8:$L$37),0)","v":0},null,null,{"$f":"$C$37","v":"Ana Ribeiro"},{"$f":"$E$37","v":{"v":4499.88,"d":"R$ 4,500"}},null,{"$f":"$C$22","v":"jan/26"},{"$f":"$E$22","v":0}]
[null,2,"fev/26",{"$f":"IFERROR(SUMPRODUCT((MONTH(Vendas!$D$8:$D$32)=$B23)*(YEAR(Vendas!$D$8:$D$32)=2026)*Vendas!$J$8:$J$32),0)","v":{"v":44028.75,"d":"R$ 44,029"}},{"$f":"IFERROR(SUMPRODUCT((MONTH(Pipeline!$N$8:$N$37)=$B23)*(YEAR(Pipeline!$N$8:$N$37)=2026)*Pipeline!$L$8:$L$37),0)","v":0},null,null,{"$f":"$C$38","v":"Bruno Carvalho"},{"$f":"$E$38","v":{"v":6060.3099999999995,"d":"R$ 6,060"}},null,{"$f":"$C$23","v":"fev/26"},{"$f":"$E$23","v":0}]
[null,3,"mar/26",{"$f":"IFERROR(SUMPRODUCT((MONTH(Vendas!$D$8:$D$32)=$B24)*(YEAR(Vendas!$D$8:$D$32)=2026)*Vendas!$J$8:$J$32),0)","v":{"v":75414.8,"d":"R$ 75,415"}},{"$f":"IFERROR(SUMPRODUCT((MONTH(Pipeline!$N$8:$N$37)=$B24)*(YEAR(Pipeline!$N$8:$N$37)=2026)*Pipeline!$L$8:$L$37),0)","v":0},null,null,{"$f":"$C$39","v":"Camila Souza"},{"$f":"$E$39","v":{"v":5166.389999999999,"d":"R$ 5,166"}},null,{"$f":"$C$24","v":"mar/26"},{"$f":"$E$24","v":0}]
[null,4,"abr/26",{"$f":"IFERROR(SUMPRODUCT((MONTH(Vendas!$D$8:$D$32)=$B25)*(YEAR(Vendas!$D$8:$D$32)=2026)*Vendas!$J$8:$J$32),0)","v":{"v":82375.8,"d":"R$ 82,376"}},{"$f":"IFERROR(SUMPRODUCT((MONTH(Pipeline!$N$8:$N$37)=$B25)*(YEAR(Pipeline!$N$8:$N$37)=2026)*Pipeline!$L$8:$L$37),0)","v":0},null,null,{"$f":"$C$40","v":"Diego Martins"},{"$f":"$E$40","v":{"v":4449.31,"d":"R$ 4,449"}},null,{"$f":"$C$25","v":"abr/26"},{"$f":"$E$25","v":0}]
[null,5,"mai/26",{"$f":"IFERROR(SUMPRODUCT((MONTH(Vendas!$D$8:$D$32)=$B26)*(YEAR(Vendas!$D$8:$D$32)=2026)*Vendas!$J$8:$J$32),0)","v":{"v":53096,"d":"R$ 53,096"}},{"$f":"IFERROR(SUMPRODUCT((MONTH(Pipeline!$N$8:$N$37)=$B26)*(YEAR(Pipeline!$N$8:$N$37)=2026)*Pipeline!$L$8:$L$37),0)","v":0},null,null,{"$f":"$C$41","v":"Elisa Nogueira"},{"$f":"$E$41","v":{"v":4183.92,"d":"R$ 4,184"}},null,{"$f":"$C$26","v":"mai/26"},{"$f":"$E$26","v":0}]
[null,6,"jun/26",{"$f":"IFERROR(SUMPRODUCT((MONTH(Vendas!$D$8:$D$32)=$B27)*(YEAR(Vendas!$D$8:$D$32)=2026)*Vendas!$J$8:$J$32),0)","v":{"v":112496.6,"d":"R$ 112,497"}},{"$f":"IFERROR(SUMPRODUCT((MONTH(Pipeline!$N$8:$N$37)=$B27)*(YEAR(Pipeline!$N$8:$N$37)=2026)*Pipeline!$L$8:$L$37),0)","v":0},null,null,{"$f":"$C$42","v":"Fábio Lima"},{"$f":"$E$42","v":{"v":2056.92,"d":"R$ 2,057"}},null,{"$f":"$C$27","v":"jun/26"},{"$f":"$E$27","v":0}]
[null,7,"jul/26",{"$f":"IFERROR(SUMPRODUCT((MONTH(Vendas!$D$8:$D$32)=$B28)*(YEAR(Vendas!$D$8:$D$32)=2026)*Vendas!$J$8:$J$32),0)","v":{"v":108133,"d":"R$ 108,133"}},{"$f":"IFERROR(SUMPRODUCT((MONTH(Pipeline!$N$8:$N$37)=$B28)*(YEAR(Pipeline!$N$8:$N$37)=2026)*Pipeline!$L$8:$L$37),0)","v":0},null,null,{"$f":"$C$43","v":"Gabriela Pinto"},{"$f":"$E$43","v":{"v":4375.4,"d":"R$ 4,375"}},null,{"$f":"$C$28","v":"jul/26"},{"$f":"$E$28","v":0}]
[null,8,"ago/26",{"$f":"IFERROR(SUMPRODUCT((MONTH(Vendas!$D$8:$D$32)=$B29)*(YEAR(Vendas!$D$8:$D$32)=2026)*Vendas!$J$8:$J$32),0)","v":0},{"$f":"IFERROR(SUMPRODUCT((MONTH(Pipeline!$N$8:$N$37)=$B29)*(YEAR(Pipeline!$N$8:$N$37)=2026)*Pipeline!$L$8:$L$37),0)","v":{"v":67620,"d":"R$ 67,620"}},{"$nulls":5},{"$f":"$C$29","v":"ago/26"},{"$f":"$E$29","v":{"v":67620,"d":"R$ 67,620"}}]
[null,9,"set/26",{"$f":"IFERROR(SUMPRODUCT((MONTH(Vendas!$D$8:$D$32)=$B30)*(YEAR(Vendas!$D$8:$D$32)=2026)*Vendas!$J$8:$J$32),0)","v":0},{"$f":"IFERROR(SUMPRODUCT((MONTH(Pipeline!$N$8:$N$37)=$B30)*(YEAR(Pipeline!$N$8:$N$37)=2026)*Pipeline!$L$8:$L$37),0)","v":{"v":77088,"d":"R$ 77,088"}},{"$nulls":5},{"$f":"$C$30","v":"set/26"},{"$f":"$E$30","v":{"v":77088,"d":"R$ 77,088"}}]
[null,10,"out/26",{"$f":"IFERROR(SUMPRODUCT((MONTH(Vendas!$D$8:$D$32)=$B31)*(YEAR(Vendas!$D$8:$D$32)=2026)*Vendas!$J$8:$J$32),0)","v":0},{"$f":"IFERROR(SUMPRODUCT((MONTH(Pipeline!$N$8:$N$37)=$B31)*(YEAR(Pipeline!$N$8:$N$37)=2026)*Pipeline!$L$8:$L$37),0)","v":{"v":31276,"d":"R$ 31,276"}},{"$nulls":5},{"$f":"$C$31","v":"out/26"},{"$f":"$E$31","v":{"v":31276,"d":"R$ 31,276"}}]
[null,11,"nov/26",{"$f":"IFERROR(SUMPRODUCT((MONTH(Vendas!$D$8:$D$32)=$B32)*(YEAR(Vendas!$D$8:$D$32)=2026)*Vendas!$J$8:$J$32),0)","v":0},{"$f":"IFERROR(SUMPRODUCT((MONTH(Pipeline!$N$8:$N$37)=$B32)*(YEAR(Pipeline!$N$8:$N$37)=2026)*Pipeline!$L$8:$L$37),0)","v":{"v":32496,"d":"R$ 32,496"}},{"$nulls":5},{"$f":"$C$32","v":"nov/26"},{"$f":"$E$32","v":{"v":32496,"d":"R$ 32,496"}}]
[null,12,"dez/26",{"$f":"IFERROR(SUMPRODUCT((MONTH(Vendas!$D$8:$D$32)=$B33)*(YEAR(Vendas!$D$8:$D$32)=2026)*Vendas!$J$8:$J$32),0)","v":0},{"$f":"IFERROR(SUMPRODUCT((MONTH(Pipeline!$N$8:$N$37)=$B33)*(YEAR(Pipeline!$N$8:$N$37)=2026)*Pipeline!$L$8:$L$37),0)","v":{"v":6048,"d":"R$ 6,048"}},{"$nulls":5},{"$f":"$C$33","v":"dez/26"},{"$f":"$E$33","v":{"v":6048,"d":"R$ 6,048"}}]
[]
[null,null,"2. RECEITA E COMISSÃO POR VENDEDOR"]
[null,null,"Vendedor","Receita","Comissão","Qtd. Vendas"]
[null,null,{"$f":"IFERROR(Vendedores!$D$8,\"\")","v":"Ana Ribeiro"},{"$f":"IFERROR(SUMIF(Vendas!$G$8:$G$32,$C37,Vendas!$J$8:$J$32),0)","v":{"v":92086.8,"d":"R$ 92,087"}},{"$f":"IFERROR(SUMIF(Vendas!$G$8:$G$32,$C37,Vendas!$L$8:$L$32),0)","v":{"v":4499.88,"d":"R$ 4,500"}},{"$f":"IFERROR(COUNTIF(Vendas!$G$8:$G$32,$C37),0)","v":4}]
[null,null,{"$f":"IFERROR(Vendedores!$D$9,\"\")","v":"Bruno Carvalho"},{"$f":"IFERROR(SUMIF(Vendas!$G$8:$G$32,$C38,Vendas!$J$8:$J$32),0)","v":{"v":78691.8,"d":"R$ 78,692"}},{"$f":"IFERROR(SUMIF(Vendas!$G$8:$G$32,$C38,Vendas!$L$8:$L$32),0)","v":{"v":6060.3099999999995,"d":"R$ 6,060"}},{"$f":"IFERROR(COUNTIF(Vendas!$G$8:$G$32,$C38),0)","v":4}]
[null,null,{"$f":"IFERROR(Vendedores!$D$10,\"\")","v":"Camila Souza"},{"$f":"IFERROR(SUMIF(Vendas!$G$8:$G$32,$C39,Vendas!$J$8:$J$32),0)","v":{"v":111354.75,"d":"R$ 111,355"}},{"$f":"IFERROR(SUMIF(Vendas!$G$8:$G$32,$C39,Vendas!$L$8:$L$32),0)","v":{"v":5166.389999999999,"d":"R$ 5,166"}},{"$f":"IFERROR(COUNTIF(Vendas!$G$8:$G$32,$C39),0)","v":4}]
[null,null,{"$f":"IFERROR(Vendedores!$D$11,\"\")","v":"Diego Martins"},{"$f":"IFERROR(SUMIF(Vendas!$G$8:$G$32,$C40,Vendas!$J$8:$J$32),0)","v":{"v":62328.6,"d":"R$ 62,329"}},{"$f":"IFERROR(SUMIF(Vendas!$G$8:$G$32,$C40,Vendas!$L$8:$L$32),0)","v":{"v":4449.31,"d":"R$ 4,449"}},{"$f":"IFERROR(COUNTIF(Vendas!$G$8:$G$32,$C40),0)","v":4}]
[null,null,{"$f":"IFERROR(Vendedores!$D$12,\"\")","v":"Elisa Nogueira"},{"$f":"IFERROR(SUMIF(Vendas!$G$8:$G$32,$C41,Vendas!$J$8:$J$32),0)","v":{"v":72534,"d":"R$ 72,534"}},{"$f":"IFERROR(SUMIF(Vendas!$G$8:$G$32,$C41,Vendas!$L$8:$L$32),0)","v":{"v":4183.92,"d":"R$ 4,184"}},{"$f":"IFERROR(COUNTIF(Vendas!$G$8:$G$32,$C41),0)","v":3}]
[null,null,{"$f":"IFERROR(Vendedores!$D$13,\"\")","v":"Fábio Lima"},{"$f":"IFERROR(SUMIF(Vendas!$G$8:$G$32,$C42,Vendas!$J$8:$J$32),0)","v":{"v":44370,"d":"R$ 44,370"}},{"$f":"IFERROR(SUMIF(Vendas!$G$8:$G$32,$C42,Vendas!$L$8:$L$32),0)","v":{"v":2056.92,"d":"R$ 2,057"}},{"$f":"IFERROR(COUNTIF(Vendas!$G$8:$G$32,$C42),0)","v":3}]
[null,null,{"$f":"IFERROR(Vendedores!$D$14,\"\")","v":"Gabriela Pinto"},{"$f":"IFERROR(SUMIF(Vendas!$G$8:$G$32,$C43,Vendas!$J$8:$J$32),0)","v":{"v":59395,"d":"R$ 59,395"}},{"$f":"IFERROR(SUMIF(Vendas!$G$8:$G$32,$C43,Vendas!$L$8:$L$32),0)","v":{"v":4375.4,"d":"R$ 4,375"}},{"$f":"IFERROR(COUNTIF(Vendas!$G$8:$G$32,$C43),0)","v":3}]
[]
[]
[null,null,"3. RECEITA POR PRODUTO"]
[null,null,"Produto","Receita","Qtd. Vendas"]
[null,null,{"$f":"IFERROR(Produtos!$D$8,\"\")","v":"Licença ERP Corporate"},{"$f":"IFERROR(SUMIF(Vendas!$F$8:$F$32,$C48,Vendas!$J$8:$J$32),0)","v":{"v":130440,"d":"R$ 130,440"}},{"$f":"IFERROR(COUNTIF(Vendas!$F$8:$F$32,$C48),0)","v":3}]
[null,null,{"$f":"IFERROR(Produtos!$D$9,\"\")","v":"Licença ERP Starter"},{"$f":"IFERROR(SUMIF(Vendas!$F$8:$F$32,$C49,Vendas!$J$8:$J$32),0)","v":{"v":35740.8,"d":"R$ 35,741"}},{"$f":"IFERROR(COUNTIF(Vendas!$F$8:$F$32,$C49),0)","v":2}]
[null,null,{"$f":"IFERROR(Produtos!$D$10,\"\")","v":"Implantação Técnica"},{"$f":"IFERROR(SUMIF(Vendas!$F$8:$F$32,$C50,Vendas!$J$8:$J$32),0)","v":{"v":84630,"d":"R$ 84,630"}},{"$f":"IFERROR(COUNTIF(Vendas!$F$8:$F$32,$C50),0)","v":3}]
[null,null,{"$f":"IFERROR(Produtos!$D$11,\"\")","v":"Plano Suporte Premium"},{"$f":"IFERROR(SUMIF(Vendas!$F$8:$F$32,$C51,Vendas!$J$8:$J$32),0)","v":{"v":35130,"d":"R$ 35,130"}},{"$f":"IFERROR(COUNTIF(Vendas!$F$8:$F$32,$C51),0)","v":3}]
[null,null,{"$f":"IFERROR(Produtos!$D$12,\"\")","v":"Plano Suporte Básico"},{"$f":"IFERROR(SUMIF(Vendas!$F$8:$F$32,$C52,Vendas!$J$8:$J$32),0)","v":{"v":14256,"d":"R$ 14,256"}},{"$f":"IFERROR(COUNTIF(Vendas!$F$8:$F$32,$C52),0)","v":3}]
[null,null,{"$f":"IFERROR(Produtos!$D$13,\"\")","v":"Assinatura BI Analytics"},{"$f":"IFERROR(SUMIF(Vendas!$F$8:$F$32,$C53,Vendas!$J$8:$J$32),0)","v":{"v":32081.399999999998,"d":"R$ 32,081"}},{"$f":"IFERROR(COUNTIF(Vendas!$F$8:$F$32,$C53),0)","v":2}]
[null,null,{"$f":"IFERROR(Produtos!$D$14,\"\")","v":"Consultoria Estratégica"},{"$f":"IFERROR(SUMIF(Vendas!$F$8:$F$32,$C54,Vendas!$J$8:$J$32),0)","v":{"v":92512,"d":"R$ 92,512"}},{"$f":"IFERROR(COUNTIF(Vendas!$F$8:$F$32,$C54),0)","v":3}]
[null,null,{"$f":"IFERROR(Produtos!$D$15,\"\")","v":"Consultoria Processos"},{"$f":"IFERROR(SUMIF(Vendas!$F$8:$F$32,$C55,Vendas!$J$8:$J$32),0)","v":{"v":66231,"d":"R$ 66,231"}},{"$f":"IFERROR(COUNTIF(Vendas!$F$8:$F$32,$C55),0)","v":3}]
[null,null,{"$f":"IFERROR(Produtos!$D$16,\"\")","v":"Treinamento Equipe"},{"$f":"IFERROR(SUMIF(Vendas!$F$8:$F$32,$C56,Vendas!$J$8:$J$32),0)","v":{"v":29739.75,"d":"R$ 29,740"}},{"$f":"IFERROR(COUNTIF(Vendas!$F$8:$F$32,$C56),0)","v":3}]
[null,null,{"$f":"IFERROR(Produtos!$D$17,\"\")","v":"Módulo Fiscal Adicional"},{"$f":"IFERROR(SUMIF(Vendas!$F$8:$F$32,$C57,Vendas!$J$8:$J$32),0)","v":0},{"$f":"IFERROR(COUNTIF(Vendas!$F$8:$F$32,$C57),0)","v":0}]
[]
[null,null,"4. FUNIL COMERCIAL POR ESTÁGIO"]
[null,null,"Estágio","Qtd. Oportunidades","Valor","Valor Ponderado"]
[null,null,{"$f":"IFERROR($G$9,\"\")","v":"Lead"},{"$f":"IFERROR(COUNTIF(Pipeline!$I$8:$I$37,$C61),0)","v":4},{"$f":"IFERROR(SUMIF(Pipeline!$I$8:$I$37,$C61,Pipeline!$K$8:$K$37),0)","v":{"v":132480,"d":"R$ 132,480"}},{"$f":"IFERROR(SUMIF(Pipeline!$I$8:$I$37,$C61,Pipeline!$L$8:$L$37),0)","v":{"v":13248,"d":"R$ 13,248"}}]
[null,null,{"$f":"IFERROR($G$10,\"\")","v":"Contato"},{"$f":"IFERROR(COUNTIF(Pipeline!$I$8:$I$37,$C62),0)","v":4},{"$f":"IFERROR(SUMIF(Pipeline!$I$8:$I$37,$C62,Pipeline!$K$8:$K$37),0)","v":{"v":126480,"d":"R$ 126,480"}},{"$f":"IFERROR(SUMIF(Pipeline!$I$8:$I$37,$C62,Pipeline!$L$8:$L$37),0)","v":{"v":25296,"d":"R$ 25,296"}}]
[null,null,{"$f":"IFERROR($G$11,\"\")","v":"Diagnóstico"},{"$f":"IFERROR(COUNTIF(Pipeline!$I$8:$I$37,$C63),0)","v":3},{"$f":"IFERROR(SUMIF(Pipeline!$I$8:$I$37,$C63,Pipeline!$K$8:$K$37),0)","v":{"v":89360,"d":"R$ 89,360"}},{"$f":"IFERROR(SUMIF(Pipeline!$I$8:$I$37,$C63,Pipeline!$L$8:$L$37),0)","v":{"v":31276,"d":"R$ 31,276"}}]
[null,null,{"$f":"IFERROR($G$12,\"\")","v":"Proposta"},{"$f":"IFERROR(COUNTIF(Pipeline!$I$8:$I$37,$C64),0)","v":4},{"$f":"IFERROR(SUMIF(Pipeline!$I$8:$I$37,$C64,Pipeline!$K$8:$K$37),0)","v":{"v":140160,"d":"R$ 140,160"}},{"$f":"IFERROR(SUMIF(Pipeline!$I$8:$I$37,$C64,Pipeline!$L$8:$L$37),0)","v":{"v":77088,"d":"R$ 77,088"}}]
[null,null,{"$f":"IFERROR($G$13,\"\")","v":"Negociação"},{"$f":"IFERROR(COUNTIF(Pipeline!$I$8:$I$37,$C65),0)","v":3},{"$f":"IFERROR(SUMIF(Pipeline!$I$8:$I$37,$C65,Pipeline!$K$8:$K$37),0)","v":{"v":90160,"d":"R$ 90,160"}},{"$f":"IFERROR(SUMIF(Pipeline!$I$8:$I$37,$C65,Pipeline!$L$8:$L$37),0)","v":{"v":67620,"d":"R$ 67,620"}}]
[null,null,{"$f":"IFERROR($G$14,\"\")","v":"Fechado Ganho"},{"$f":"IFERROR(COUNTIF(Pipeline!$I$8:$I$37,$C66),0)","v":8},{"$f":"IFERROR(SUMIF(Pipeline!$I$8:$I$37,$C66,Pipeline!$K$8:$K$37),0)","v":{"v":258880,"d":"R$ 258,880"}},{"$f":"IFERROR(SUMIF(Pipeline!$I$8:$I$37,$C66,Pipeline!$L$8:$L$37),0)","v":{"v":258880,"d":"R$ 258,880"}}]
[null,null,{"$f":"IFERROR($G$15,\"\")","v":"Fechado Perdido"},{"$f":"IFERROR(COUNTIF(Pipeline!$I$8:$I$37,$C67),0)","v":3},{"$f":"IFERROR(SUMIF(Pipeline!$I$8:$I$37,$C67,Pipeline!$K$8:$K$37),0)","v":{"v":113040,"d":"R$ 113,040"}},{"$f":"IFERROR(SUMIF(Pipeline!$I$8:$I$37,$C67,Pipeline!$L$8:$L$37),0)","v":0}]
[null,null,{"$f":"IFERROR($G$16,\"\")","v":"Cancelado"},{"$f":"IFERROR(COUNTIF(Pipeline!$I$8:$I$37,$C68),0)","v":1},{"$f":"IFERROR(SUMIF(Pipeline!$I$8:$I$37,$C68,Pipeline!$K$8:$K$37),0)","v":{"v":30800,"d":"R$ 30,800"}},{"$f":"IFERROR(SUMIF(Pipeline!$I$8:$I$37,$C68,Pipeline!$L$8:$L$37),0)","v":0}]
[null,"Total Vendido (líquido)",{"$f":"IFERROR(SUM(Vendas!$J$8:$J$32),0)","v":{"v":520760.94999999995,"d":"R$ 520,761"}}]
[null,"Total em Negociação",{"$f":"IFERROR(SUMIFS(Pipeline!$K$8:$K$37,Pipeline!$Q$8:$Q$37,\"Em aberto\"),0)","v":{"v":578640,"d":"R$ 578,640"}}]
[null,"Receita Prevista (pipeline bruto)",{"$f":"IFERROR(SUMIFS(Pipeline!$K$8:$K$37,Pipeline!$Q$8:$Q$37,\"Em aberto\"),0)","v":{"v":578640,"d":"R$ 578,640"}}]
[null,"Receita Ponderada",{"$f":"IFERROR(SUMIFS(Pipeline!$L$8:$L$37,Pipeline!$Q$8:$Q$37,\"Em aberto\"),0)","v":{"v":214528,"d":"R$ 214,528"}}]
[null,"Ticket Médio",{"$f":"IFERROR(AVERAGE(Vendas!$J$8:$J$32),0)","v":{"v":20830.438,"d":"R$ 20,830"}}]
[null,"Qtd. Oportunidades",{"$f":"IFERROR(COUNTIF(Pipeline!$C$8:$C$37,\"OP*\"),0)","v":30}]
[null,"Oportunidades Ganhas",{"$f":"IFERROR(COUNTIF(Pipeline!$I$8:$I$37,\"Fechado Ganho\"),0)","v":8}]
[null,"Oportunidades Perdidas",{"$f":"IFERROR(COUNTIF(Pipeline!$I$8:$I$37,\"Fechado Perdido\"),0)","v":3}]
[null,"Taxa de Conversão",{"$f":"IFERROR(C75/(C75+C76),0)","v":{"v":0.7272727272727273,"d":"72.7%"}}]
[null,"Valor Ganho",{"$f":"IFERROR(SUMIF(Pipeline!$I$8:$I$37,\"Fechado Ganho\",Pipeline!$K$8:$K$37),0)","v":{"v":258880,"d":"R$ 258,880"}}]
[null,"Valor Perdido",{"$f":"IFERROR(SUMIF(Pipeline!$I$8:$I$37,\"Fechado Perdido\",Pipeline!$K$8:$K$37),0)","v":{"v":113040,"d":"R$ 113,040"}}]
[null,"Comissão Total",{"$f":"IFERROR(SUM(Vendas!$L$8:$L$32),0)","v":{"v":30792.130000000005,"d":"R$ 30,792"}}]
[null,"Comissão Paga",{"$f":"IFERROR(SUMIF(Vendas!$M$8:$M$32,\"Sim\",Vendas!$L$8:$L$32),0)","v":{"v":24373.370000000003,"d":"R$ 24,373"}}]
[null,"Comissão Pendente",{"$f":"IFERROR(SUMIF(Vendas!$M$8:$M$32,\"Não\",Vendas!$L$8:$L$32),0)","v":{"v":6418.76,"d":"R$ 6,419"}}]
[null,"Tempo Médio até Fechamento (dias)",{"$f":"IFERROR(ROUND(AVERAGEIF(Pipeline!$I$8:$I$37,\"Fechado Ganho\",Pipeline!$O$8:$O$37)-AVERAGEIF(Pipeline!$I$8:$I$37,\"Fechado Ganho\",Pipeline!$H$8:$H$37),0),0)","v":43}]
[null,"Vendedor Destaque",{"$f":"IFERROR(INDEX($C$37:$C$43,MATCH(MAX($D$37:$D$43),$D$37:$D$43,0)),\"\")","v":"Camila Souza"}]
[null,"Receita do Destaque",{"$f":"IFERROR(MAX($D$37:$D$43),0)","v":{"v":111354.75,"d":"R$ 111,355"}}]
[null,"Produto Mais Vendido",{"$f":"IFERROR(INDEX($C$48:$C$57,MATCH(MAX($D$48:$D$57),$D$48:$D$57,0)),\"\")","v":"Licença ERP Corporate"}]
[null,"Receita do Produto Top",{"$f":"IFERROR(MAX($D$48:$D$57),0)","v":{"v":130440,"d":"R$ 130,440"}}]
[null,"Clientes Ativos",{"$f":"IFERROR(COUNTIF(Clientes!$L$8:$L$19,\"Sim\"),0)","v":11}]
[null,"Total de Clientes",{"$f":"IFERROR(COUNTIF(Clientes!$C$8:$C$19,\"C*\"),0)","v":12}]
[null,"Pipeline Parado (>15 dias)",{"$f":"IFERROR(COUNTIFS(Pipeline!$P$8:$P$37,\">15\",Pipeline!$Q$8:$Q$37,\"Em aberto\"),0)","v":18}]