{"text_format":"3","workbook":"xlsx","n_sheets":12,"sheets":["Instruções","Dashboard","Vendedores","Clientes","Produtos","Pipeline","Vendas","Comissões","Forecast","Metas","Agenda","Base de Cálculos"],"not_rendered":{"images":6,"macros":1,"defined_names":12},"read":"whole","date_system":"1900"}

{"sheet":"Instruções","index":0,"n_rows":99,"n_cols":13,"rows_kept":99,"merged":[[13,2,13,19],[18,2,18,19],[32,2,32,19],[42,2,42,19],[48,2,48,19],[64,2,64,19],[72,2,72,19],[82,2,82,19],[91,2,91,19]]}
["http://authenticator.sapphirebusinesstech.com:8080/access/v1/validate"]
["123456789",{"$nulls":4},"Any use for this file other than sample using and technical analysis without authorization is stricly prohibited and protected by copyright"]
["contact@sapphirebusinesstech.com",{"$nulls":4},"Qualquer uso desse arquivo sem autorização outro que uso de exemplo e análise técnica é extritamente proibida e protegida por direitos autorais."]
[{"$nulls":5},"Cualquier uso de este archivo sin autorización que no sea para fines de ejemplo o análisis técnico está estrictamente prohibido y está protegido por derechos de autor."]
[200]
[]
[{"$f":"IF(A12=\"\",0,TODAY()-A12)","v":0}]
[]
[]
[null,null,"INSTRUÇÕES DE USO"]
{"$rows_left_out":90}
{"sheet":"Dashboard","index":1,"n_rows":32,"n_cols":15,"rows_kept":32,"hidden":true,"merged":[[7,2,7,4],[7,5,7,7],[7,8,7,10],[7,11,7,13],[8,2,8,4],[8,5,8,7],[8,8,8,10],[8,11,8,13],[11,2,11,4],[11,5,11,7],[11,8,11,10],[11,11,11,13],[12,2,12,4],[12,5,12,7],[12,8,12,10],[12,11,12,13],[15,2,15,4],[15,5,15,7],[15,8,15,10],[15,11,15,13],[16,2,16,4],[16,5,16,7],[16,8,16,10],[16,11,16,13],[20,2,20,4],[20,5,20,7],[20,8,20,9],[20,11,20,12],[21,2,21,4],[21,5,21,7],[21,8,21,9],[21,11,21,12],[22,2,22,4],[22,5,22,7],[22,8,22,9],[22,11,22,12],[23,2,23,4],[23,5,23,7],[23,8,23,9],[23,11,23,12],[24,2,24,4],[24,5,24,7],[24,8,24,9],[24,11,24,12],[25,11,25,12],[26,11,26,12],[27,11,27,12],[28,11,28,12]]}
[]
[null,null,"DASHBOARD EXECUTIVO"]
[null,null,"Solução de Gestão de Operações Comerciais"]
[null,null,"Instruções","Dashboard","Vendedores","Clientes","Produtos","Pipeline","Vendas","Comissões","Forecast","Metas","Agenda"]
[]
[null,null,"INDICADORES PRINCIPAIS"]
[]
[null,null,"Total Vendido",null,null,"Em Negociação",null,null,"Receita Ponderada",null,null,"Ticket Médio"]
[null,null,{"$f":"'Base de Cálculos'!$C$69","v":{"v":520760.94999999995,"d":"R$ 520,761"}},null,null,{"$f":"'Base de Cálculos'!$C$70","v":{"v":578640,"d":"R$ 578,640"}},null,null,{"$f":"'Base de Cálculos'!$C$72","v":{"v":214528,"d":"R$ 214,528"}},null,null,{"$f":"'Base de Cálculos'!$C$73","v":{"v":20830.438,"d":"R$ 20,830"}}]
[]
{"$rows_left_out":23}
{"sheet":"Vendedores","index":2,"n_rows":15,"n_cols":13,"rows_kept":15,"hidden":true}
[]
[null,null,"CADASTRO DE VENDEDORES"]
[null,null,"Solução de Gestão de Operações Comerciais"]
[null,null,"Instruções","Dashboard","Vendedores","Clientes","Produtos","Pipeline","Vendas","Comissões","Forecast","Metas","Agenda"]
[]
[null,null,"Preencha os campos em azul. Código, Nome e Comissão Padrão são obrigatórios."]
[null,null,"Código","Nome","Equipe","Comissão Padrão","Meta Mensal","Ativo"]
[null,null,"V001","Ana Ribeiro","Equipe A",{"v":0.05,"d":"5.0%"},{"v":80000,"d":"R$ 80,000"},"Ativo"]
[null,null,"V002","Bruno Carvalho","Equipe A",{"v":0.045,"d":"4.5%"},{"v":70000,"d":"R$ 70,000"},"Ativo"]
[null,null,"V003","Camila Souza","Equipe B",{"v":0.06,"d":"6.0%"},{"v":95000,"d":"R$ 95,000"},"Ativo"]
{"$rows_left_out":6}
{"sheet":"Clientes","index":3,"n_rows":19,"n_cols":13,"rows_kept":19,"hidden":true}
[]
[null,null,"CADASTRO DE CLIENTES"]
[null,null,"Solução de Gestão de Operações Comerciais"]
[null,null,"Instruções","Dashboard","Vendedores","Clientes","Produtos","Pipeline","Vendas","Comissões","Forecast","Metas","Agenda"]
[]
[null,null,"Preencha os campos em azul. Use as listas suspensas em Segmento, Origem e Ativo."]
[null,null,"Código","Empresa","Contato","Telefone","Email","Cidade","Estado","Segmento","Origem","Ativo"]
[null,null,"C001","Alfa Indústria Ltda","Marcos Reis","(11) 3255-1010","marcos@alfaind.com.br","São Paulo","SP","Indústria","Indicação","Sim"]
[null,null,"C002","Beta Comércio SA","Patrícia Gomes","(21) 3777-2020","patricia@betacom.com.br","Rio de Janeiro","RJ","Comércio","Inbound","Sim"]
[null,null,"C003","Gamma Tech","Rodrigo Dias","(31) 3444-3030","rodrigo@gammatech.io","Belo Horizonte","MG","Tecnologia","Site","Sim"]
{"$rows_left_out":10}
{"sheet":"Produtos","index":4,"n_rows":17,"n_cols":13,"rows_kept":17,"hidden":true}
[]
[null,null,"CADASTRO DE PRODUTOS / SERVIÇOS"]
[null,null,"Solução de Gestão de Operações Comerciais"]
[null,null,"Instruções","Dashboard","Vendedores","Clientes","Produtos","Pipeline","Vendas","Comissões","Forecast","Metas","Agenda"]
[]
[null,null,"A Comissão Específica definida aqui é a que será usada no cálculo da comissão da venda."]
[null,null,"Código","Produto","Categoria","Preço Base","Comissão Específica","Ativo"]
[null,null,"P001","Licença ERP Corporate","Produto",{"v":48000,"d":"R$ 48,000"},{"v":0.05,"d":"5.0%"},"Ativo"]
[null,null,"P002","Licença ERP Starter","Produto",{"v":18000,"d":"R$ 18,000"},{"v":0.05,"d":"5.0%"},"Ativo"]
[null,null,"P003","Implantação Técnica","Serviço",{"v":26000,"d":"R$ 26,000"},{"v":0.04,"d":"4.0%"},"Ativo"]
{"$rows_left_out":8}
{"sheet":"Pipeline","index":5,"n_rows":37,"n_cols":17,"rows_kept":37,"hidden":true}
[]
[null,null,"PIPELINE COMERCIAL"]
[null,null,"Solução de Gestão de Operações Comerciais"]
[null,null,"Instruções","Dashboard","Vendedores","Clientes","Produtos","Pipeline","Vendas","Comissões","Forecast","Metas","Agenda"]
[]
[null,null,"Atualize a coluna Última Atualização semanalmente. Linhas em vermelho estão paradas há mais de 15 dias."]
[null,null,"Cód. Oport.","Cliente","Produto","Responsável","Origem","Data Entrada","Estágio","Probabilidade","Valor","Valor Ponderado","Próxima Ação","Data Próx. Ação","Última Atualização","Dias sem Atualização","Status"]
[null,null,"OP001","Alfa Indústria Ltda","Licença ERP Corporate","Ana Ribeiro","Indicação","2026-03-30","Lead",{"v":0.1,"d":"10%"},{"v":38400,"d":"R$ 38,400"},{"$f":"IFERROR(K8*J8,0)","v":{"v":3840,"d":"R$ 3,840"}},"Ligar para retomar","2026-11-05","2026-07-26",{"$f":"IF(O8=\"\",\"\",IFERROR(TODAY()-O8,\"\"))","v":18},"Em aberto"]
[null,null,"OP002","Beta Comércio SA","Plano Suporte Premium","Bruno Carvalho","Redes Sociais","2026-04-02","Lead",{"v":0.1,"d":"10%"},{"v":10560,"d":"R$ 10,560"},{"$f":"IFERROR(K9*J9,0)","v":{"v":1056,"d":"R$ 1,056"}},"Enviar proposta","2026-12-06","2026-07-23",{"$f":"IF(O9=\"\",\"\",IFERROR(TODAY()-O9,\"\"))","v":21},"Em aberto"]
[null,null,"OP003","Gamma Tech","Consultoria Estratégica","Camila Souza","Inbound","2026-04-05","Lead",{"v":0.1,"d":"10%"},{"v":33600,"d":"R$ 33,600"},{"v":3360,"d":"R$ 3,360"},"Agendar reunião","2026-11-07","2026-07-19",25,"Em aberto"]
{"$rows_left_out":28}
{"sheet":"Vendas","index":6,"n_rows":32,"n_cols":13,"rows_kept":32,"hidden":true}
[]
[null,null,"REGISTRO DE VENDAS"]
[null,null,"Solução de Gestão de Operações Comerciais"]
[null,null,"Instruções","Dashboard","Vendedores","Clientes","Produtos","Pipeline","Vendas","Comissões","Forecast","Metas","Agenda"]
[]
[null,null,"Informe Valor e Desconto. Valor Líquido, Comissão % e Comissão são calculados automaticamente."]
[null,null,"Venda","Data","Cliente","Produto","Vendedor","Valor","Desconto","Valor Líquido","Comissão %","Comissão","Pago"]
[null,null,"VD001","2026-01-03","Alfa Indústria Ltda","Licença ERP Corporate","Ana Ribeiro",{"v":40800,"d":"R$ 40,800"},{"v":0,"d":"0.0%"},{"$f":"IFERROR(H8*(1-I8),0)","v":{"v":40800,"d":"R$ 40,800"}},{"$f":"IFERROR(VLOOKUP(F8,Produtos!$D$8:$G$17,4,FALSE),IFERROR(VLOOKUP(G8,Vendedores!$D$8:$F$15,3,FALSE),0))","v":{"v":0.05,"d":"5.0%"}},{"$f":"ROUND(J8*K8,2)","v":{"v":2040,"d":"R$ 2,040"}},"Sim"]
[null,null,"VD002","2026-01-10","Gamma Tech","Plano Suporte Básico","Bruno Carvalho",{"v":4416,"d":"R$ 4,416"},{"v":0,"d":"0.0%"},{"$f":"IFERROR(H9*(1-I9),0)","v":{"v":4416,"d":"R$ 4,416"}},{"$f":"IFERROR(VLOOKUP(F9,Produtos!$D$8:$G$17,4,FALSE),IFERROR(VLOOKUP(G9,Vendedores!$D$8:$F$15,3,FALSE),0))","v":{"v":0.06,"d":"6.0%"}},{"$f":"ROUND(J9*K9,2)","v":{"v":264.96,"d":"R$ 265"}},"Sim"]
[null,null,"VD003","2026-02-17","Epsilon Educação","Treinamento Equipe","Camila Souza",{"v":9405,"d":"R$ 9,405"},{"v":0.05,"d":"5.0%"},{"v":8934.75,"d":"R$ 8,935"},{"$f":"IFERROR(VLOOKUP(F10,Produtos!$D$8:$G$17,4,FALSE),IFERROR(VLOOKUP(G10,Vendedores!$D$8:$F$15,3,FALSE),0))","v":{"v":0.04,"d":"4.0%"}},{"v":357.39,"d":"R$ 357"},"Sim"]
{"$rows_left_out":23}
{"sheet":"Comissões","index":7,"n_rows":36,"n_cols":13,"rows_kept":36,"hidden":true,"merged":[[7,2,7,3],[7,4,7,5],[7,6,7,7],[8,2,8,3],[8,4,8,5],[8,6,8,7]]}
[]
[null,null,"CONTROLE DE COMISSÕES"]
[null,null,"Solução de Gestão de Operações Comerciais"]
[null,null,"Instruções","Dashboard","Vendedores","Clientes","Produtos","Pipeline","Vendas","Comissões","Forecast","Metas","Agenda"]
[]
[null,null,"INDICADORES DE COMISSÃO"]
[]
[null,null,"Comissão Total",null,"Comissão Paga",null,"Comissão Pendente"]
[null,null,{"$f":"IFERROR(SUM(E12:E36),0)","v":{"v":30792.130000000005,"d":"R$ 30,792"}},null,{"$f":"IFERROR(SUMIF(G12:G36,\"Pago\",E12:E36),0)","v":{"v":24373.370000000003,"d":"R$ 24,373"}},null,{"$f":"IFERROR(SUMIF(G12:G36,\"Pendente\",E12:E36),0)","v":{"v":6418.76,"d":"R$ 6,419"}}]
[]
{"$rows_left_out":27}
{"sheet":"Forecast","index":8,"n_rows":37,"n_cols":13,"rows_kept":37,"hidden":true}
[]
[null,null,"FORECAST COMERCIAL"]
[null,null,"Solução de Gestão de Operações Comerciais"]
[null,null,"Instruções","Dashboard","Vendedores","Clientes","Produtos","Pipeline","Vendas","Comissões","Forecast","Metas","Agenda"]
[]
[null,null,"Aba automática. Espelha as oportunidades em aberto do Pipeline. Não editar."]
[null,null,"Oportunidade","Cliente","Valor","Probabilidade","Valor Ponderado","Mês Previsto",null,"RESUMO DO FORECAST"]
[null,null,{"$f":"IF(OR(Pipeline!I8=\"Fechado Ganho\",Pipeline!I8=\"Fechado Perdido\",Pipeline!I8=\"Cancelado\",Pipeline!C8=\"\"),\"\",Pipeline!C8)","v":"OP001"},{"$f":"IF($C8=\"\",\"\",Pipeline!D8)","v":"Alfa Indústria Ltda"},{"$f":"IF($C8=\"\",\"\",Pipeline!K8)","v":{"v":38400,"d":"R$ 38,400"}},{"$f":"IF($C8=\"\",\"\",Pipeline!J8)","v":{"v":0.1,"d":"10%"}},{"$f":"IF($C8=\"\",\"\",E8*F8)","v":{"v":3840,"d":"R$ 3,840"}},{"$f":"IF($C8=\"\",\"\",IFERROR(CHOOSE(MONTH(Pipeline!N8),\"jan\",\"fev\",\"mar\",\"abr\",\"mai\",\"jun\",\"jul\",\"ago\",\"set\",\"out\",\"nov\",\"dez\")&\"/\"&TEXT(YEAR(Pipeline!N8)-2000,\"00\"),\"\"))","v":"nov/26"}]
[null,null,{"$f":"IF(OR(Pipeline!I9=\"Fechado Ganho\",Pipeline!I9=\"Fechado Perdido\",Pipeline!I9=\"Cancelado\",Pipeline!C9=\"\"),\"\",Pipeline!C9)","v":"OP002"},{"$f":"IF($C9=\"\",\"\",Pipeline!D9)","v":"Beta Comércio SA"},{"$f":"IF($C9=\"\",\"\",Pipeline!K9)","v":{"v":10560,"d":"R$ 10,560"}},{"$f":"IF($C9=\"\",\"\",Pipeline!J9)","v":{"v":0.1,"d":"10%"}},{"v":1056,"d":"R$ 1,056"},{"$f":"IF($C9=\"\",\"\",IFERROR(CHOOSE(MONTH(Pipeline!N9),\"jan\",\"fev\",\"mar\",\"abr\",\"mai\",\"jun\",\"jul\",\"ago\",\"set\",\"out\",\"nov\",\"dez\")&\"/\"&TEXT(YEAR(Pipeline!N9)-2000,\"00\"),\"\"))","v":"dez/26"},null,"Forecast Total (bruto)",null,{"$f":"IFERROR(SUM(E8:E37),0)","v":{"v":578640,"d":"R$ 578,640"}}]
[null,null,{"$f":"IF(OR(Pipeline!I10=\"Fechado Ganho\",Pipeline!I10=\"Fechado Perdido\",Pipeline!I10=\"Cancelado\",Pipeline!C10=\"\"),\"\",Pipeline!C10)","v":"OP003"},{"$f":"IF($C10=\"\",\"\",Pipeline!D10)","v":"Gamma Tech"},{"$f":"IF($C10=\"\",\"\",Pipeline!K10)","v":{"v":33600,"d":"R$ 33,600"}},{"$f":"IF($C10=\"\",\"\",Pipeline!J10)","v":{"v":0.1,"d":"10%"}},{"v":3360,"d":"R$ 3,360"},{"$f":"IF($C10=\"\",\"\",IFERROR(CHOOSE(MONTH(Pipeline!N10),\"jan\",\"fev\",\"mar\",\"abr\",\"mai\",\"jun\",\"jul\",\"ago\",\"set\",\"out\",\"nov\",\"dez\")&\"/\"&TEXT(YEAR(Pipeline!N10)-2000,\"00\"),\"\"))","v":"nov/26"},null,"Forecast Ponderado",null,{"$f":"IFERROR(SUM(G8:G37),0)","v":{"v":214528,"d":"R$ 214,528"}}]
{"$rows_left_out":28}
{"sheet":"Metas","index":9,"n_rows":14,"n_cols":13,"rows_kept":14,"hidden":true}
[]
[null,null,"METAS COMERCIAIS"]
[null,null,"Solução de Gestão de Operações Comerciais"]
[null,null,"Instruções","Dashboard","Vendedores","Clientes","Produtos","Pipeline","Vendas","Comissões","Forecast","Metas","Agenda"]
[]
[null,null,"Defina as metas nos campos em azul. As colunas de realizado vêm das Vendas."]
[null,null,"Vendedor","Meta Receita","Meta Quantidade","Meta Comissão","Receita Realizada","Qtd. Realizada","Comissão Realizada","% Meta Receita","Falta Atingir","Situação"]
[null,null,"Ana Ribeiro",{"v":85000,"d":"R$ 85,000"},4,{"v":4200,"d":"R$ 4,200"},{"$f":"IFERROR(SUMIF(Vendas!$G$8:$G$32,$C8,Vendas!$J$8:$J$32),0)","v":{"v":92086.8,"d":"R$ 92,087"}},{"$f":"IFERROR(COUNTIF(Vendas!$G$8:$G$32,$C8),0)","v":4},{"$f":"IFERROR(SUMIF(Vendas!$G$8:$G$32,$C8,Vendas!$L$8:$L$32),0)","v":{"v":4499.88,"d":"R$ 4,500"}},{"$f":"IFERROR(G8/D8,0)","v":{"v":1.0833741176470588,"d":"108.3%"}},{"$f":"MAX(0,D8-G8)","v":0},{"$f":"IF(J8>=1,\"Meta atingida\",IF(J8>=0.7,\"Em rota\",\"Abaixo do esperado\"))","v":"Meta atingida"}]
[null,null,"Bruno Carvalho",{"v":95000,"d":"R$ 95,000"},5,{"v":5500,"d":"R$ 5,500"},{"$f":"IFERROR(SUMIF(Vendas!$G$8:$G$32,$C9,Vendas!$J$8:$J$32),0)","v":{"v":78691.8,"d":"R$ 78,692"}},{"$f":"IFERROR(COUNTIF(Vendas!$G$8:$G$32,$C9),0)","v":4},{"$f":"IFERROR(SUMIF(Vendas!$G$8:$G$32,$C9,Vendas!$L$8:$L$32),0)","v":{"v":6060.3099999999995,"d":"R$ 6,060"}},{"v":0.8283347368421053,"d":"82.8%"},{"v":16308.199999999997,"d":"R$ 16,308"},"Em rota"]
[null,null,"Camila Souza",{"v":105000,"d":"R$ 105,000"},4,{"v":5000,"d":"R$ 5,000"},{"$f":"IFERROR(SUMIF(Vendas!$G$8:$G$32,$C10,Vendas!$J$8:$J$32),0)","v":{"v":111354.75,"d":"R$ 111,355"}},{"$f":"IFERROR(COUNTIF(Vendas!$G$8:$G$32,$C10),0)","v":4},{"$f":"IFERROR(SUMIF(Vendas!$G$8:$G$32,$C10,Vendas!$L$8:$L$32),0)","v":{"v":5166.389999999999,"d":"R$ 5,166"}},{"v":1.0605214285714286,"d":"106.1%"},0,"Meta atingida"]
{"$rows_left_out":5}
{"sheet":"Agenda","index":10,"n_rows":27,"n_cols":13,"rows_kept":27,"hidden":true}
[]
[null,null,"AGENDA COMERCIAL"]
[null,null,"Solução de Gestão de Operações Comerciais"]
[null,null,"Instruções","Dashboard","Vendedores","Clientes","Produtos","Pipeline","Vendas","Comissões","Forecast","Metas","Agenda"]
[]
[null,null,"Programe as atividades. Linhas em vermelho estão com data vencida e pendentes."]
[null,null,"Data","Cliente","Responsável","Atividade","Prioridade","Status","Observações"]
[null,null,"2026-07-20","Alfa Indústria Ltda","Ana Ribeiro","Ligação","Alta","Pendente","Confirmar disponibilidade"]
[null,null,"2026-07-22","Beta Comércio SA","Bruno Carvalho","Visita","Média","Em andamento","Levar apresentação comercial"]
[null,null,"2026-07-24","Gamma Tech","Camila Souza","Follow-up","Baixa","Concluída","Retomar após feriado"]
{"$rows_left_out":18}
{"sheet":"Base de Cálculos","index":11,"n_rows":90,"n_cols":14,"rows_kept":90,"hidden":true}
[]
[null,null,"BASE DE CÁLCULOS (AUXILIAR)"]
[null,null,"Solução de Gestão de Operações Comerciais"]
[null,null,"Instruções","Dashboard","Vendedores","Clientes","Produtos","Pipeline","Vendas","Comissões","Forecast","Metas","Agenda"]
[]
[null,null,"Aba auxiliar — concentra listas de validação e todas as agregações. Não editar manualmente."]
[]
[null,null,"Equipes","SimNao","Segmentos","Origens","Estagios","Categorias","Prioridades","Atividades","StatusAtiv","StatusComissao","FormasPagto","StatusCadastro"]
[null,null,"Equipe A","Sim","Indústria","Indicação","Lead","Produto","Alta","Ligação","Pendente","Pendente","Boleto","Ativo"]
[null,null,"Equipe B","Não","Comércio","Site","Contato","Serviço","Média","Visita","Em andamento","Pago","PIX","Inativo"]
{"$rows_left_out":80}