{"text_format":"3","workbook":"xlsx","n_sheets":10,"sheets":["Instruções","CADASTROS","LANCAMENTOS_KPIS","RENTABILIDADE_PRODUTO","SIMULADOR","OKRS","METAS","PLANO_ACAO","CALCULOS","RELATORIOS"],"not_rendered":{"charts":1,"images":6,"macros":1},"read":"whole","date_system":"1900"}

{"sheet":"Instruções","index":0,"n_rows":76,"n_cols":12,"rows_kept":76,"merged":[[9,2,9,11]]}
["http://authenticator.sapphirebusinesstech.com:8080/access/v1/validate"]
["123456789",{"$nulls":5},"Any use for this file other than sample using and technical analysis without authorization is stricly prohibited and protected by copyright"]
["contact@sapphirebusinesstech.com",{"$nulls":5},"Qualquer uso desse arquivo sem autorização outro que uso de exemplo e análise técnica é extritamente proibida e protegida por direitos autorais."]
[{"$nulls":6},"Cualquier uso de este archivo sin autorización que no sea para fines de ejemplo o análisis técnico está estrictamente prohibido y está protegido por derechos de autor."]
[200]
[]
[{"$f":"IF(A12=\"\",0,TODAY()-A12)","v":0}]
[null,null,"Instruções","Cadastros","KPIs","Rentabilidade","Simulador","OKRs","Metas","Plano de Ação","Cálculos","Relatórios"]
[]
[null,null,"INSTRUÇÕES DE USO — PLANILHA DE GESTÃO EMPRESARIAL"]
{"$rows_left_out":67}
{"sheet":"CADASTROS","index":1,"n_rows":12,"n_cols":30,"rows_kept":12,"hidden":true,"merged":[[5,2,5,27]]}
[]
[null,"Instruções","Cadastros","KPIs","Rentabilidade","Simulador","OKRs","Metas","Plano de Ação","Cálculos","Relatórios"]
[]
[]
[]
[null,null,"CADASTROS"]
[null,null,"ID_Produto","Produto","Categoria","Unidade","Preco_Padrao","Custo_Padrao","Canal_Principal","Segmento","Status",null,"ID_Canal","Canal","Tipo_Canal","Responsavel","Custo_Medio_Mensal","Status",null,"ID_Area","Area","Gestor","Status",null,null,"ID_Indicador","Indicador","Unidade","Melhor_Leitura","Area_Responsavel"]
[null,null,"PRD001","Produto Exemplo 1","Software","licença",{"v":500,"d":"R£ 500.00"},{"v":150,"d":"R£ 150.00"},"Online","PME","Ativo",null,"CAN001","Online","Digital",null,{"v":1000,"d":"R£ 1,000.00"},"Ativo",null,"AREA001","Comercial",null,"Ativo",null,null,"IND001","Receita Líquida","R$","Maior é melhor","Comercial"]
[null,null,"PRD002","Produto Exemplo 2","Consultoria","pacote",{"v":2000,"d":"R£ 2,000.00"},{"v":800,"d":"R£ 800.00"},"Indicação","Corporativo","Ativo",null,"CAN002","Indicação","Orgânico",null,{"v":0,"d":"R£ 0.00"},"Ativo",null,"AREA002","Marketing",null,"Ativo",null,null,"IND002","CAC","R$","Menor é melhor","Marketing"]
[{"$nulls":19},"AREA003","Operações",null,"Ativo",null,null,"IND003","Churn","%","Menor é melhor","Comercial"]
{"$rows_left_out":3}
{"sheet":"LANCAMENTOS_KPIS","index":2,"n_rows":19,"n_cols":28,"rows_kept":19,"hidden":true,"merged":[[5,2,5,27]]}
[]
[null,"Instruções","Cadastros","KPIs","Rentabilidade","Simulador","OKRs","Metas","Plano de Ação","Cálculos","Relatórios"]
[]
[]
[]
[null,null,"LANÇAMENTOS DE KPIs"]
[null,null,"Ano","Mes","Data_Ref","Receita_Bruta","Deducoes","Receita_Liquida","Custos_Variaveis","Margem_Contribuicao_Valor","Margem_Contribuicao_%","Custos_Fixos","Lucro_Operacional","Investimento_Marketing","Leads","Vendas","Taxa_Conversao","Novos_Clientes","Clientes_Ativos","Clientes_Perdidos","Churn_%","CAC","Ticket_Medio","Receita_Recorrente","LTV","Payback_CAC","Ponto_Equilibrio","Observacoes"]
[null,null,2026,1,{"$f":"DATE(C8,D8,1)","v":"2026-01-01"},null,null,{"$f":"F8-G8","v":{"v":0,"d":"R£ 0.00"}},null,{"$f":"H8-I8","v":{"v":0,"d":"R£ 0.00"}},{"$f":"IF(H8=0,0,J8/H8)","v":{"v":0,"d":"0.00%"}},null,{"$f":"J8-L8","v":{"v":0,"d":"R£ 0.00"}},{"$nulls":3},{"$f":"IF(O8=0,0,P8/O8)","v":{"v":0,"d":"0.00%"}},{"$nulls":3},{"$f":"IF(S8=0,0,T8/S8)","v":{"v":0,"d":"0.00%"}},{"$f":"IF(R8=0,0,N8/R8)","v":{"v":0,"d":"R£ 0.00"}},{"$f":"IF(P8=0,0,H8/P8)","v":{"v":0,"d":"R£ 0.00"}},null,null,{"$f":"IF(J8=0,0,V8/IF(P8=0,0,J8/P8))","v":{"v":0,"d":"0.00"}},{"$f":"IF(K8=0,0,L8/K8)","v":{"v":0,"d":"R£ 0.00"}}]
[null,null,2026,1,{"$f":"DATE(C9,D9,1)","v":"2026-01-01"},null,null,{"$f":"F9-G9","v":{"v":0,"d":"R£ 0.00"}},null,{"$f":"H9-I9","v":{"v":0,"d":"R£ 0.00"}},{"$f":"IF(H9=0,0,J9/H9)","v":{"v":0,"d":"0.00%"}},null,{"$f":"J9-L9","v":{"v":0,"d":"R£ 0.00"}},{"$nulls":3},{"$f":"IF(O9=0,0,P9/O9)","v":{"v":0,"d":"0.00%"}},{"$nulls":3},{"$f":"IF(S9=0,0,T9/S9)","v":{"v":0,"d":"0.00%"}},{"$f":"IF(R9=0,0,N9/R9)","v":{"v":0,"d":"R£ 0.00"}},{"$f":"IF(P9=0,0,H9/P9)","v":{"v":0,"d":"R£ 0.00"}},null,null,{"$f":"IF(J9=0,0,V9/IF(P9=0,0,J9/P9))","v":{"v":0,"d":"0.00"}},{"$f":"IF(K9=0,0,L9/K9)","v":{"v":0,"d":"R£ 0.00"}}]
[null,null,2026,1,"2026-01-01",null,null,{"v":0,"d":"R£ 0.00"},null,{"v":0,"d":"R£ 0.00"},{"v":0,"d":"0.00%"},null,{"v":0,"d":"R£ 0.00"},{"$nulls":3},{"v":0,"d":"0.00%"},{"$nulls":3},{"v":0,"d":"0.00%"},{"v":0,"d":"R£ 0.00"},{"v":0,"d":"R£ 0.00"},null,null,{"v":0,"d":"0.00"},{"v":0,"d":"R£ 0.00"}]
{"$rows_left_out":10}
{"sheet":"RENTABILIDADE_PRODUTO","index":3,"n_rows":19,"n_cols":19,"rows_kept":19,"hidden":true,"merged":[[5,2,5,27]]}
[]
[null,"Instruções","Cadastros","KPIs","Rentabilidade","Simulador","OKRs","Metas","Plano de Ação","Cálculos","Relatórios"]
[]
[]
[]
[null,null,"RENTABILIDADE POR PRODUTO"]
[null,null,"Data","Ano","Mes","ID_Produto","Produto","Categoria","Quantidade","Preco_Unitario","Receita_Bruta","Custo_Unitario","Custo_Total","Margem_Valor","Margem_%","Canal","Segmento","Status_Rentabilidade","Observacoes"]
[{"$nulls":3},{"$f":"IF(C8=\"\",\"\",YEAR(C8))","v":""},{"$f":"IF(C8=\"\",\"\",MONTH(C8))","v":""},null,{"$f":"IFERROR(VLOOKUP(F8,CADASTROS!$C:$K,2,FALSE),\"\")","v":""},{"$f":"IFERROR(VLOOKUP(F8,CADASTROS!$C:$K,3,FALSE),\"\")","v":""},null,null,{"$f":"I8*J8","v":{"v":0,"d":"R£ 0.00"}},null,{"$f":"I8*L8","v":{"v":0,"d":"R£ 0.00"}},{"$f":"K8-M8","v":{"v":0,"d":"R£ 0.00"}},{"$f":"IF(K8=0,0,N8/K8)","v":{"v":0,"d":"0.00%"}},null,null,{"$f":"IF(O8>=0.4,\"Alta\",IF(O8>=0.2,\"Média\",\"Baixa\"))","v":"Baixa"}]
[{"$nulls":3},{"$f":"IF(C9=\"\",\"\",YEAR(C9))","v":""},{"$f":"IF(C9=\"\",\"\",MONTH(C9))","v":""},null,{"$f":"IFERROR(VLOOKUP(F9,CADASTROS!$C:$K,2,FALSE),\"\")","v":""},{"$f":"IFERROR(VLOOKUP(F9,CADASTROS!$C:$K,3,FALSE),\"\")","v":""},null,null,{"$f":"I9*J9","v":{"v":0,"d":"R£ 0.00"}},null,{"$f":"I9*L9","v":{"v":0,"d":"R£ 0.00"}},{"$f":"K9-M9","v":{"v":0,"d":"R£ 0.00"}},{"$f":"IF(K9=0,0,N9/K9)","v":{"v":0,"d":"0.00%"}},null,null,{"$f":"IF(O9>=0.4,\"Alta\",IF(O9>=0.2,\"Média\",\"Baixa\"))","v":"Baixa"}]
[{"$nulls":3},"","",null,{"$f":"IFERROR(VLOOKUP(F10,CADASTROS!$C:$K,2,FALSE),\"\")","v":""},{"$f":"IFERROR(VLOOKUP(F10,CADASTROS!$C:$K,3,FALSE),\"\")","v":""},null,null,{"v":0,"d":"R£ 0.00"},null,{"v":0,"d":"R£ 0.00"},{"v":0,"d":"R£ 0.00"},{"v":0,"d":"0.00%"},null,null,"Baixa"]
{"$rows_left_out":10}
{"sheet":"SIMULADOR","index":4,"n_rows":19,"n_cols":12,"rows_kept":19,"hidden":true,"merged":[[5,2,5,27]]}
[]
[null,"Instruções","Cadastros","KPIs","Rentabilidade","Simulador","OKRs","Metas","Plano de Ação","Cálculos","Relatórios"]
[]
[]
[]
[null,null,"SIMULADOR DE CENÁRIOS"]
[null,null,"PREMISSAS BASE",null,"Valor",null,"PARÂMETROS DE CENÁRIO","Valor",null,null,"RESULTADOS SIMULADOS","Valor"]
[null,null,"Receita Base",null,{"v":0,"d":"R£ 0.00"},null,"Cenário","Realista",null,null,"Receita Simulada",{"$f":"E8*(1+H9)","v":{"v":0,"d":"R£ 0.00"}}]
[null,null,"Custos Variáveis Base",null,{"v":0,"d":"R£ 0.00"},null,"Ajuste Receita %",{"v":0,"d":"0.00%"},null,null,"Custo Variável Simulado",{"$f":"E9*(1+H12)","v":{"v":0,"d":"R£ 0.00"}}]
[null,null,"Custos Fixos Base",null,{"v":0,"d":"R£ 0.00"},null,"Ajuste Volume %",{"v":0,"d":"0.00%"},null,null,"Custo Fixo Simulado",{"$f":"E10*(1+H13)","v":{"v":0,"d":"R£ 0.00"}}]
{"$rows_left_out":10}
{"sheet":"OKRS","index":5,"n_rows":19,"n_cols":25,"rows_kept":19,"hidden":true,"merged":[[5,2,5,27]]}
[]
[null,"Instruções","Cadastros","KPIs","Rentabilidade","Simulador","OKRs","Metas","Plano de Ação","Cálculos","Relatórios"]
[]
[]
[]
[null,null,"OKRs — OBJETIVOS E RESULTADOS-CHAVE"]
[null,null,"ID_Objetivo","Ciclo","Area","Objetivo","Responsavel","Prioridade","Data_Inicio","Data_Fim","Status_Objetivo","ID_KR","Resultado_Chave","Peso_KR","Meta_KR","Realizado_KR","%_Conclusao_KR","Status_KR","KPI_Relacionado","Iniciativa_Relacionada","Risco","Observacoes",null,"RESUMO OKRs"]
[{"$nulls":16},{"$f":"IF(O8=0,0,P8/O8)","v":{"v":0,"d":"0.00%"}},{"$f":"IF(L8=\"\",\"\",IF(Q8>=1,\"Concluído\",IF(AND(J8<>\"\",TODAY()>J8),\"Atrasado\",IF(Q8=0,\"Não iniciado\",\"Em andamento\"))))","v":""},{"$nulls":5},"Total Objetivos",{"$f":"COUNTIF(C8:C100,\"<>\")","v":0}]
[{"$nulls":16},{"$f":"IF(O9=0,0,P9/O9)","v":{"v":0,"d":"0.00%"}},{"$f":"IF(L9=\"\",\"\",IF(Q9>=1,\"Concluído\",IF(AND(J9<>\"\",TODAY()>J9),\"Atrasado\",IF(Q9=0,\"Não iniciado\",\"Em andamento\"))))","v":""},{"$nulls":5},"% Médio Conclusão",{"$f":"IF(Y8=0,0,AVERAGEIF(Q8:Q100,\">0\"))","v":{"v":0,"d":"0.00%"}}]
[{"$nulls":16},{"v":0,"d":"0.00%"},"",{"$nulls":5},"OKRs Atrasados",{"$f":"COUNTIF(R8:R100,\"Atrasado\")","v":0}]
{"$rows_left_out":10}
{"sheet":"METAS","index":6,"n_rows":10,"n_cols":12,"rows_kept":10,"hidden":true,"merged":[[5,2,5,27]]}
[]
[null,"Instruções","Cadastros","KPIs","Rentabilidade","Simulador","OKRs","Metas","Plano de Ação","Cálculos","Relatórios"]
[]
[]
[]
[null,null,"METAS — ACOMPANHAMENTO"]
[null,null,"Ano","Mes","Indicador","Area","Meta","Realizado","Desvio_Valor","Desvio_%","Status_Meta","Observacoes"]
[{"$nulls":8},{"$f":"H8-G8","v":{"v":0,"d":"0.00"}},{"$f":"IF(G8=0,0,I8/G8)","v":{"v":0,"d":"0.00%"}},{"$f":"IF(OR(G8=\"\",H8=\"\"),\"\",IF(H8>=G8,\"Atingida\",\"Abaixo\"))","v":""}]
[null,null,"Ano","Mes","Indicador","Area","Meta","Realizado","Desvio_Valor","Desvio_%","Status_Meta","Observacoes"]
[{"$nulls":8},{"$f":"H10-G10","v":{"v":0,"d":"0.00"}},{"$f":"IF(G10=0,0,I10/G10)","v":{"v":0,"d":"0.00%"}},{"$f":"IF(OR(G10=\"\",H10=\"\"),\"\",IF(H10>=G10,\"Atingida\",\"Abaixo\"))","v":""}]
{"$rows_left_out":1}
{"sheet":"PLANO_ACAO","index":7,"n_rows":9,"n_cols":15,"rows_kept":9,"hidden":true,"merged":[[5,2,5,27]]}
[]
[null,"Instruções","Cadastros","KPIs","Rentabilidade","Simulador","OKRs","Metas","Plano de Ação","Cálculos","Relatórios"]
[]
[]
[]
[null,null,"PLANO DE AÇÃO"]
[null,null,"ID_Acao","Data_Registro","Area","KPI_ou_OKR_Relacionado","Problema_Oportunidade","Acao_Proposta","Responsavel","Prioridade","Prazo","Status","Impacto_Esperado","Data_Conclusao","Observacoes"]
[]
[null,null,"ID_Acao","Data_Registro","Area","KPI_ou_OKR_Relacionado","Problema_Oportunidade","Acao_Proposta","Responsavel","Prioridade","Prazo","Status","Impacto_Esperado","Data_Conclusao","Observacoes"]

{"sheet":"CALCULOS","index":8,"n_rows":19,"n_cols":49,"rows_kept":19,"hidden":true,"merged":[[5,2,5,27]]}
[]
[null,"Instruções","Cadastros","KPIs","Rentabilidade","Simulador","OKRs","Metas","Plano de Ação","Cálculos","Relatórios"]
[]
[]
[]
[null,null,"CÁLCULOS E AGREGAÇÕES"]
[null,null,"Ano","Mes","Receita_Liquida","Margem_Contribuicao_Valor","Margem_Contribuicao_%","Lucro_Operacional","CAC","LTV","Payback_CAC","Ponto_Equilibrio","Taxa_Conversao","Ticket_Medio","Churn_%",null,null,"ID_Produto","Produto","Receita_Total","Custo_Total","Margem_Valor","Margem_%","Quantidade_Total","Participacao_Receita","Ranking_Receita","Ranking_Margem","Classificacao_ABC",null,"Canal","Receita","Vendas","Ticket_Medio","Participacao",null,"Ano","Mes","Indicador","Meta","Realizado","Desvio","Status",null,"Ciclo","Area","Objetivo","%_Medio_KRs","Status_Geral","Responsavel"]
[null,null,2026,1,{"$f":"SUMIFS(LANCAMENTOS_KPIS!$H:$H,LANCAMENTOS_KPIS!$C:$C,C8,LANCAMENTOS_KPIS!$D:$D,D8)","v":{"v":0,"d":"R£ 0.00"}},{"$f":"SUMIFS(LANCAMENTOS_KPIS!$J:$J,LANCAMENTOS_KPIS!$C:$C,C8,LANCAMENTOS_KPIS!$D:$D,D8)","v":{"v":0,"d":"R£ 0.00"}},{"$f":"IF(E8=0,0,F8/E8)","v":{"v":0,"d":"0.00%"}},{"$f":"SUMIFS(LANCAMENTOS_KPIS!$M:$M,LANCAMENTOS_KPIS!$C:$C,C8,LANCAMENTOS_KPIS!$D:$D,D8)","v":{"v":0,"d":"R£ 0.00"}},{"$f":"IFERROR(SUMIFS(LANCAMENTOS_KPIS!$N:$N,LANCAMENTOS_KPIS!$C:$C,C8,LANCAMENTOS_KPIS!$D:$D,D8)/SUMIFS(LANCAMENTOS_KPIS!$R:$R,LANCAMENTOS_KPIS!$C:$C,C8,LANCAMENTOS_KPIS!$D:$D,D8),0)","v":{"v":0,"d":"R£ 0.00"}},{"$f":"SUMIFS(LANCAMENTOS_KPIS!$Y:$Y,LANCAMENTOS_KPIS!$C:$C,C8,LANCAMENTOS_KPIS!$D:$D,D8)","v":{"v":0,"d":"R£ 0.00"}},{"$f":"IFERROR(SUMIFS(LANCAMENTOS_KPIS!$Z:$Z,LANCAMENTOS_KPIS!$C:$C,C8,LANCAMENTOS_KPIS!$D:$D,D8),0)","v":{"v":0,"d":"0.00"}},{"$f":"SUMIFS(LANCAMENTOS_KPIS!$AA:$AA,LANCAMENTOS_KPIS!$C:$C,C8,LANCAMENTOS_KPIS!$D:$D,D8)","v":{"v":0,"d":"R£ 0.00"}},{"$f":"IF(SUMIFS(LANCAMENTOS_KPIS!$O:$O,LANCAMENTOS_KPIS!$C:$C,C8,LANCAMENTOS_KPIS!$D:$D,D8)=0,0,SUMIFS(LANCAMENTOS_KPIS!$P:$P,LANCAMENTOS_KPIS!$C:$C,C8,LANCAMENTOS_KPIS!$D:$D,D8)/SUMIFS(LANCAMENTOS_KPIS!$O:$O,LANCAMENTOS_KPIS!$C:$C,C8,LANCAMENTOS_KPIS!$D:$D,D8))","v":{"v":0,"d":"0.00%"}},{"$f":"IFERROR(SUMIFS(LANCAMENTOS_KPIS!$H:$H,LANCAMENTOS_KPIS!$C:$C,C8,LANCAMENTOS_KPIS!$D:$D,D8)/SUMIFS(LANCAMENTOS_KPIS!$P:$P,LANCAMENTOS_KPIS!$C:$C,C8,LANCAMENTOS_KPIS!$D:$D,D8),0)","v":{"v":0,"d":"R£ 0.00"}},{"$f":"IFERROR(SUMIFS(LANCAMENTOS_KPIS!$T:$T,LANCAMENTOS_KPIS!$C:$C,C8,LANCAMENTOS_KPIS!$D:$D,D8)/SUMIFS(LANCAMENTOS_KPIS!$S:$S,LANCAMENTOS_KPIS!$C:$C,C8,LANCAMENTOS_KPIS!$D:$D,D8),0)","v":{"v":0,"d":"0.00%"}},{"$nulls":3},{"$f":"IFERROR(VLOOKUP(R8,CADASTROS!$C:$K,2,FALSE),\"\")","v":""},{"$f":"IF(R8=\"\",0,SUMIFS(RENTABILIDADE_PRODUTO!$K:$K,RENTABILIDADE_PRODUTO!$F:$F,R8))","v":{"v":0,"d":"R£ 0.00"}},{"$f":"IF(R8=\"\",0,SUMIFS(RENTABILIDADE_PRODUTO!$M:$M,RENTABILIDADE_PRODUTO!$F:$F,R8))","v":{"v":0,"d":"R£ 0.00"}},{"$f":"T8-U8","v":{"v":0,"d":"R£ 0.00"}},{"$f":"IF(T8=0,0,V8/T8)","v":{"v":0,"d":"0.00%"}},{"$f":"IF(R8=\"\",0,SUMIFS(RENTABILIDADE_PRODUTO!$I:$I,RENTABILIDADE_PRODUTO!$F:$F,R8))","v":0},{"$f":"IF(SUM($T$8:$T$100)=0,0,T8/SUM($T$8:$T$100))","v":{"v":0,"d":"0.00%"}},{"$f":"IF(T8=0,\"\",RANK(T8,$T$8:$T$100,0))","v":""},{"$f":"IF(V8=0,\"\",RANK(V8,$V$8:$V$100,0))","v":""},{"$f":"IF(Y8=\"\",\"\",IF(Y8>=0.15,\"A\",IF(Y8>=0.05,\"B\",\"C\")))","v":"C"},null,null,{"$f":"IF(AD8=\"\",0,SUMIFS(RENTABILIDADE_PRODUTO!$K:$K,RENTABILIDADE_PRODUTO!$P:$P,AD8))","v":{"v":0,"d":"R£ 0.00"}},{"$f":"IF(AD8=\"\",0,SUMIFS(RENTABILIDADE_PRODUTO!$I:$I,RENTABILIDADE_PRODUTO!$P:$P,AD8))","v":0},{"$f":"IF(AF8=0,0,AE8/AF8)","v":{"v":0,"d":"R£ 0.00"}},{"$f":"IF(SUM($AE$8:$AE$100)=0,0,AE8/SUM($AE$8:$AE$100))","v":{"v":0,"d":"0.00%"}},null,{"$f":"METAS!C8","v":0},{"$f":"METAS!D8","v":0},{"$f":"METAS!E8","v":0},{"$f":"METAS!G8","v":{"v":0,"d":"0.00"}},{"$f":"METAS!H8","v":{"v":0,"d":"0.00"}},{"$f":"AN8-AM8","v":{"v":0,"d":"0.00"}},{"$f":"METAS!K8","v":""},null,{"$f":"OKRS!D8","v":0},{"$f":"OKRS!E8","v":0},{"$f":"OKRS!F8","v":0},{"$f":"OKRS!Q8","v":{"v":0,"d":"0.00%"}},{"$f":"OKRS!R8","v":""},{"$f":"OKRS!G8","v":0}]
[null,null,2026,1,{"$f":"SUMIFS(LANCAMENTOS_KPIS!$H:$H,LANCAMENTOS_KPIS!$C:$C,C9,LANCAMENTOS_KPIS!$D:$D,D9)","v":{"v":0,"d":"R£ 0.00"}},{"$f":"SUMIFS(LANCAMENTOS_KPIS!$J:$J,LANCAMENTOS_KPIS!$C:$C,C9,LANCAMENTOS_KPIS!$D:$D,D9)","v":{"v":0,"d":"R£ 0.00"}},{"$f":"IF(E9=0,0,F9/E9)","v":{"v":0,"d":"0.00%"}},{"$f":"SUMIFS(LANCAMENTOS_KPIS!$M:$M,LANCAMENTOS_KPIS!$C:$C,C9,LANCAMENTOS_KPIS!$D:$D,D9)","v":{"v":0,"d":"R£ 0.00"}},{"$f":"IFERROR(SUMIFS(LANCAMENTOS_KPIS!$N:$N,LANCAMENTOS_KPIS!$C:$C,C9,LANCAMENTOS_KPIS!$D:$D,D9)/SUMIFS(LANCAMENTOS_KPIS!$R:$R,LANCAMENTOS_KPIS!$C:$C,C9,LANCAMENTOS_KPIS!$D:$D,D9),0)","v":{"v":0,"d":"R£ 0.00"}},{"$f":"SUMIFS(LANCAMENTOS_KPIS!$Y:$Y,LANCAMENTOS_KPIS!$C:$C,C9,LANCAMENTOS_KPIS!$D:$D,D9)","v":{"v":0,"d":"R£ 0.00"}},{"$f":"IFERROR(SUMIFS(LANCAMENTOS_KPIS!$Z:$Z,LANCAMENTOS_KPIS!$C:$C,C9,LANCAMENTOS_KPIS!$D:$D,D9),0)","v":{"v":0,"d":"0.00"}},{"$f":"SUMIFS(LANCAMENTOS_KPIS!$AA:$AA,LANCAMENTOS_KPIS!$C:$C,C9,LANCAMENTOS_KPIS!$D:$D,D9)","v":{"v":0,"d":"R£ 0.00"}},{"$f":"IF(SUMIFS(LANCAMENTOS_KPIS!$O:$O,LANCAMENTOS_KPIS!$C:$C,C9,LANCAMENTOS_KPIS!$D:$D,D9)=0,0,SUMIFS(LANCAMENTOS_KPIS!$P:$P,LANCAMENTOS_KPIS!$C:$C,C9,LANCAMENTOS_KPIS!$D:$D,D9)/SUMIFS(LANCAMENTOS_KPIS!$O:$O,LANCAMENTOS_KPIS!$C:$C,C9,LANCAMENTOS_KPIS!$D:$D,D9))","v":{"v":0,"d":"0.00%"}},{"$f":"IFERROR(SUMIFS(LANCAMENTOS_KPIS!$H:$H,LANCAMENTOS_KPIS!$C:$C,C9,LANCAMENTOS_KPIS!$D:$D,D9)/SUMIFS(LANCAMENTOS_KPIS!$P:$P,LANCAMENTOS_KPIS!$C:$C,C9,LANCAMENTOS_KPIS!$D:$D,D9),0)","v":{"v":0,"d":"R£ 0.00"}},{"$f":"IFERROR(SUMIFS(LANCAMENTOS_KPIS!$T:$T,LANCAMENTOS_KPIS!$C:$C,C9,LANCAMENTOS_KPIS!$D:$D,D9)/SUMIFS(LANCAMENTOS_KPIS!$S:$S,LANCAMENTOS_KPIS!$C:$C,C9,LANCAMENTOS_KPIS!$D:$D,D9),0)","v":{"v":0,"d":"0.00%"}},{"$nulls":3},{"$f":"IFERROR(VLOOKUP(R9,CADASTROS!$C:$K,2,FALSE),\"\")","v":""},{"$f":"IF(R9=\"\",0,SUMIFS(RENTABILIDADE_PRODUTO!$K:$K,RENTABILIDADE_PRODUTO!$F:$F,R9))","v":{"v":0,"d":"R£ 0.00"}},{"$f":"IF(R9=\"\",0,SUMIFS(RENTABILIDADE_PRODUTO!$M:$M,RENTABILIDADE_PRODUTO!$F:$F,R9))","v":{"v":0,"d":"R£ 0.00"}},{"$f":"T9-U9","v":{"v":0,"d":"R£ 0.00"}},{"$f":"IF(T9=0,0,V9/T9)","v":{"v":0,"d":"0.00%"}},{"$f":"IF(R9=\"\",0,SUMIFS(RENTABILIDADE_PRODUTO!$I:$I,RENTABILIDADE_PRODUTO!$F:$F,R9))","v":0},{"$f":"IF(SUM($T$8:$T$100)=0,0,T9/SUM($T$8:$T$100))","v":{"v":0,"d":"0.00%"}},{"$f":"IF(T9=0,\"\",RANK(T9,$T$8:$T$100,0))","v":""},{"$f":"IF(V9=0,\"\",RANK(V9,$V$8:$V$100,0))","v":""},{"$f":"IF(Y9=\"\",\"\",IF(Y9>=0.15,\"A\",IF(Y9>=0.05,\"B\",\"C\")))","v":"C"},null,null,{"$f":"IF(AD9=\"\",0,SUMIFS(RENTABILIDADE_PRODUTO!$K:$K,RENTABILIDADE_PRODUTO!$P:$P,AD9))","v":{"v":0,"d":"R£ 0.00"}},{"$f":"IF(AD9=\"\",0,SUMIFS(RENTABILIDADE_PRODUTO!$I:$I,RENTABILIDADE_PRODUTO!$P:$P,AD9))","v":0},{"$f":"IF(AF9=0,0,AE9/AF9)","v":{"v":0,"d":"R£ 0.00"}},{"$f":"IF(SUM($AE$8:$AE$100)=0,0,AE9/SUM($AE$8:$AE$100))","v":{"v":0,"d":"0.00%"}},null,{"$f":"METAS!C9","v":"Ano"},{"$f":"METAS!D9","v":"Mes"},{"$f":"METAS!E9","v":"Indicador"},{"$f":"METAS!G9","v":"Meta"},{"$f":"METAS!H9","v":"Realizado"},{"$f":"AN9-AM9","v":{"$error":"#VALUE!"}},{"$f":"METAS!K9","v":"Status_Meta"},null,{"$f":"OKRS!D9","v":0},{"$f":"OKRS!E9","v":0},{"$f":"OKRS!F9","v":0},{"$f":"OKRS!Q9","v":{"v":0,"d":"0.00%"}},{"$f":"OKRS!R9","v":""},{"$f":"OKRS!G9","v":0}]
[null,null,2026,1,{"$f":"SUMIFS(LANCAMENTOS_KPIS!$H:$H,LANCAMENTOS_KPIS!$C:$C,C10,LANCAMENTOS_KPIS!$D:$D,D10)","v":{"v":0,"d":"R£ 0.00"}},{"$f":"SUMIFS(LANCAMENTOS_KPIS!$J:$J,LANCAMENTOS_KPIS!$C:$C,C10,LANCAMENTOS_KPIS!$D:$D,D10)","v":{"v":0,"d":"R£ 0.00"}},{"v":0,"d":"0.00%"},{"$f":"SUMIFS(LANCAMENTOS_KPIS!$M:$M,LANCAMENTOS_KPIS!$C:$C,C10,LANCAMENTOS_KPIS!$D:$D,D10)","v":{"v":0,"d":"R£ 0.00"}},{"$f":"IFERROR(SUMIFS(LANCAMENTOS_KPIS!$N:$N,LANCAMENTOS_KPIS!$C:$C,C10,LANCAMENTOS_KPIS!$D:$D,D10)/SUMIFS(LANCAMENTOS_KPIS!$R:$R,LANCAMENTOS_KPIS!$C:$C,C10,LANCAMENTOS_KPIS!$D:$D,D10),0)","v":{"v":0,"d":"R£ 0.00"}},{"$f":"SUMIFS(LANCAMENTOS_KPIS!$Y:$Y,LANCAMENTOS_KPIS!$C:$C,C10,LANCAMENTOS_KPIS!$D:$D,D10)","v":{"v":0,"d":"R£ 0.00"}},{"$f":"IFERROR(SUMIFS(LANCAMENTOS_KPIS!$Z:$Z,LANCAMENTOS_KPIS!$C:$C,C10,LANCAMENTOS_KPIS!$D:$D,D10),0)","v":{"v":0,"d":"0.00"}},{"$f":"SUMIFS(LANCAMENTOS_KPIS!$AA:$AA,LANCAMENTOS_KPIS!$C:$C,C10,LANCAMENTOS_KPIS!$D:$D,D10)","v":{"v":0,"d":"R£ 0.00"}},{"$f":"IF(SUMIFS(LANCAMENTOS_KPIS!$O:$O,LANCAMENTOS_KPIS!$C:$C,C10,LANCAMENTOS_KPIS!$D:$D,D10)=0,0,SUMIFS(LANCAMENTOS_KPIS!$P:$P,LANCAMENTOS_KPIS!$C:$C,C10,LANCAMENTOS_KPIS!$D:$D,D10)/SUMIFS(LANCAMENTOS_KPIS!$O:$O,LANCAMENTOS_KPIS!$C:$C,C10,LANCAMENTOS_KPIS!$D:$D,D10))","v":{"v":0,"d":"0.00%"}},{"$f":"IFERROR(SUMIFS(LANCAMENTOS_KPIS!$H:$H,LANCAMENTOS_KPIS!$C:$C,C10,LANCAMENTOS_KPIS!$D:$D,D10)/SUMIFS(LANCAMENTOS_KPIS!$P:$P,LANCAMENTOS_KPIS!$C:$C,C10,LANCAMENTOS_KPIS!$D:$D,D10),0)","v":{"v":0,"d":"R£ 0.00"}},{"$f":"IFERROR(SUMIFS(LANCAMENTOS_KPIS!$T:$T,LANCAMENTOS_KPIS!$C:$C,C10,LANCAMENTOS_KPIS!$D:$D,D10)/SUMIFS(LANCAMENTOS_KPIS!$S:$S,LANCAMENTOS_KPIS!$C:$C,C10,LANCAMENTOS_KPIS!$D:$D,D10),0)","v":{"v":0,"d":"0.00%"}},{"$nulls":3},{"$f":"IFERROR(VLOOKUP(R10,CADASTROS!$C:$K,2,FALSE),\"\")","v":""},{"$f":"IF(R10=\"\",0,SUMIFS(RENTABILIDADE_PRODUTO!$K:$K,RENTABILIDADE_PRODUTO!$F:$F,R10))","v":{"v":0,"d":"R£ 0.00"}},{"$f":"IF(R10=\"\",0,SUMIFS(RENTABILIDADE_PRODUTO!$M:$M,RENTABILIDADE_PRODUTO!$F:$F,R10))","v":{"v":0,"d":"R£ 0.00"}},{"v":0,"d":"R£ 0.00"},{"v":0,"d":"0.00%"},{"$f":"IF(R10=\"\",0,SUMIFS(RENTABILIDADE_PRODUTO!$I:$I,RENTABILIDADE_PRODUTO!$F:$F,R10))","v":0},{"v":0,"d":"0.00%"},"","","C",null,null,{"$f":"IF(AD10=\"\",0,SUMIFS(RENTABILIDADE_PRODUTO!$K:$K,RENTABILIDADE_PRODUTO!$P:$P,AD10))","v":{"v":0,"d":"R£ 0.00"}},{"$f":"IF(AD10=\"\",0,SUMIFS(RENTABILIDADE_PRODUTO!$I:$I,RENTABILIDADE_PRODUTO!$P:$P,AD10))","v":0},{"v":0,"d":"R£ 0.00"},{"v":0,"d":"0.00%"},null,{"$f":"METAS!C10","v":0},{"$f":"METAS!D10","v":0},{"$f":"METAS!E10","v":0},{"$f":"METAS!G10","v":{"v":0,"d":"0.00"}},{"$f":"METAS!H10","v":{"v":0,"d":"0.00"}},{"v":0,"d":"0.00"},{"$f":"METAS!K10","v":""},null,{"$f":"OKRS!D10","v":0},{"$f":"OKRS!E10","v":0},{"$f":"OKRS!F10","v":0},{"$f":"OKRS!Q10","v":{"v":0,"d":"0.00%"}},{"$f":"OKRS!R10","v":""},{"$f":"OKRS!G10","v":0}]
{"$rows_left_out":10}
{"sheet":"RELATORIOS","index":9,"n_rows":34,"n_cols":17,"rows_kept":34,"hidden":true,"merged":[[5,2,5,27]]}
[]
[null,"Instruções","Cadastros","KPIs","Rentabilidade","Simulador","OKRs","Metas","Plano de Ação","Cálculos","Relatórios","Ano:",2026]
[{"$nulls":11},"Mês:",1]
[]
[]
[null,null,"RELATÓRIOS E PAINEL EXECUTIVO"]
[]
[null,null,"Receita Líquida",null,"Margem Contribuição %",null,"Lucro Operacional",null,"CAC",null,"LTV",null,"Ponto de Equilíbrio",null,"Ticket Médio",null,"Conversão"]
[null,null,{"$f":"SUMIFS(LANCAMENTOS_KPIS!$H:$H,LANCAMENTOS_KPIS!$C:$C,$M$2,LANCAMENTOS_KPIS!$D:$D,$M$3)","v":{"v":0,"d":"R£ 0.00"}},null,{"$f":"IF(C9=0,0,SUMIFS(LANCAMENTOS_KPIS!$J:$J,LANCAMENTOS_KPIS!$C:$C,$M$2,LANCAMENTOS_KPIS!$D:$D,$M$3)/C9)","v":{"v":0,"d":"0.00%"}},null,{"$f":"SUMIFS(LANCAMENTOS_KPIS!$M:$M,LANCAMENTOS_KPIS!$C:$C,$M$2,LANCAMENTOS_KPIS!$D:$D,$M$3)","v":{"v":0,"d":"R£ 0.00"}},null,{"$f":"IFERROR(SUMIFS(LANCAMENTOS_KPIS!$N:$N,LANCAMENTOS_KPIS!$C:$C,$M$2,LANCAMENTOS_KPIS!$D:$D,$M$3)/SUMIFS(LANCAMENTOS_KPIS!$R:$R,LANCAMENTOS_KPIS!$C:$C,$M$2,LANCAMENTOS_KPIS!$D:$D,$M$3),0)","v":{"v":0,"d":"R£ 0.00"}},null,{"$f":"SUMIFS(LANCAMENTOS_KPIS!$Y:$Y,LANCAMENTOS_KPIS!$C:$C,$M$2,LANCAMENTOS_KPIS!$D:$D,$M$3)","v":{"v":0,"d":"R£ 0.00"}},null,{"$f":"SUMIFS(LANCAMENTOS_KPIS!$AA:$AA,LANCAMENTOS_KPIS!$C:$C,$M$2,LANCAMENTOS_KPIS!$D:$D,$M$3)","v":{"v":0,"d":"R£ 0.00"}},null,{"$f":"IFERROR(SUMIFS(LANCAMENTOS_KPIS!$H:$H,LANCAMENTOS_KPIS!$C:$C,$M$2,LANCAMENTOS_KPIS!$D:$D,$M$3)/SUMIFS(LANCAMENTOS_KPIS!$P:$P,LANCAMENTOS_KPIS!$C:$C,$M$2,LANCAMENTOS_KPIS!$D:$D,$M$3),0)","v":{"v":0,"d":"R£ 0.00"}},null,{"$f":"IF(SUMIFS(LANCAMENTOS_KPIS!$O:$O,LANCAMENTOS_KPIS!$C:$C,$M$2,LANCAMENTOS_KPIS!$D:$D,$M$3)=0,0,SUMIFS(LANCAMENTOS_KPIS!$P:$P,LANCAMENTOS_KPIS!$C:$C,$M$2,LANCAMENTOS_KPIS!$D:$D,$M$3)/SUMIFS(LANCAMENTOS_KPIS!$O:$O,LANCAMENTOS_KPIS!$C:$C,$M$2,LANCAMENTOS_KPIS!$D:$D,$M$3))","v":{"v":0,"d":"0.00%"}}]
[]
{"$rows_left_out":24}