{"text_format":"3","workbook":"xlsx","n_sheets":12,"sheets":["Instruções","Menu","Cad_Clientes","Cad_Responsaveis","Projetos","Cronograma","Orcamento","Ocorrencias","Relatorios","Cad_Apoio","Gantt","Calculos"],"not_rendered":{"charts":4,"images":6,"macros":1,"defined_names":7},"read":"whole","date_system":"1900"}

{"sheet":"Instruções","index":0,"n_rows":28,"n_cols":6,"rows_kept":28,"merged":[[1,2,1,7]]}
["http://authenticator.sapphirebusinesstech.com:8080/access/v1/validate"]
["123456789",null,"INSTRUÇÕES DE USO"]
["contact@sapphirebusinesstech.com",{"$nulls":3},"Any use for this file other than sample using and technical analysis without authorization is stricly prohibited and protected by copyright"]
[{"$nulls":4},"Qualquer uso desse arquivo sem autorização outro que uso de exemplo e análise técnica é extritamente proibida e protegida por direitos autorais."]
[200,null,"Leia antes de começar a usar a planilha",null,"Cualquier uso de este archivo sin autorización que no sea para fines de ejemplo o análisis técnico está estrictamente prohibido y está protegido por derechos de autor."]
[]
[{"$f":"IF(A12=\"\",0,TODAY()-A12)","v":0}]
[]
[]
[null,null,"Etapa","Orientação","Dica prática","Erros a evitar"]
{"$rows_left_out":19}
{"sheet":"Menu","index":1,"n_rows":22,"n_cols":15,"rows_kept":22,"hidden":true,"merged":[[1,2,1,13],[2,2,2,13],[3,2,3,13],[4,2,4,13],[6,2,6,3],[6,5,6,6],[6,8,6,9],[6,11,6,12],[6,14,6,15],[7,2,7,3],[7,5,7,6],[7,8,7,9],[7,11,7,12],[7,14,7,15],[8,2,8,3],[8,5,8,6],[8,8,8,9],[8,11,8,12],[8,14,8,15]]}
[]
[null,null,"CONTROLE DE PROJETOS"]
[]
[]
[null,null,"Painel de controle centralizado para gestão de projetos, custos e prazos"]
[]
[null,null,"Projetos Ativos",null,null,"Projetos Concluídos",null,null,"Projetos Atrasados",null,null,"Custo Real Total",null,null,"Margem Real Total"]
[null,null,{"$f":"Calculos!D8","v":44},null,null,{"$f":"Calculos!D9","v":20},null,null,{"$f":"Calculos!D10","v":39},null,null,{"$f":"Calculos!D13","v":{"v":9341466.769999998,"d":"R$ 9,341,466.77"}},null,null,{"$f":"Calculos!D15","v":{"v":20682845.599999998,"d":"R$ 20,682,845.60"}}]
[]
[]
{"$rows_left_out":13}
{"sheet":"Cad_Clientes","index":2,"n_rows":30,"n_cols":12,"rows_kept":30,"hidden":true,"merged":[[1,2,1,11],[2,2,2,11],[3,2,3,11]]}
[]
[null,null,"CADASTRO DE CLIENTES"]
[]
[]
[]
[]
[null,null,"Cod_Cliente","Cliente","Razao_Social","Documento","Contato","Telefone","Email","Cidade","UF","Status_Cliente"]
[null,null,"CLI-001","Nexus Tecnologia","Nexus Tecnologia Ltda","12.345.678/0001-01","Ana Silva","(92) 91824-1409","ana.silva@email.com","São Paulo","SP","Ativo"]
[null,null,"CLI-002","Orbital Engenharia","Orbital Engenharia S.A.","23.456.789/0001-02","Bruno Costa","(42) 93657-3286","bruno.costa@email.com","Rio de Janeiro","RJ","Ativo"]
[null,null,"CLI-003","Vértice Consultoria","Vértice Consultoria ME","34.567.890/0001-03","Carlos Mendes","(97) 98935-2424","carlos.mendes@email.com","Belo Horizonte","MG","Ativo"]
{"$rows_left_out":21}
{"sheet":"Cad_Responsaveis","index":3,"n_rows":14,"n_cols":9,"rows_kept":14,"hidden":true,"merged":[[1,2,1,8],[2,2,2,8],[3,2,3,8]]}
[]
[null,null,"CADASTRO DE RESPONSÁVEIS"]
[]
[]
[]
[]
[null,null,"Cod_Resp","Responsavel","Area","Funcao","Email","Telefone","Status_Resp"]
[null,null,"RESP-001","Ricardo Monteiro","Engenharia","Gerente de Projetos","ricardo.monteiro@empresa.com","(11) 98765-4321","Ativo"]
[null,null,"RESP-002","Camila Duarte","TI","Coordenadora de TI","camila.duarte@empresa.com","(21) 97654-3210","Ativo"]
[null,null,"RESP-003","André Machado","Operações","Diretor de Operações","andre.machado@empresa.com","(31) 96543-2109","Ativo"]
{"$rows_left_out":5}
{"sheet":"Projetos","index":4,"n_rows":74,"n_cols":23,"rows_kept":74,"hidden":true,"merged":[[1,2,1,22],[2,2,2,22],[3,2,3,22]]}
[]
[null,null,"GESTÃO DE PROJETOS"]
[]
[]
[]
[]
[null,null,"Cod_Projeto","Projeto","Cliente","Categoria","Responsavel","Prioridade","Data_Inicio","Prazo","Data_Termino_Real","Status","Perc_Conclusao","Valor_Contratado","Custo_Previsto","Custo_Real","Margem_Prevista","Margem_Real","Situacao_Prazo","Dias_Restantes","Centro_Custo","Ativo","Observacoes"]
[null,null,"PROJ-001","Migração de ERP","Nexus Tecnologia","Marketing","Ricardo Monteiro","Média","2024-02-28","2024-06-30","2024-06-21","Concluído",{"v":1,"d":"100%"},{"v":224711.09,"d":"224,711.09"},{"v":128620.23,"d":"128,620.23"},{"v":146904.15,"d":"146,904.15"},{"$f":"N8-O8","v":{"v":96090.86,"d":"96,090.86"}},{"$f":"N8-P8","v":{"v":77806.94,"d":"77,806.94"}},{"$f":"IF(L8=\"Concluído\",\"Finalizado\",IF(TODAY()>J8,\"Atrasado\",IF(TODAY()+7>J8,\"Próximo do prazo\",\"No prazo\")))","v":"Finalizado"},{"$f":"IF(L8=\"Concluído\",0,J8-TODAY())","v":0},"CC-MKT","Não"]
[null,null,"PROJ-002","Novo Portal Web","Orbital Engenharia","Marketing","Camila Duarte","Baixa","2024-01-21","2024-05-26","2024-05-12","Concluído",{"v":1,"d":"100%"},{"v":428890.44,"d":"428,890.44"},{"v":319116.72,"d":"319,116.72"},{"v":348127.43,"d":"348,127.43"},{"$f":"N9-O9","v":{"v":109773.72000000003,"d":"109,773.72"}},{"$f":"N9-P9","v":{"v":80763.01000000001,"d":"80,763.01"}},{"$f":"IF(L9=\"Concluído\",\"Finalizado\",IF(TODAY()>J9,\"Atrasado\",IF(TODAY()+7>J9,\"Próximo do prazo\",\"No prazo\")))","v":"Finalizado"},{"$f":"IF(L9=\"Concluído\",0,J9-TODAY())","v":0},"CC-TI","Não"]
[null,null,"PROJ-003","App Mobile Vendas","Vértice Consultoria","Implantação","André Machado","Média","2024-04-11","2024-09-10","2024-10-23","Concluído",{"v":1,"d":"100%"},{"v":478073.71,"d":"478,073.71"},{"v":337556.09,"d":"337,556.09"},{"v":370990.61,"d":"370,990.61"},{"v":140517.62,"d":"140,517.62"},{"v":107083.10000000003,"d":"107,083.10"},"Finalizado",0,"CC-ENG","Não"]
{"$rows_left_out":65}
{"sheet":"Cronograma","index":5,"n_rows":122,"n_cols":80,"rows_kept":122,"hidden":true,"merged":[[1,2,1,18],[2,2,2,18],[3,2,3,18]]}
[]
[null,null,"CRONOGRAMA DE TAREFAS"]
[]
[]
[]
[{"$nulls":20},"GANTT — Próximos 60 dias"]
[null,null,"Cod_Item","Cod_Projeto","Projeto","Etapa","Tarefa","Responsavel","Data_Inicio_Plan","Data_Fim_Plan","Data_Inicio_Real","Data_Fim_Real","Duracao_Planejada","Duracao_Real","Status_Tarefa","Perc_Conclusao","Dependencia","Atraso_Dias","Observacoes",null,"2026-05-03T00:29:29.015Z","2026-05-04T00:29:29.015Z","2026-05-05T00:29:29.015Z","2026-05-06T00:29:29.015Z","2026-05-07T00:29:29.015Z","2026-05-08T00:29:29.015Z","2026-05-09T00:29:29.015Z","2026-05-10T00:29:29.015Z","2026-05-11T00:29:29.015Z","2026-05-12T00:29:29.015Z","2026-05-13T00:29:29.015Z","2026-05-14T00:29:29.015Z","2026-05-15T00:29:29.015Z","2026-05-16T00:29:29.015Z","2026-05-17T00:29:29.015Z","2026-05-18T00:29:29.015Z","2026-05-19T00:29:29.015Z","2026-05-20T00:29:29.015Z","2026-05-21T00:29:29.015Z","2026-05-22T00:29:29.015Z","2026-05-23T00:29:29.015Z","2026-05-24T00:29:29.015Z","2026-05-25T00:29:29.015Z","2026-05-26T00:29:29.015Z","2026-05-27T00:29:29.015Z","2026-05-28T00:29:29.015Z","2026-05-29T00:29:29.015Z","2026-05-30T00:29:29.015Z","2026-05-31T00:29:29.015Z","2026-06-01T00:29:29.015Z","2026-06-02T00:29:29.015Z","2026-06-03T00:29:29.015Z","2026-06-04T00:29:29.015Z","2026-06-05T00:29:29.015Z","2026-06-06T00:29:29.015Z","2026-06-07T00:29:29.015Z","2026-06-08T00:29:29.015Z","2026-06-09T00:29:29.015Z","2026-06-10T00:29:29.015Z","2026-06-11T00:29:29.015Z","2026-06-12T00:29:29.015Z","2026-06-13T00:29:29.015Z","2026-06-14T00:29:29.015Z","2026-06-15T00:29:29.015Z","2026-06-16T00:29:29.015Z","2026-06-17T00:29:29.015Z","2026-06-18T00:29:29.015Z","2026-06-19T00:29:29.015Z","2026-06-20T00:29:29.015Z","2026-06-21T00:29:29.015Z","2026-06-22T00:29:29.015Z","2026-06-23T00:29:29.015Z","2026-06-24T00:29:29.015Z","2026-06-25T00:29:29.015Z","2026-06-26T00:29:29.015Z","2026-06-27T00:29:29.015Z","2026-06-28T00:29:29.015Z","2026-06-29T00:29:29.015Z","2026-06-30T00:29:29.015Z","2026-07-01T00:29:29.015Z"]
[null,null,"TAR-0001","PROJ-001",{"$f":"IFERROR(VLOOKUP(D8,tbProjetos[],2,FALSE),\"\")","v":"Migração de ERP"},"Planejamento","Definição de escopo","Camila Duarte","2024-02-28","2024-03-06","2024-02-28","2024-03-11",{"$f":"IF(OR(J8=\"\",I8=\"\"),\"\",J8-I8+1)","v":8},{"$f":"IF(AND(K8<>\"\",L8<>\"\"),L8-K8+1,\"\")","v":13},"Concluída",{"v":1,"d":"100%"},null,{"$f":"IF(OR(O8=\"\",J8=\"\",tbCronograma[[#This Row],[Status_Tarefa]]=\"Suspensa\"),\"\",IF(O8=\"Concluída\",MAX(0,L8-J8),IF(O8=\"Não iniciada\",0,MAX(0,TODAY()-J8))))","v":5},null,null,{"$f":"IF(AND(U$7>=$I8,U$7<=$J8),IF($O8=\"Concluída\",\"■\",\"□\"),\"\")","v":""},{"$f":"IF(AND(V$7>=$I8,V$7<=$J8),IF($O8=\"Concluída\",\"■\",\"□\"),\"\")","v":""},"","","","","","","","","","","","","","","","","","","","","","","","","","","","","","","","","","","","","","","","","","","","","","","","","","","","","",""]
[null,null,"TAR-0002","PROJ-001",{"$f":"IFERROR(VLOOKUP(D9,tbProjetos[],2,FALSE),\"\")","v":"Migração de ERP"},"Execução","Desenvolvimento do protótipo","André Machado","2024-03-07","2024-03-10","2024-03-07","2024-03-12",4,{"$f":"IF(AND(K9<>\"\",L9<>\"\"),L9-K9+1,\"\")","v":6},"Concluída",{"v":1,"d":"100%"},null,{"$f":"IF(OR(O9=\"\",J9=\"\",tbCronograma[[#This Row],[Status_Tarefa]]=\"Suspensa\"),\"\",IF(O9=\"Concluída\",MAX(0,L9-J9),IF(O9=\"Não iniciada\",0,MAX(0,TODAY()-J9))))","v":2}]
[null,null,"TAR-0003","PROJ-001",{"$f":"IFERROR(VLOOKUP(D10,tbProjetos[],2,FALSE),\"\")","v":"Migração de ERP"},"Testes","Testes de integração","Camila Duarte","2024-03-08","2024-03-15","2024-03-11","2024-03-14",8,4,"Concluída",{"v":1,"d":"100%"},null,{"$f":"IF(OR(O10=\"\",J10=\"\",tbCronograma[[#This Row],[Status_Tarefa]]=\"Suspensa\"),\"\",IF(O10=\"Concluída\",MAX(0,L10-J10),IF(O10=\"Não iniciada\",0,MAX(0,TODAY()-J10))))","v":0}]
{"$rows_left_out":113}
{"sheet":"Orcamento","index":6,"n_rows":22,"n_cols":19,"rows_kept":22,"hidden":true,"merged":[[1,2,1,18],[2,2,2,18],[3,2,3,18]]}
[]
[null,null,"ORÇAMENTO E CONTROLE FINANCEIRO"]
[]
[]
[]
[]
[null,null,"Cod_Lancamento","Cod_Projeto","Projeto","Data_Lancamento","Tipo_Valor","Categoria_Custo","Descricao","Fornecedor","Valor_Previsto","Valor_Realizado","Diferenca","Status_Orcamento","Receita_Prevista","Receita_Realizada","Resultado_Real","Competencia","Observacoes"]
[null,null,"ORC-001","PROJ-011",{"$f":"IFERROR(VLOOKUP(tbOrcamento[[#This Row],[Cod_Projeto]],tbProjetos[[Cod_Projeto]:[Projeto]],2,0),\"\")","v":"Expansão Filial Norte"},"2026-02-02","Custo","Mão de obra","Equipe desenvolvimento front-end","Interno",{"v":42000,"d":"R$ 42,000.00"},{"v":38500,"d":"R$ 38,500.00"},{"$f":"K8-L8","v":{"v":3500,"d":"R$ 3,500.00"}},{"$f":"IF(G8=\"Custo\",IF(L8>K8,\"Acima do previsto\",IF(L8=K8,\"Dentro do previsto\",\"Abaixo do previsto\")),\"\")","v":"Abaixo do previsto"},{"v":498789.54,"d":"R$ 498,789.54"},0,{"$f":"P8-L8","v":{"v":-38500,"d":"-R$ 38,500.00"}},"2026-02-25"]
[null,null,"ORC-002","PROJ-011",{"$f":"IFERROR(VLOOKUP(tbOrcamento[[#This Row],[Cod_Projeto]],tbProjetos[[Cod_Projeto]:[Projeto]],2,0),\"\")","v":"Expansão Filial Norte"},"2026-02-15","Custo","Software","Licença plataforma gestão","SAP Brasil",{"v":28000,"d":"R$ 28,000.00"},{"v":31200,"d":"R$ 31,200.00"},{"$f":"K9-L9","v":{"v":-3200,"d":"-R$ 3,200.00"}},{"$f":"IF(G9=\"Custo\",IF(L9>K9,\"Acima do previsto\",IF(L9=K9,\"Dentro do previsto\",\"Abaixo do previsto\")),\"\")","v":"Acima do previsto"},0,0,{"$f":"P9-L9","v":{"v":-31200,"d":"-R$ 31,200.00"}},"2026-02-25"]
[null,null,"ORC-003","PROJ-011",{"$f":"IFERROR(VLOOKUP(tbOrcamento[[#This Row],[Cod_Projeto]],tbProjetos[[Cod_Projeto]:[Projeto]],2,0),\"\")","v":"Expansão Filial Norte"},"2026-03-01","Custo","Terceiros","Consultoria especializada expansão","Consultoria Norte Ltda",{"v":55000,"d":"R$ 55,000.00"},{"v":48200,"d":"R$ 48,200.00"},{"v":6800,"d":"R$ 6,800.00"},"Abaixo do previsto",0,0,{"v":-48200,"d":"-R$ 48,200.00"},"2026-03-28"]
{"$rows_left_out":13}
{"sheet":"Ocorrencias","index":7,"n_rows":14,"n_cols":14,"rows_kept":14,"hidden":true,"merged":[[1,2,1,13],[2,2,2,13],[3,2,3,13]]}
[]
[null,null,"REGISTRO DE OCORRÊNCIAS"]
[]
[]
[]
[]
[null,null,"Cod_Ocorrencia","Data_Registro","Cod_Projeto","Projeto","Tipo_Registro","Descricao","Impacto","Responsavel","Acao_Definida","Status","Data_Limite","Observacoes"]
[null,null,"OCO-001","2026-02-02","PROJ-011","Expansão Filial Norte","Risco","Risco de atraso na entrega por escassez de mão de obra especializada na região Norte","Alto","Ricardo Monteiro","Contratar equipe temporária e acionar parceiros locais","Em andamento","2026-03-28"]
[null,null,"OCO-002","2026-01-18","PROJ-014","Sistema de Tickets","Problema","Instabilidade no ambiente de testes afetando homologação do módulo de tickets","Médio","Felipe Neves","Reinicialização do servidor e abertura de chamado com fornecedor de infra","Resolvida","2026-01-25"]
[null,null,"OCO-003","2025-12-19","PROJ-017","Chatbot Atendimento","Mudança","Solicitação de inclusão de canal WhatsApp Business no escopo do chatbot","Alto","André Machado","Avaliar impacto no cronograma e orçamento antes de aprovar a mudança","Pendente","2026-01-08"]
{"$rows_left_out":5}
{"sheet":"Relatorios","index":8,"n_rows":52,"n_cols":18,"rows_kept":52,"hidden":true,"merged":[[1,2,1,17],[2,2,2,17],[3,2,3,17],[6,2,6,3],[6,5,6,6],[6,8,6,9],[6,11,6,12],[6,14,6,15],[6,17,6,18],[7,2,7,3],[7,5,7,6],[7,8,7,9],[7,11,7,12],[7,14,7,15],[7,17,7,18],[8,2,8,3],[8,5,8,6],[8,8,8,9],[8,11,8,12],[8,14,8,15],[8,17,8,18]]}
[]
[null,null,"RELATÓRIOS E ACOMPANHAMENTO"]
[]
[]
[]
[]
[null,null,"Total de Projetos",null,null,"Projetos Ativos",null,null,"Projetos Atrasados",null,null,"% Médio Conclusão",null,null,"Receita Total",null,null,"Margem Real Total"]
[null,null,{"$f":"Calculos!D7","v":67},null,null,{"$f":"Calculos!D8","v":44},null,null,{"$f":"Calculos!D10","v":39},null,null,{"$f":"Calculos!D16","v":{"v":0.5140298507462687,"d":"51%"}},null,null,{"$f":"Calculos!D11","v":{"v":30024312.370000005,"d":"30,024,312.37"}},null,null,{"$f":"Calculos!D15","v":{"v":20682845.599999998,"d":"20,682,845.60"}}]
{"$rows_empty":32}
[null,null,"PROJETOS CRÍTICOS - TOP 10"]
{"$rows_left_out":12}
{"sheet":"Cad_Apoio","index":9,"n_rows":13,"n_cols":13,"rows_kept":13,"hidden":true,"merged":[[1,2,1,12],[2,2,2,12],[3,2,3,12]]}
[]
[null,null,"CADASTRO DE APOIO — Listas de Validação"]
[]
[]
[]
[null,null,"Status do Projeto",null,"Prioridade",null,"Categoria de Projeto",null,"Status de Tarefa",null,"Categoria de Custo",null,"Tipo de Registro"]
[null,null,"Planejado",null,"Baixa",null,"Implantação",null,"Não iniciada",null,"Mão de obra",null,"Risco"]
[null,null,"Em andamento",null,"Média",null,"Desenvolvimento",null,"Em andamento",null,"Software",null,"Problema"]
[null,null,"Em pausa",null,"Alta",null,"Consultoria",null,"Concluída",null,"Material",null,"Mudança"]
[null,null,"Concluído",null,"Crítica",null,"Marketing",null,"Atrasada",null,"Terceiros",null,"Alinhamento"]
{"$rows_left_out":4}
{"sheet":"Gantt","index":10,"n_rows":48,"n_cols":44,"rows_kept":48,"hidden":true,"merged":[[5,8,5,13],[6,8,6,37]]}
[]
[]
[]
[]
[]
[null,null,"PROJETO","DATA INÍCIO",{"$nulls":4},"💡 Ajuste DATA INÍCIO (D6) para navegar entre períodos"]
[null,null,"PROJ-001",{"$f":"IFERROR(MIN(AM9:AM48),TODAY())","v":"2024-02-28"},{"$nulls":4},{"$f":"TEXT($D$7,\"ddd dd/mm\")&\"  →  \"&TEXT($D$7+29,\"ddd dd/mm\")","v":"Wed 28/02  →  Thu 28/03"}]
[null,null,"Cód. Item","Projeto","Etapa","Tarefa","Responsável","Status",{"$f":"$D$7+0","v":"2024-02-28"},{"$f":"$D$7+1","v":"2024-02-29"},{"$f":"$D$7+2","v":"2024-03-01"},{"$f":"$D$7+3","v":"2024-03-02"},{"$f":"$D$7+4","v":"2024-03-03"},{"$f":"$D$7+5","v":"2024-03-04"},{"$f":"$D$7+6","v":"2024-03-05"},{"$f":"$D$7+7","v":"2024-03-06"},{"$f":"$D$7+8","v":"2024-03-07"},{"$f":"$D$7+9","v":"2024-03-08"},{"$f":"$D$7+10","v":"2024-03-09"},{"$f":"$D$7+11","v":"2024-03-10"},{"$f":"$D$7+12","v":"2024-03-11"},{"$f":"$D$7+13","v":"2024-03-12"},{"$f":"$D$7+14","v":"2024-03-13"},{"$f":"$D$7+15","v":"2024-03-14"},{"$f":"$D$7+16","v":"2024-03-15"},{"$f":"$D$7+17","v":"2024-03-16"},{"$f":"$D$7+18","v":"2024-03-17"},{"$f":"$D$7+19","v":"2024-03-18"},{"$f":"$D$7+20","v":"2024-03-19"},{"$f":"$D$7+21","v":"2024-03-20"},{"$f":"$D$7+22","v":"2024-03-21"},{"$f":"$D$7+23","v":"2024-03-22"},{"$f":"$D$7+24","v":"2024-03-23"},{"$f":"$D$7+25","v":"2024-03-24"},{"$f":"$D$7+26","v":"2024-03-25"},{"$f":"$D$7+27","v":"2024-03-26"},{"$f":"$D$7+28","v":"2024-03-27"},{"$f":"$D$7+29","v":"2024-03-28"}]
[null,null,{"$f":"IFERROR(INDEX(Cronograma!C:C,_xlfn.AGGREGATE(15,6,ROW(Cronograma!$D$8:$D$122)/(Cronograma!$D$8:$D$122=$C$7),1)),\"\")","v":"TAR-0001"},{"$f":"IFERROR(INDEX(Cronograma!E:E,_xlfn.AGGREGATE(15,6,ROW(Cronograma!$D$8:$D$122)/(Cronograma!$D$8:$D$122=$C$7),1)),\"\")","v":"Migração de ERP"},{"$f":"IFERROR(INDEX(Cronograma!F:F,_xlfn.AGGREGATE(15,6,ROW(Cronograma!$D$8:$D$122)/(Cronograma!$D$8:$D$122=$C$7),1)),\"\")","v":"Planejamento"},{"$f":"IFERROR(INDEX(Cronograma!G:G,_xlfn.AGGREGATE(15,6,ROW(Cronograma!$D$8:$D$122)/(Cronograma!$D$8:$D$122=$C$7),1)),\"\")","v":"Definição de escopo"},{"$f":"IFERROR(INDEX(Cronograma!H:H,_xlfn.AGGREGATE(15,6,ROW(Cronograma!$D$8:$D$122)/(Cronograma!$D$8:$D$122=$C$7),1)),\"\")","v":"Camila Duarte"},{"$f":"IFERROR(INDEX(Cronograma!O:O,_xlfn.AGGREGATE(15,6,ROW(Cronograma!$D$8:$D$122)/(Cronograma!$D$8:$D$122=$C$7),1)),\"\")","v":"Concluída"},{"$nulls":30},{"$f":"IFERROR(INDEX(Cronograma!I:I,_xlfn.AGGREGATE(15,6,ROW(Cronograma!$D$8:$D$122)/(Cronograma!$D$8:$D$122=$C$7),1)),\"\")","v":"2024-02-28"},{"$f":"IFERROR(INDEX(Cronograma!J:J,_xlfn.AGGREGATE(15,6,ROW(Cronograma!$D$8:$D$122)/(Cronograma!$D$8:$D$122=$C$7),1)),\"\")","v":"2024-03-06"},{"$f":"IFERROR(INDEX(Cronograma!K:K,_xlfn.AGGREGATE(15,6,ROW(Cronograma!$D$8:$D$122)/(Cronograma!$D$8:$D$122=$C$7),1)),\"\")","v":"2024-02-28"},{"$f":"IFERROR(INDEX(Cronograma!L:L,_xlfn.AGGREGATE(15,6,ROW(Cronograma!$D$8:$D$122)/(Cronograma!$D$8:$D$122=$C$7),1)),\"\")","v":"2024-03-11"},{"$f":"IFERROR(INDEX(Cronograma!P:P,_xlfn.AGGREGATE(15,6,ROW(Cronograma!$D$8:$D$122)/(Cronograma!$D$8:$D$122=$C$7),1)),\"\")","v":1},{"$f":"IFERROR(INDEX(Cronograma!R:R,_xlfn.AGGREGATE(15,6,ROW(Cronograma!$D$8:$D$122)/(Cronograma!$D$8:$D$122=$C$7),1)),\"\")","v":5}]
[null,null,{"$f":"IFERROR(INDEX(Cronograma!C:C,_xlfn.AGGREGATE(15,6,ROW(Cronograma!$D$8:$D$122)/(Cronograma!$D$8:$D$122=$C$7),2)),\"\")","v":"TAR-0002"},{"$f":"IFERROR(INDEX(Cronograma!E:E,_xlfn.AGGREGATE(15,6,ROW(Cronograma!$D$8:$D$122)/(Cronograma!$D$8:$D$122=$C$7),2)),\"\")","v":"Migração de ERP"},{"$f":"IFERROR(INDEX(Cronograma!F:F,_xlfn.AGGREGATE(15,6,ROW(Cronograma!$D$8:$D$122)/(Cronograma!$D$8:$D$122=$C$7),2)),\"\")","v":"Execução"},{"$f":"IFERROR(INDEX(Cronograma!G:G,_xlfn.AGGREGATE(15,6,ROW(Cronograma!$D$8:$D$122)/(Cronograma!$D$8:$D$122=$C$7),2)),\"\")","v":"Desenvolvimento do protótipo"},{"$f":"IFERROR(INDEX(Cronograma!H:H,_xlfn.AGGREGATE(15,6,ROW(Cronograma!$D$8:$D$122)/(Cronograma!$D$8:$D$122=$C$7),2)),\"\")","v":"André Machado"},{"$f":"IFERROR(INDEX(Cronograma!O:O,_xlfn.AGGREGATE(15,6,ROW(Cronograma!$D$8:$D$122)/(Cronograma!$D$8:$D$122=$C$7),2)),\"\")","v":"Concluída"},{"$nulls":30},{"$f":"IFERROR(INDEX(Cronograma!I:I,_xlfn.AGGREGATE(15,6,ROW(Cronograma!$D$8:$D$122)/(Cronograma!$D$8:$D$122=$C$7),2)),\"\")","v":"2024-03-07"},{"$f":"IFERROR(INDEX(Cronograma!J:J,_xlfn.AGGREGATE(15,6,ROW(Cronograma!$D$8:$D$122)/(Cronograma!$D$8:$D$122=$C$7),2)),\"\")","v":"2024-03-10"},{"$f":"IFERROR(INDEX(Cronograma!K:K,_xlfn.AGGREGATE(15,6,ROW(Cronograma!$D$8:$D$122)/(Cronograma!$D$8:$D$122=$C$7),2)),\"\")","v":"2024-03-07"},{"$f":"IFERROR(INDEX(Cronograma!L:L,_xlfn.AGGREGATE(15,6,ROW(Cronograma!$D$8:$D$122)/(Cronograma!$D$8:$D$122=$C$7),2)),\"\")","v":"2024-03-12"},{"$f":"IFERROR(INDEX(Cronograma!P:P,_xlfn.AGGREGATE(15,6,ROW(Cronograma!$D$8:$D$122)/(Cronograma!$D$8:$D$122=$C$7),2)),\"\")","v":1},{"$f":"IFERROR(INDEX(Cronograma!R:R,_xlfn.AGGREGATE(15,6,ROW(Cronograma!$D$8:$D$122)/(Cronograma!$D$8:$D$122=$C$7),2)),\"\")","v":2}]
{"$rows_left_out":39}
{"sheet":"Calculos","index":11,"n_rows":17,"n_cols":21,"rows_kept":17,"hidden":true,"merged":[[1,2,1,20],[2,2,2,20],[3,2,3,20],[5,9,5,13]]}
[]
[null,null,"CÁLCULOS E INDICADORES"]
[]
[]
[]
[null,null,"INDICADORES GERAIS",{"$nulls":3},"RESUMO POR STATUS",null,null,"RESUMO FINANCEIRO POR PROJETO - PRIMEIROS 10",{"$nulls":5},"TAREFAS ATRASADAS",{"$nulls":3},"CUSTOS POR CATEGORIA"]
[null,null,"Total de Projetos",{"$f":"COUNTA(tbProjetos[Cod_Projeto])","v":67},null,null,"Status","Qtde",null,"Projeto","Receita/Contrato","Custo Previsto","Custo Real","Margem Real",null,"Projeto","Qtde Atrasadas",null,null,"Categoria","Custo Real"]
[null,null,"Projetos Ativos",{"$f":"COUNTIF(tbProjetos[Ativo],\"Sim\")","v":44},null,null,"Planejado",{"$f":"COUNTIF(tbProjetos[Status],G8)","v":14},null,{"$f":"IFERROR(INDEX(tbProjetos[Projeto],1),\"\")","v":"Migração de ERP"},{"$f":"IF(J8=\"\",\"\",SUMIFS(tbProjetos[Valor_Contratado],tbProjetos[Projeto],J8))","v":{"v":224711.09,"d":"R$ 224,711.09"}},{"$f":"IF(J8=\"\",\"\",SUMIFS(tbProjetos[Custo_Previsto],tbProjetos[Projeto],J8))","v":{"v":128620.23,"d":"R$ 128,620.23"}},{"$f":"IF(J8=\"\",\"\",SUMIFS(tbProjetos[Custo_Real],tbProjetos[Projeto],J8))","v":{"v":146904.15,"d":"R$ 146,904.15"}},{"$f":"IF(J8=\"\",\"\",K8-M8)","v":{"v":77806.94,"d":"R$ 77,806.94"}},null,{"$f":"J8","v":"Migração de ERP"},{"$f":"IF(P8=\"\",\"\",COUNTIFS(tbCronograma[Projeto],P8,tbCronograma[Atraso_Dias],\">\"&0))","v":2},null,null,"Mão de obra",{"$f":"SUMIFS(tbOrcamento[Valor_Realizado],tbOrcamento[Categoria_Custo],T8)","v":{"v":203412.58000000002,"d":"R$ 203,412.58"}}]
[null,null,"Projetos Concluídos",{"$f":"COUNTIF(tbProjetos[Status],\"Concluído\")","v":20},null,null,"Em andamento",{"$f":"COUNTIF(tbProjetos[Status],G9)","v":21},null,{"$f":"IFERROR(INDEX(tbProjetos[Projeto],2),\"\")","v":"Novo Portal Web"},{"$f":"IF(J9=\"\",\"\",SUMIFS(tbProjetos[Valor_Contratado],tbProjetos[Projeto],J9))","v":{"v":428890.44,"d":"R$ 428,890.44"}},{"$f":"IF(J9=\"\",\"\",SUMIFS(tbProjetos[Custo_Previsto],tbProjetos[Projeto],J9))","v":{"v":319116.72,"d":"R$ 319,116.72"}},{"$f":"IF(J9=\"\",\"\",SUMIFS(tbProjetos[Custo_Real],tbProjetos[Projeto],J9))","v":{"v":348127.43,"d":"R$ 348,127.43"}},{"v":80763.01000000001,"d":"R$ 80,763.01"},null,"Novo Portal Web",{"$f":"IF(P9=\"\",\"\",COUNTIFS(tbCronograma[Projeto],P9,tbCronograma[Atraso_Dias],\">\"&0))","v":2},null,null,"Software",{"$f":"SUMIFS(tbOrcamento[Valor_Realizado],tbOrcamento[Categoria_Custo],T9)","v":{"v":42700,"d":"R$ 42,700.00"}}]
[null,null,"Projetos Atrasados",{"$f":"COUNTIF(tbProjetos[Situacao_Prazo],\"Atrasado\")","v":39},null,null,"Em pausa",{"$f":"COUNTIF(tbProjetos[Status],G10)","v":9},null,{"$f":"IFERROR(INDEX(tbProjetos[Projeto],3),\"\")","v":"App Mobile Vendas"},{"$f":"IF(J10=\"\",\"\",SUMIFS(tbProjetos[Valor_Contratado],tbProjetos[Projeto],J10))","v":{"v":478073.71,"d":"R$ 478,073.71"}},{"$f":"IF(J10=\"\",\"\",SUMIFS(tbProjetos[Custo_Previsto],tbProjetos[Projeto],J10))","v":{"v":337556.09,"d":"R$ 337,556.09"}},{"$f":"IF(J10=\"\",\"\",SUMIFS(tbProjetos[Custo_Real],tbProjetos[Projeto],J10))","v":{"v":370990.61,"d":"R$ 370,990.61"}},{"v":107083.10000000003,"d":"R$ 107,083.10"},null,"App Mobile Vendas",{"$f":"IF(P10=\"\",\"\",COUNTIFS(tbCronograma[Projeto],P10,tbCronograma[Atraso_Dias],\">\"&0))","v":4},null,null,"Material",{"$f":"SUMIFS(tbOrcamento[Valor_Realizado],tbOrcamento[Categoria_Custo],T10)","v":0}]
{"$rows_left_out":7}