{"text_format":"3","workbook":"xlsx","n_sheets":12,"sheets":["Instruções","Menu","Cad_Clientes","Cad_Responsaveis","Projetos","Cronograma","Orcamento","Ocorrencias","Relatorios","Cad_Apoio","Gantt","Calculos"],"not_rendered":{"charts":4,"images":6,"macros":1,"defined_names":7},"read":"whole","date_system":"1900"}

{"sheet":"Instruções","index":0,"n_rows":28,"n_cols":6,"rows_kept":28,"merged":[[1,2,1,7]]}
["http://authenticator.sapphirebusinesstech.com:8080/access/v1/validate"]
["123456789",null,"INSTRUÇÕES DE USO"]
["contact@sapphirebusinesstech.com",{"$nulls":3},"Any use for this file other than sample using and technical analysis without authorization is stricly prohibited and protected by copyright"]
[{"$nulls":4},"Qualquer uso desse arquivo sem autorização outro que uso de exemplo e análise técnica é extritamente proibida e protegida por direitos autorais."]
[200,null,"Leia antes de começar a usar a planilha",null,"Cualquier uso de este archivo sin autorización que no sea para fines de ejemplo o análisis técnico está estrictamente prohibido y está protegido por derechos de autor."]
[]
[{"$f":"IF(A12=\"\",0,TODAY()-A12)","v":0}]
[]
[]
[null,null,"Etapa","Orientação","Dica prática","Erros a evitar"]
[null,null,"1. Objetivo","Esta planilha gerencia projetos: prazos, custos, tarefas e ocorrências.","Comece pelo Menu para entender a estrutura.","Não pule cadastros antes de criar projetos."]
[null,null,"2. Ordem de preenchimento","1º Cad_Clientes → 2º Cad_Responsaveis → 3º Projetos → 4º Cronograma → 5º Orçamento → 6º Ocorrências.","Siga a ordem para que listas e validações funcionem.","Não cadastre projetos sem antes cadastrar clientes e responsáveis."]
[null,null,"3. O que editar","Edite apenas células de entrada (brancas). Colunas com fórmulas são calculadas automaticamente.","Colunas como Margem, Situação Prazo e Dias Restantes são automáticas.","Nunca apague ou substitua fórmulas por valores fixos."]
[null,null,"4. Usando filtros","Cada tabela possui filtros nos cabeçalhos. Clique na seta para filtrar por status, projeto, etc.","Use filtros para focar em projetos atrasados ou categorias específicas.","Não oculte linhas manualmente — use os filtros da tabela."]
[null,null,"5. Relatórios","A aba Relatórios se atualiza automaticamente com base nos dados das outras abas.","Consulte os KPIs e gráficos regularmente para acompanhamento.","Não altere dados diretamente na aba Relatórios ou Cálculos."]
[null,null,"6. Status","Planejado, Em andamento, Em pausa, Concluído, Cancelado. Atualize conforme evolução real.","Mantenha status atualizados para indicadores corretos.","Não deixe projetos sem status definido."]
[null,null,"7. Alertas de prazo","Situação Prazo indica: No prazo (ok), Próximo do prazo (atenção), Atrasado (ação urgente), Finalizado.","Cores: verde=ok, amarelo=atenção, vermelho=atrasado.","Não ignore alertas amarelos — aja antes que virem vermelhos."]
[null,null,"8. Navegação","Use os botões no topo de cada aba para navegar rapidamente entre as seções.","Os botões levam diretamente ao início dos dados (célula C7).","Não renomeie as abas — os links de navegação podem quebrar."]
[null,null,"GANTT — Visão Geral","Orientação","Dica prática","Erros a evitar"]
[null,null,"9. Aba Gantt — Visão geral","A aba Gantt exibe visualmente as tarefas do projeto selecionado em uma janela de 30 dias, com 1 coluna por dia. Cada linha é uma tarefa buscada automaticamente do Cronograma.","Use o Gantt para acompanhar o andamento diário das tarefas e identificar desvios de prazo rapidamente.","Não edite as fórmulas das colunas C a H — elas buscam automaticamente os dados do Cronograma."]
[null,null,"10. Seleção de projeto (C6)","Clique na célula C6 e escolha o código do projeto (ex.: PROJ-001) na lista suspensa. As tarefas nas linhas abaixo se atualizam automaticamente.","Altere C6 sempre que quiser visualizar um projeto diferente — não é necessário nenhum botão ou macro.","Não digite o código manualmente — use sempre a lista suspensa para evitar erros de digitação."]
[null,null,"11. Data de início da janela (D6)","A célula D6 define o primeiro dia exibido no Gantt. Por padrão, aponta automaticamente para a data de início mais antiga das tarefas do projeto selecionado. Você pode digitar outra data para navegar entre períodos.","Para ver a semana atual, basta digitar a data de hoje em D6. Para avançar 30 dias, some 30 à data (ex.: =D6+30 numa célula auxiliar e copie o valor).","Não apague D6 — sem data de início o cabeçalho de dias e as cores do Gantt ficam incorretos."]
[null,null,"12. Cabeçalho de dias (linha 7, colunas I–AL)","Cada coluna a partir de I representa 1 dia — calculado como D6 + n. O formato exibe o dia da semana abreviado e o número do dia (ex.: “Qui 22”). Fins de semana têm fundo azul mais escuro.","Ao alterar D6, todos os cabeçalhos se recalculam instantaneamente — inclusive os fins de semana destacados.","Não edite as fórmulas do cabeçalho (linha 7) — elas derivam todas de D6."]
[null,null,"13. Cores das barras (formatação condicional)","As células da grade são coloridas automaticamente por fórmulas de formatação condicional: ■ Azul marinho = Concluída no prazo (atraso = 0) | ■ Laranja = Concluída com atraso | ■ Vermelho = Atrasada (não concluída) | ■ Amarelo = Suspensa ou Em andamento | ■ Ciano claro = Dia atual (TODAY) | ■ Cinza = Fim de semana sem tarefa.","As cores refletem o Status_Tarefa e os dias de atraso registrados na aba Cronograma. Mantenha esses campos atualizados para que o Gantt seja confiável.","Não aplique preenchimento manual nas células da grade — isso sobrescreveria a formatação condicional e as cores parariam de funcionar."]
[null,null,"14. Tarefas automáticas (linhas 8 em diante)","As colunas C a H (Cód., Projeto, Etapa, Tarefa, Responsável, Status) são preenchidas por fórmulas AGGREGATE que buscam na aba Cronograma todas as tarefas do projeto em C6, na ordem em que aparecem.","Se um projeto tiver mais de 40 tarefas, apenas as 40 primeiras serão exibidas. Contate o administrador para ampliar o intervalo de fórmulas.","Não insira nem exclua linhas dentro do intervalo de dados (linhas 8 a 47) — isso quebra a sequência das fórmulas AGGREGATE."]
[null,null,"15. Colunas auxiliares (AM–AR)","As colunas AM a AR estão ocultas e contêm as datas (Início Plan, Fim Plan, Início Real, Fim Real), o percentual de conclusão e os dias de atraso. São usadas pelas fórmulas de formatação condicional para calcular as cores.","Para inspecionar as datas de uma tarefa, selecione a linha correspondente, vá à guia Página Início → Formatar → Reexibir Colunas e analise AM–AR.","Não exclua nem edite as colunas auxiliares AM–AR — as cores do Gantt dependem exclusivamente delas."]
[null,null,"16. Navegar entre períodos","Para avançar ou recuar no tempo, basta alterar a data em D6. A janela sempre mostra os 30 dias seguintes à data informada. Cada coluna representa exatamente 1 dia corrido (incluindo sábados e domingos).","Para ver a quinzena atual: insira =HOJE() em D6. Para avançar ao próximo mês: insira a data do 1º dia do mês desejado.","Não insira uma data futura muito distante das tarefas — as barras ficarão em branco se nenhuma tarefa ocorrer na janela."]
[null,null,"17. Atualizar dados do Gantt","O Gantt é 100% automático — não há botão de atualizar. Sempre que um status, data ou percentual for alterado na aba Cronograma, as cores e informações do Gantt refletem imediatamente a mudança.","Se as fórmulas não atualizarem, pressione Ctrl+Alt+F9 para forçar o recálculo completo da pasta de trabalho.","Não use Colar Especial → Valores sobre as células do Gantt — isso elimina as fórmulas que buscam as tarefas."]

{"sheet":"Menu","index":1,"n_rows":22,"n_cols":15,"rows_kept":22,"hidden":true,"merged":[[1,2,1,13],[2,2,2,13],[3,2,3,13],[4,2,4,13],[6,2,6,3],[6,5,6,6],[6,8,6,9],[6,11,6,12],[6,14,6,15],[7,2,7,3],[7,5,7,6],[7,8,7,9],[7,11,7,12],[7,14,7,15],[8,2,8,3],[8,5,8,6],[8,8,8,9],[8,11,8,12],[8,14,8,15]]}
[]
[null,null,"CONTROLE DE PROJETOS"]
[]
[]
[null,null,"Painel de controle centralizado para gestão de projetos, custos e prazos"]
[]
[null,null,"Projetos Ativos",null,null,"Projetos Concluídos",null,null,"Projetos Atrasados",null,null,"Custo Real Total",null,null,"Margem Real Total"]
[null,null,{"$f":"Calculos!D8","v":44},null,null,{"$f":"Calculos!D9","v":20},null,null,{"$f":"Calculos!D10","v":39},null,null,{"$f":"Calculos!D13","v":{"v":9341466.769999998,"d":"R$ 9,341,466.77"}},null,null,{"$f":"Calculos!D15","v":{"v":20682845.599999998,"d":"R$ 20,682,845.60"}}]
[]
[]
[null,null,"GUIA DAS ABAS"]
[null,null,"Aba","Descrição"]
[null,null,"Instruções","Orientações de uso para iniciantes"]
[null,null,"Cad_Clientes","Cadastro de clientes com dados de contato"]
[null,null,"Cad_Responsaveis","Cadastro de responsáveis e áreas"]
[null,null,"Cad_Apoio","Listas de validação (status, categorias, prioridades)"]
[null,null,"Projetos","Registro de projetos com prazos, custos e margem"]
[null,null,"Cronograma","Tarefas detalhadas com Gantt visual"]
[null,null,"Orcamento","Controle de custos e receitas por projeto"]
[null,null,"Ocorrencias","Registro de riscos, problemas e mudanças"]
[null,null,"Calculos","Indicadores consolidados (não editar)"]
[null,null,"Relatorios","Dashboard com KPIs, gráficos e projetos críticos"]

{"sheet":"Cad_Clientes","index":2,"n_rows":30,"n_cols":12,"rows_kept":30,"hidden":true,"merged":[[1,2,1,11],[2,2,2,11],[3,2,3,11]]}
[]
[null,null,"CADASTRO DE CLIENTES"]
[]
[]
[]
[]
[null,null,"Cod_Cliente","Cliente","Razao_Social","Documento","Contato","Telefone","Email","Cidade","UF","Status_Cliente"]
[null,null,"CLI-001","Nexus Tecnologia","Nexus Tecnologia Ltda","12.345.678/0001-01","Ana Silva","(92) 91824-1409","ana.silva@email.com","São Paulo","SP","Ativo"]
[null,null,"CLI-002","Orbital Engenharia","Orbital Engenharia S.A.","23.456.789/0001-02","Bruno Costa","(42) 93657-3286","bruno.costa@email.com","Rio de Janeiro","RJ","Ativo"]
[null,null,"CLI-003","Vértice Consultoria","Vértice Consultoria ME","34.567.890/0001-03","Carlos Mendes","(97) 98935-2424","carlos.mendes@email.com","Belo Horizonte","MG","Ativo"]
[null,null,"CLI-004","Ápice Logística","Ápice Logística e Transportes Ltda","45.678.901/0001-04","Daniela Oliveira","(15) 90488-2535","daniela.oliveira@email.com","Curitiba","PR","Ativo"]
[null,null,"CLI-005","Bravus Construtora","Bravus Construtora Eireli","56.789.012/0001-05","Eduardo Santos","(75) 99863-1434","eduardo.santos@email.com","Porto Alegre","RS","Ativo"]
[null,null,"CLI-006","Solaris Energia","Solaris Energia Renovável S.A.","67.890.123/0001-06","Fernanda Lima","(94) 98928-7873","fernanda.lima@email.com","Salvador","BA","Ativo"]
[null,null,"CLI-007","Titanium Seguros","Titanium Seguros e Previdência Ltda","78.901.234/0001-07","Gustavo Almeida","(25) 93139-8157","gustavo.almeida@email.com","Recife","PE","Ativo"]
[null,null,"CLI-008","Nova Horizonte Edu","Nova Horizonte Educação Ltda","89.012.345/0001-08","Helena Rocha","(60) 98413-1816","helena.rocha@email.com","Fortaleza","CE","Ativo"]
[null,null,"CLI-009","Quartzo Mineração","Quartzo Mineração e Comércio S.A.","90.123.456/0001-09","Igor Ferreira","(42) 90133-6455","igor.ferreira@email.com","Brasília","DF","Ativo"]
[null,null,"CLI-010","Pulsar Marketing","Pulsar Marketing Digital ME","01.234.567/0001-10","Julia Martins","(49) 96429-1484","julia.martins@email.com","Goiânia","GO","Ativo"]
[null,null,"CLI-011","Zenith Farmacêutica","Zenith Farmacêutica Ltda","11.223.344/0001-11","Kleber Souza","(81) 92397-3458","kleber.souza@email.com","Campinas","SP","Ativo"]
[null,null,"CLI-012","Croma Design","Croma Design e Arquitetura Eireli","22.334.455/0001-12","Larissa Pereira","(55) 96805-9605","larissa.pereira@email.com","Manaus","AM","Ativo"]
[null,null,"CLI-013","Fortuna Investimentos","Fortuna Investimentos S.A.","33.445.566/0001-13","Marcos Ribeiro","(29) 94938-2456","marcos.ribeiro@email.com","Florianópolis","SC","Ativo"]
[null,null,"CLI-014","Onda Verde Ambiental","Onda Verde Soluções Ambientais Ltda","44.556.677/0001-14","Natália Borges","(47) 94100-3379","natalia.borges@email.com","Vitória","ES","Ativo"]
[null,null,"CLI-015","Atlas Transporte","Atlas Transporte e Logística ME","55.667.788/0001-15","Oscar Dias","(62) 94729-1614","oscar.dias@email.com","Belém","PA","Inativo"]
[null,null,"CLI-016","Magma Siderurgia","Magma Siderurgia e Aços S.A.","66.778.899/0001-16","Patrícia Nunes","(38) 91476-7694","patricia.nunes@email.com","São Luís","MA","Ativo"]
[null,null,"CLI-017","Criativa Publicidade","Criativa Publicidade e Propaganda Ltda","77.889.900/0001-17","Rafael Teixeira","(72) 95447-4804","rafael.teixeira@email.com","Natal","RN","Ativo"]
[null,null,"CLI-018","Primus Saúde","Primus Saúde e Bem-Estar Eireli","88.990.011/0001-18","Sabrina Lopes","(31) 91965-7263","sabrina.lopes@email.com","Joinville","SC","Ativo"]
[null,null,"CLI-019","Velox TI","Velox Tecnologia da Informação Ltda","99.001.122/0001-19","Thiago Moreira","(51) 90655-1759","thiago.moreira@email.com","Uberlândia","MG","Inativo"]
[null,null,"CLI-020","Terra Nova Agro","Terra Nova Agronegócios S.A.","10.112.233/0001-20","Úrsula Cardoso","(35) 95792-2764","ursula.cardoso@email.com","Ribeirão Preto","SP","Ativo"]
[null,null,"CLI-021","Safira Joias","Safira Joias e Acessórios ME","21.223.344/0001-21","Vinícius Castro","(96) 93862-6820","vinicius.castro@email.com","Londrina","PR","Ativo"]
[null,null,"CLI-022","Helio Telecom","Helio Telecomunicações Ltda","32.334.455/0001-22","Wesley Barbosa","(68) 96131-2803","wesley.barbosa@email.com","Niterói","RJ","Inativo"]
[null,null,"CLI-023","Acqua Tratamento","Acqua Tratamento de Água Eireli","43.445.566/0001-23","Yasmin Farias","(82) 90524-3651","yasmin.farias@email.com","Aracaju","SE","Ativo"]

{"sheet":"Cad_Responsaveis","index":3,"n_rows":14,"n_cols":9,"rows_kept":14,"hidden":true,"merged":[[1,2,1,8],[2,2,2,8],[3,2,3,8]]}
[]
[null,null,"CADASTRO DE RESPONSÁVEIS"]
[]
[]
[]
[]
[null,null,"Cod_Resp","Responsavel","Area","Funcao","Email","Telefone","Status_Resp"]
[null,null,"RESP-001","Ricardo Monteiro","Engenharia","Gerente de Projetos","ricardo.monteiro@empresa.com","(11) 98765-4321","Ativo"]
[null,null,"RESP-002","Camila Duarte","TI","Coordenadora de TI","camila.duarte@empresa.com","(21) 97654-3210","Ativo"]
[null,null,"RESP-003","André Machado","Operações","Diretor de Operações","andre.machado@empresa.com","(31) 96543-2109","Ativo"]
[null,null,"RESP-004","Beatriz Alves","Comercial","Gerente Comercial","beatriz.alves@empresa.com","(41) 95432-1098","Ativo"]
[null,null,"RESP-005","Diego Fonseca","Financeiro","Analista Financeiro","diego.fonseca@empresa.com","(51) 94321-0987","Ativo"]
[null,null,"RESP-006","Elisa Prado","Marketing","Coordenadora de Marketing","elisa.prado@empresa.com","(61) 93210-9876","Ativo"]
[null,null,"RESP-007","Felipe Neves","Consultoria","Consultor Sênior","felipe.neves@empresa.com","(71) 92109-8765","Ativo"]

{"sheet":"Projetos","index":4,"n_rows":74,"n_cols":23,"rows_kept":74,"hidden":true,"merged":[[1,2,1,22],[2,2,2,22],[3,2,3,22]]}
[]
[null,null,"GESTÃO DE PROJETOS"]
[]
[]
[]
[]
[null,null,"Cod_Projeto","Projeto","Cliente","Categoria","Responsavel","Prioridade","Data_Inicio","Prazo","Data_Termino_Real","Status","Perc_Conclusao","Valor_Contratado","Custo_Previsto","Custo_Real","Margem_Prevista","Margem_Real","Situacao_Prazo","Dias_Restantes","Centro_Custo","Ativo","Observacoes"]
[null,null,"PROJ-001","Migração de ERP","Nexus Tecnologia","Marketing","Ricardo Monteiro","Média","2024-02-28","2024-06-30","2024-06-21","Concluído",{"v":1,"d":"100%"},{"v":224711.09,"d":"224,711.09"},{"v":128620.23,"d":"128,620.23"},{"v":146904.15,"d":"146,904.15"},{"$f":"N8-O8","v":{"v":96090.86,"d":"96,090.86"}},{"$f":"N8-P8","v":{"v":77806.94,"d":"77,806.94"}},{"$f":"IF(L8=\"Concluído\",\"Finalizado\",IF(TODAY()>J8,\"Atrasado\",IF(TODAY()+7>J8,\"Próximo do prazo\",\"No prazo\")))","v":"Finalizado"},{"$f":"IF(L8=\"Concluído\",0,J8-TODAY())","v":0},"CC-MKT","Não"]
[null,null,"PROJ-002","Novo Portal Web","Orbital Engenharia","Marketing","Camila Duarte","Baixa","2024-01-21","2024-05-26","2024-05-12","Concluído",{"v":1,"d":"100%"},{"v":428890.44,"d":"428,890.44"},{"v":319116.72,"d":"319,116.72"},{"v":348127.43,"d":"348,127.43"},{"$f":"N9-O9","v":{"v":109773.72000000003,"d":"109,773.72"}},{"$f":"N9-P9","v":{"v":80763.01000000001,"d":"80,763.01"}},{"$f":"IF(L9=\"Concluído\",\"Finalizado\",IF(TODAY()>J9,\"Atrasado\",IF(TODAY()+7>J9,\"Próximo do prazo\",\"No prazo\")))","v":"Finalizado"},{"$f":"IF(L9=\"Concluído\",0,J9-TODAY())","v":0},"CC-TI","Não"]
[null,null,"PROJ-003","App Mobile Vendas","Vértice Consultoria","Implantação","André Machado","Média","2024-04-11","2024-09-10","2024-10-23","Concluído",{"v":1,"d":"100%"},{"v":478073.71,"d":"478,073.71"},{"v":337556.09,"d":"337,556.09"},{"v":370990.61,"d":"370,990.61"},{"v":140517.62,"d":"140,517.62"},{"v":107083.10000000003,"d":"107,083.10"},"Finalizado",0,"CC-ENG","Não"]
[null,null,"PROJ-004","Automação de RH","Ápice Logística","Interno","Beatriz Alves","Média","2024-02-01","2024-04-24","2024-05-02","Concluído",{"v":1,"d":"100%"},{"v":810361.93,"d":"810,361.93"},{"v":502458.29,"d":"502,458.29"},{"v":440057.46,"d":"440,057.46"},{"v":307903.6400000001,"d":"307,903.64"},{"v":370304.47000000003,"d":"370,304.47"},"Finalizado",0,"CC-FIN","Não"]
[null,null,"PROJ-005","BI Dashboard","Bravus Construtora","Desenvolvimento","Diego Fonseca","Alta","2024-06-09","2024-11-08","2024-11-04","Concluído",{"v":1,"d":"100%"},{"v":67483.67,"d":"67,483.67"},{"v":37773.56,"d":"37,773.56"},{"v":37938.12,"d":"37,938.12"},{"v":29710.11,"d":"29,710.11"},{"v":29545.549999999996,"d":"29,545.55"},"Finalizado",0,"CC-OPS","Não"]
[null,null,"PROJ-006","Integração CRM","Solaris Energia","Manutenção","Elisa Prado","Média","2024-04-23","2024-07-05",null,"Cancelado",{"v":0.05,"d":"5%"},{"v":737653.06,"d":"737,653.06"},{"v":304299.65,"d":"304,299.65"},{"v":0,"d":"0.00"},{"v":433353.41000000003,"d":"433,353.41"},{"v":737653.06,"d":"737,653.06"},"Atrasado",-769,"CC-COM","Não"]
[null,null,"PROJ-007","Reforma Sede","Titanium Seguros","Manutenção","Felipe Neves","Alta","2024-04-21","2024-07-01","2024-07-04","Concluído",{"v":1,"d":"100%"},{"v":593267.67,"d":"593,267.67"},{"v":354766.37,"d":"354,766.37"},{"v":390020.48,"d":"390,020.48"},{"v":238501.30000000005,"d":"238,501.30"},{"v":203247.19000000006,"d":"203,247.19"},"Finalizado",0,"CC-ADM","Não"]
[null,null,"PROJ-008","Campanha Digital Q1","Nova Horizonte Edu","Desenvolvimento","Ricardo Monteiro","Média","2024-06-18","2024-10-22","2024-10-02","Concluído",{"v":1,"d":"100%"},{"v":549770.27,"d":"549,770.27"},{"v":408734.47,"d":"408,734.47"},{"v":493741.08,"d":"493,741.08"},{"v":141035.80000000005,"d":"141,035.80"},{"v":56029.19,"d":"56,029.19"},"Finalizado",0,"CC-TI","Não"]
[null,null,"PROJ-009","Auditoria Fiscal","Quartzo Mineração","Interno","Camila Duarte","Alta","2024-03-07","2024-06-19",null,"Cancelado",{"v":0.3,"d":"30%"},{"v":591218.46,"d":"591,218.46"},{"v":348618.91,"d":"348,618.91"},{"v":0,"d":"0.00"},{"v":242599.55,"d":"242,599.55"},{"v":591218.46,"d":"591,218.46"},"Atrasado",-785,"CC-OPS","Não"]
[null,null,"PROJ-010","Consultoria ISO 9001","Pulsar Marketing","Consultoria","André Machado","Crítica","2024-01-06","2024-04-19","2024-04-27","Concluído",{"v":1,"d":"100%"},{"v":651890.34,"d":"651,890.34"},{"v":520076.03,"d":"520,076.03"},{"v":641519.93,"d":"641,519.93"},{"v":131814.30999999994,"d":"131,814.31"},{"v":10370.409999999916,"d":"10,370.41"},"Finalizado",0,"CC-ENG","Não"]
[null,null,"PROJ-011","Expansão Filial Norte","Zenith Farmacêutica","Manutenção","Beatriz Alves","Alta","2025-09-09","2026-02-23",null,"Em andamento",{"v":0.63,"d":"63%"},{"v":498789.54,"d":"498,789.54"},{"v":394671.23,"d":"394,671.23"},{"v":154744.27,"d":"154,744.27"},{"v":104118.31,"d":"104,118.31"},{"v":344045.27,"d":"344,045.27"},"Atrasado",-171,"CC-ADM","Sim"]
[null,null,"PROJ-012","Plataforma E-commerce","Croma Design","Marketing","Diego Fonseca","Média","2024-06-08","2024-12-15","2024-12-11","Concluído",{"v":1,"d":"100%"},{"v":638091.02,"d":"638,091.02"},{"v":319406.27,"d":"319,406.27"},{"v":411116.53,"d":"411,116.53"},{"v":318684.75,"d":"318,684.75"},{"v":226974.49,"d":"226,974.49"},"Finalizado",0,"CC-MKT","Não"]
[null,null,"PROJ-013","Treinamento Liderança","Fortuna Investimentos","Implantação","Elisa Prado","Média","2024-08-14","2025-01-31","2025-01-11","Concluído",{"v":1,"d":"100%"},{"v":139766.99,"d":"139,766.99"},{"v":46938.91,"d":"46,938.91"},{"v":36973.4,"d":"36,973.40"},{"v":92828.07999999999,"d":"92,828.08"},{"v":102793.59,"d":"102,793.59"},"Finalizado",0,"CC-ENG","Não"]
[null,null,"PROJ-014","Sistema de Tickets","Onda Verde Ambiental","Desenvolvimento","Felipe Neves","Baixa","2024-11-24","2025-09-04",null,"Em andamento",{"v":0.85,"d":"85%"},{"v":68614.67,"d":"68,614.67"},{"v":52006.45,"d":"52,006.45"},{"v":36693.76,"d":"36,693.76"},{"v":16608.22,"d":"16,608.22"},{"v":31920.909999999996,"d":"31,920.91"},"Atrasado",-343,"CC-TI","Sim"]
[null,null,"PROJ-015","Gestão de Frotas","Atlas Transporte","Marketing","Ricardo Monteiro","Crítica","2024-05-19","2025-01-14","2025-01-22","Concluído",{"v":1,"d":"100%"},{"v":784948.12,"d":"784,948.12"},{"v":536513.96,"d":"536,513.96"},{"v":575879.11,"d":"575,879.11"},{"v":248434.16000000003,"d":"248,434.16"},{"v":209069.01,"d":"209,069.01"},"Finalizado",0,"CC-FIN","Não"]
[null,null,"PROJ-016","Portal do Fornecedor","Magma Siderurgia","Consultoria","Camila Duarte","Alta","2024-07-28","2025-01-26",null,"Em pausa",{"v":0.18,"d":"18%"},{"v":389124.08,"d":"389,124.08"},{"v":155458.64,"d":"155,458.64"},{"v":25012.58,"d":"25,012.58"},{"v":233665.44,"d":"233,665.44"},{"v":364111.5,"d":"364,111.50"},"Atrasado",-564,"CC-OPS","Sim"]
[null,null,"PROJ-017","Chatbot Atendimento","Criativa Publicidade","Consultoria","André Machado","Média","2024-08-05","2025-06-01",null,"Em andamento",{"v":0.73,"d":"73%"},{"v":193447.67,"d":"193,447.67"},{"v":84710.52,"d":"84,710.52"},{"v":61891.3,"d":"61,891.30"},{"v":108737.15000000001,"d":"108,737.15"},{"v":131556.37,"d":"131,556.37"},"Atrasado",-438,"CC-COM","Sim"]
[null,null,"PROJ-018","Migração Cloud AWS","Primus Saúde","Consultoria","Beatriz Alves","Média","2024-10-30","2025-06-08",null,"Cancelado",{"v":0.2,"d":"20%"},{"v":827479.25,"d":"827,479.25"},{"v":599277.55,"d":"599,277.55"},{"v":0,"d":"0.00"},{"v":228201.69999999995,"d":"228,201.70"},{"v":827479.25,"d":"827,479.25"},"Atrasado",-431,"CC-FIN","Não"]
[null,null,"PROJ-019","Projeto Sustentabilidade","Velox TI","Interno","Diego Fonseca","Média","2024-12-17","2025-06-18",null,"Em andamento",{"v":0.39,"d":"39%"},{"v":551903.23,"d":"551,903.23"},{"v":361948.4,"d":"361,948.40"},{"v":88685.72,"d":"88,685.72"},{"v":189954.82999999996,"d":"189,954.83"},{"v":463217.51,"d":"463,217.51"},"Atrasado",-421,"CC-TI","Sim"]
[null,null,"PROJ-020","Análise de Mercado","Terra Nova Agro","Interno","Elisa Prado","Média","2024-10-08","2025-05-14","2025-05-02","Concluído",{"v":1,"d":"100%"},{"v":206361.52,"d":"206,361.52"},{"v":108506.52,"d":"108,506.52"},{"v":128965.51,"d":"128,965.51"},{"v":97854.99999999999,"d":"97,855.00"},{"v":77396.01,"d":"77,396.01"},"Finalizado",0,"CC-ADM","Não"]
[null,null,"PROJ-021","Redesign Marca","Safira Joias","Desenvolvimento","Felipe Neves","Média","2024-08-06","2025-10-03",null,"Em andamento",{"v":0.46,"d":"46%"},{"v":377853.82,"d":"377,853.82"},{"v":303709.02,"d":"303,709.02"},{"v":117009.55,"d":"117,009.55"},{"v":74144.79999999999,"d":"74,144.80"},{"v":260844.27000000002,"d":"260,844.27"},"Atrasado",-314,"CC-MKT","Sim"]
[null,null,"PROJ-022","Implantação SAP","Helio Telecom","Manutenção","Ricardo Monteiro","Crítica","2024-06-09","2025-04-05","2025-04-30","Concluído",{"v":1,"d":"100%"},{"v":479283.78,"d":"479,283.78"},{"v":235488.43,"d":"235,488.43"},{"v":295181.73,"d":"295,181.73"},{"v":243795.35000000003,"d":"243,795.35"},{"v":184102.05000000005,"d":"184,102.05"},"Finalizado",0,"CC-ENG","Não"]
[null,null,"PROJ-023","Otimização Logística","Acqua Tratamento","Marketing","Camila Duarte","Baixa","2024-08-25","2025-03-15",null,"Em pausa",{"v":0.18,"d":"18%"},{"v":381632.69,"d":"381,632.69"},{"v":272100.98,"d":"272,100.98"},{"v":44514.24,"d":"44,514.24"},{"v":109531.71000000002,"d":"109,531.71"},{"v":337118.45,"d":"337,118.45"},"Atrasado",-516,"CC-ENG","Sim"]
[null,null,"PROJ-024","Sistema de Ponto","Nexus Tecnologia","Desenvolvimento","André Machado","Baixa","2024-09-18","2025-05-04","2025-05-09","Concluído",{"v":1,"d":"100%"},{"v":662616.87,"d":"662,616.87"},{"v":316822.32,"d":"316,822.32"},{"v":309485.09,"d":"309,485.09"},{"v":345794.55,"d":"345,794.55"},{"v":353131.77999999997,"d":"353,131.78"},"Finalizado",0,"CC-ENG","Não"]
[null,null,"PROJ-025","Campanha Black Friday","Orbital Engenharia","Interno","Beatriz Alves","Baixa","2024-07-03","2025-03-31","2025-05-19","Concluído",{"v":1,"d":"100%"},{"v":87234.61,"d":"87,234.61"},{"v":64696.03,"d":"64,696.03"},{"v":72673.45,"d":"72,673.45"},{"v":22538.58,"d":"22,538.58"},{"v":14561.160000000003,"d":"14,561.16"},"Finalizado",0,"CC-TI","Não"]
[null,null,"PROJ-026","Compliance LGPD","Vértice Consultoria","Consultoria","Diego Fonseca","Alta","2025-04-27","2025-09-21",null,"Em pausa",{"v":0.55,"d":"55%"},{"v":690872.47,"d":"690,872.47"},{"v":411940.64,"d":"411,940.64"},{"v":193427.95,"d":"193,427.95"},{"v":278931.82999999996,"d":"278,931.83"},{"v":497444.51999999996,"d":"497,444.52"},"Atrasado",-326,"CC-MKT","Sim"]
[null,null,"PROJ-027","Novo Data Center","Ápice Logística","Implantação","Elisa Prado","Baixa","2025-02-10","2025-06-09",null,"Em andamento",{"v":0.7,"d":"70%"},{"v":95966.9,"d":"95,966.90"},{"v":72712.7,"d":"72,712.70"},{"v":41618.85,"d":"41,618.85"},{"v":23254.199999999997,"d":"23,254.20"},{"v":54348.049999999996,"d":"54,348.05"},"Atrasado",-430,"CC-COM","Sim"]
[null,null,"PROJ-028","App Manutenção","Bravus Construtora","Manutenção","Felipe Neves","Alta","2025-04-30","2025-10-20",null,"Em andamento",{"v":0.4,"d":"40%"},{"v":53076.5,"d":"53,076.50"},{"v":30701.41,"d":"30,701.41"},{"v":10442.39,"d":"10,442.39"},{"v":22375.09,"d":"22,375.09"},{"v":42634.11,"d":"42,634.11"},"Atrasado",-297,"CC-TI","Sim"]
[null,null,"PROJ-029","Intranet Corporativa","Solaris Energia","Desenvolvimento","Ricardo Monteiro","Crítica","2025-07-05","2025-11-16",null,"Em andamento",{"v":0.49,"d":"49%"},{"v":75371.11,"d":"75,371.11"},{"v":42146.31,"d":"42,146.31"},{"v":20718.6,"d":"20,718.60"},{"v":33224.8,"d":"33,224.80"},{"v":54652.51,"d":"54,652.51"},"Atrasado",-270,"CC-OPS","Sim"]
[null,null,"PROJ-030","Programa Trainee","Titanium Seguros","Consultoria","Camila Duarte","Alta","2025-06-22","2026-01-24",null,"Em andamento",{"v":0.27,"d":"27%"},{"v":578109.95,"d":"578,109.95"},{"v":429920.39,"d":"429,920.39"},{"v":135743.73,"d":"135,743.73"},{"v":148189.55999999994,"d":"148,189.56"},{"v":442366.22,"d":"442,366.22"},"Atrasado",-201,"CC-MKT","Sim"]
[null,null,"PROJ-031","CRM Integrado","Nova Horizonte Edu","Marketing","André Machado","Média","2025-05-04","2025-11-14",null,"Em andamento",{"v":0.19,"d":"19%"},{"v":216873.95,"d":"216,873.95"},{"v":112104.97,"d":"112,104.97"},{"v":23893.79,"d":"23,893.79"},{"v":104768.98000000001,"d":"104,768.98"},{"v":192980.16,"d":"192,980.16"},"Atrasado",-272,"CC-ADM","Sim"]
[null,null,"PROJ-032","Pesquisa de Satisfação","Quartzo Mineração","Baixa","Beatriz Alves","Baixa","2025-04-12","2025-07-27","2025-07-14","Concluído",{"v":1,"d":"100%"},{"v":840983.52,"d":"840,983.52"},{"v":432744.47,"d":"432,744.47"},{"v":471638.29,"d":"471,638.29"},{"v":408239.05000000005,"d":"408,239.05"},{"v":369345.23000000004,"d":"369,345.23"},"Finalizado",0,"CC-COM","Não"]
[null,null,"PROJ-033","Automação Industrial","Pulsar Marketing","Desenvolvimento","Diego Fonseca","Baixa","2025-10-19","2026-03-29",null,"Planejado",{"v":0,"d":"0%"},{"v":830510.44,"d":"830,510.44"},{"v":359868.5,"d":"359,868.50"},{"v":0,"d":"0.00"},{"v":470641.93999999994,"d":"470,641.94"},{"v":830510.44,"d":"830,510.44"},"Atrasado",-137,"CC-FIN","Sim"]
[null,null,"PROJ-034","Gestão de Contratos","Zenith Farmacêutica","Desenvolvimento","Elisa Prado","Média","2025-03-22","2025-08-23","2025-09-01","Concluído",{"v":1,"d":"100%"},{"v":627584.86,"d":"627,584.86"},{"v":387902.69,"d":"387,902.69"},{"v":449088.28,"d":"449,088.28"},{"$f":"N41-O41","v":{"v":239682.16999999998,"d":"239,682.17"}},{"$f":"N41-P41","v":{"v":178496.57999999996,"d":"178,496.58"}},{"$f":"IF(L41=\"Concluído\",\"Finalizado\",IF(TODAY()>J41,\"Atrasado\",IF(TODAY()+7>J41,\"Próximo do prazo\",\"No prazo\")))","v":"Finalizado"},{"$f":"IF(L41=\"Concluído\",0,J41-TODAY())","v":0},"CC-ADM","Não"]
[null,null,"PROJ-035","Hub de Inovação","Croma Design","Marketing","Felipe Neves","Alta","2025-04-13","2025-10-11",null,"Em pausa",{"v":0.22,"d":"22%"},{"v":717152.46,"d":"717,152.46"},{"v":369647.57,"d":"369,647.57"},{"v":83415.42,"d":"83,415.42"},{"v":347504.88999999996,"d":"347,504.89"},{"v":633737.0399999999,"d":"633,737.04"},"Atrasado",-306,"CC-MKT","Sim"]
[null,null,"PROJ-036","Sistema Financeiro","Fortuna Investimentos","Interno","Ricardo Monteiro","Crítica","2025-06-04","2025-10-03","2025-11-05","Concluído",{"v":1,"d":"100%"},{"v":345184.24,"d":"345,184.24"},{"v":225277.98,"d":"225,277.98"},{"v":207438.43,"d":"207,438.43"},{"v":119906.25999999998,"d":"119,906.26"},{"v":137745.81,"d":"137,745.81"},"Finalizado",0,"CC-OPS","Não"]
[null,null,"PROJ-037","Campanha Verão","Onda Verde Ambiental","Interno","Camila Duarte","Média","2025-02-19","2025-04-29",null,"Em andamento",{"v":0.4,"d":"40%"},{"v":787549.03,"d":"787,549.03"},{"v":549999.33,"d":"549,999.33"},{"v":174362.7,"d":"174,362.70"},{"v":237549.70000000007,"d":"237,549.70"},{"v":613186.3300000001,"d":"613,186.33"},"Atrasado",-471,"CC-MKT","Sim"]
[null,null,"PROJ-038","Plano de Carreira","Atlas Transporte","Consultoria","André Machado","Baixa","2025-05-15","2026-01-15",null,"Em andamento",{"v":0.28,"d":"28%"},{"v":340013.91,"d":"340,013.91"},{"v":242588.82,"d":"242,588.82"},{"v":65576.58,"d":"65,576.58"},{"v":97425.08999999997,"d":"97,425.09"},{"v":274437.32999999996,"d":"274,437.33"},"Atrasado",-210,"CC-TI","Sim"]
[null,null,"PROJ-039","Manutenção Preventiva","Magma Siderurgia","Marketing","Beatriz Alves","Baixa","2025-06-02","2025-09-06","2025-10-04","Concluído",{"v":1,"d":"100%"},{"v":30079.67,"d":"30,079.67"},{"v":24774.01,"d":"24,774.01"},{"v":30841.77,"d":"30,841.77"},{"v":5305.66,"d":"5,305.66"},{"v":-762.1000000000022,"d":"-762.10"},"Finalizado",0,"CC-TI","Não"]
[null,null,"PROJ-040","E-learning Platform","Criativa Publicidade","Interno","Diego Fonseca","Baixa","2025-02-18","2025-06-03",null,"Em andamento",{"v":0.42,"d":"42%"},{"v":228692.69,"d":"228,692.69"},{"v":188359.52,"d":"188,359.52"},{"v":80891.4,"d":"80,891.40"},{"v":40333.17000000001,"d":"40,333.17"},{"v":147801.29,"d":"147,801.29"},"Atrasado",-436,"CC-COM","Sim"]
[null,null,"PROJ-041","Gestão de Estoques","Primus Saúde","Implantação","Elisa Prado","Alta","2025-10-16","2026-04-02","2026-04-30","Concluído",{"v":1,"d":"100%"},{"v":656008.05,"d":"656,008.05"},{"v":529358.24,"d":"529,358.24"},{"v":493050.47,"d":"493,050.47"},{"v":126649.81000000006,"d":"126,649.81"},{"v":162957.58000000007,"d":"162,957.58"},"Finalizado",0,"CC-MKT","Não"]
[null,null,"PROJ-042","Portal de RH","Velox TI","Consultoria","Felipe Neves","Alta","2025-06-08","2025-08-23",null,"Planejado",{"v":0,"d":"0%"},{"v":198454.65,"d":"198,454.65"},{"v":108500.76,"d":"108,500.76"},{"v":0,"d":"0.00"},{"v":89953.89,"d":"89,953.89"},{"v":198454.65,"d":"198,454.65"},"Atrasado",-355,"CC-ADM","Sim"]
[null,null,"PROJ-043","Integração ERP-CRM","Terra Nova Agro","Consultoria","Ricardo Monteiro","Alta","2025-06-08","2025-09-30",null,"Em andamento",{"v":0.51,"d":"51%"},{"v":29076,"d":"29,076.00"},{"v":21361.18,"d":"21,361.18"},{"v":8048.83,"d":"8,048.83"},{"v":7714.82,"d":"7,714.82"},{"v":21027.17,"d":"21,027.17"},"Atrasado",-317,"CC-COM","Sim"]
[null,null,"PROJ-044","Central de Custos","Safira Joias","Implantação","Camila Duarte","Alta","2025-09-18","2026-03-06",null,"Em pausa",{"v":0.48,"d":"48%"},{"v":440560.82,"d":"440,560.82"},{"v":222849.51,"d":"222,849.51"},{"v":111977.49,"d":"111,977.49"},{"v":217711.31,"d":"217,711.31"},{"v":328583.33,"d":"328,583.33"},"Atrasado",-160,"CC-ENG","Sim"]
[null,null,"PROJ-045","Projeto Solar","Helio Telecom","Implantação","André Machado","Crítica","2025-03-10","2025-10-07",null,"Planejado",{"v":0,"d":"0%"},{"v":393898.71,"d":"393,898.71"},{"v":244428.98,"d":"244,428.98"},{"v":0,"d":"0.00"},{"v":149469.73,"d":"149,469.73"},{"v":393898.71,"d":"393,898.71"},"Atrasado",-310,"CC-FIN","Sim"]
[null,null,"PROJ-046","Marketing de Conteúdo","Acqua Tratamento","Implantação","Beatriz Alves","Alta","2025-11-02","2026-02-21",null,"Em pausa",{"v":0.2,"d":"20%"},{"v":752465.39,"d":"752,465.39"},{"v":523682.18,"d":"523,682.18"},{"v":103622.78,"d":"103,622.78"},{"v":228783.21000000002,"d":"228,783.21"},{"v":648842.61,"d":"648,842.61"},"Atrasado",-173,"CC-ADM","Sim"]
[null,null,"PROJ-047","Rebranding Digital","Nexus Tecnologia","Implantação","Diego Fonseca","Alta","2026-03-31","2026-07-08",null,"Planejado",{"v":0,"d":"0%"},{"v":373812.17,"d":"373,812.17"},{"v":307406.95,"d":"307,406.95"},{"v":0,"d":"0.00"},{"v":66405.21999999997,"d":"66,405.22"},{"v":373812.17,"d":"373,812.17"},"Atrasado",-36,"CC-OPS","Sim"]
[null,null,"PROJ-048","Sistema de Qualidade","Orbital Engenharia","Desenvolvimento","Elisa Prado","Alta","2025-11-26","2026-08-10",null,"Planejado",{"v":0,"d":"0%"},{"v":717989.13,"d":"717,989.13"},{"v":530084.66,"d":"530,084.66"},{"v":0,"d":"0.00"},{"v":187904.46999999997,"d":"187,904.47"},{"v":717989.13,"d":"717,989.13"},"Atrasado",-3,"CC-COM","Sim"]
[null,null,"PROJ-049","Expansão Regional Sul","Vértice Consultoria","Manutenção","Felipe Neves","Baixa","2025-12-28","2026-06-19",null,"Em andamento",{"v":0.73,"d":"73%"},{"v":643696.91,"d":"643,696.91"},{"v":468240.92,"d":"468,240.92"},{"v":245274.48,"d":"245,274.48"},{"v":175455.99000000005,"d":"175,455.99"},{"v":398422.43000000005,"d":"398,422.43"},"Atrasado",-55,"CC-FIN","Sim"]
[null,null,"PROJ-050","Consultoria Tributária","Ápice Logística","Implantação","Ricardo Monteiro","Média","2025-12-25","2026-10-13",null,"Planejado",{"v":0,"d":"0%"},{"v":847335.88,"d":"847,335.88"},{"v":632390.3,"d":"632,390.30"},{"v":0,"d":"0.00"},{"v":214945.57999999996,"d":"214,945.58"},{"v":847335.88,"d":"847,335.88"},"No prazo",61,"CC-OPS","Sim"]
[null,null,"PROJ-051","App Financeiro","Bravus Construtora","Marketing","Camila Duarte","Média","2025-11-28","2026-09-04",null,"Planejado",{"v":0,"d":"0%"},{"v":173921.28,"d":"173,921.28"},{"v":109514.28,"d":"109,514.28"},{"v":0,"d":"0.00"},{"v":64407,"d":"64,407.00"},{"v":173921.28,"d":"173,921.28"},"No prazo",22,"CC-ENG","Sim"]
[null,null,"PROJ-052","Implantação TOTVS","Solaris Energia","Interno","André Machado","Média","2026-02-21","2026-05-13",null,"Planejado",{"v":0,"d":"0%"},{"v":378244.36,"d":"378,244.36"},{"v":175907.19,"d":"175,907.19"},{"v":0,"d":"0.00"},{"v":202337.16999999998,"d":"202,337.17"},{"v":378244.36,"d":"378,244.36"},"Atrasado",-92,"CC-ADM","Sim"]
[null,null,"PROJ-053","Automação de Vendas","Titanium Seguros","Consultoria","Beatriz Alves","Alta","2026-03-09","2026-06-04",null,"Planejado",{"v":0,"d":"0%"},{"v":88833.32,"d":"88,833.32"},{"v":53837.84,"d":"53,837.84"},{"v":0,"d":"0.00"},{"v":34995.48000000001,"d":"34,995.48"},{"v":88833.32,"d":"88,833.32"},"Atrasado",-70,"CC-ADM","Sim"]
[null,null,"PROJ-054","Segurança da Informação","Nova Horizonte Edu","Implantação","Diego Fonseca","Baixa","2025-12-27","2026-05-19",null,"Planejado",{"v":0,"d":"0%"},{"v":625715.28,"d":"625,715.28"},{"v":449659.82,"d":"449,659.82"},{"v":0,"d":"0.00"},{"v":176055.46000000002,"d":"176,055.46"},{"v":625715.28,"d":"625,715.28"},"Atrasado",-86,"CC-TI","Sim"]
[null,null,"PROJ-055","Programa de Estágio","Quartzo Mineração","Interno","Elisa Prado","Alta","2026-03-18","2026-06-28",null,"Planejado",{"v":0,"d":"0%"},{"v":821368.74,"d":"821,368.74"},{"v":409129.61,"d":"409,129.61"},{"v":0,"d":"0.00"},{"v":412239.13,"d":"412,239.13"},{"v":821368.74,"d":"821,368.74"},"Atrasado",-46,"CC-COM","Sim"]
[null,null,"PROJ-056","Portal B2B","Pulsar Marketing","Consultoria","Felipe Neves","Média","2025-12-15","2026-10-01",null,"Em andamento",{"v":0.43,"d":"43%"},{"v":305669.54,"d":"305,669.54"},{"v":128184.81,"d":"128,184.81"},{"v":47542.95,"d":"47,542.95"},{"v":177484.72999999998,"d":"177,484.73"},{"v":258126.58999999997,"d":"258,126.59"},"No prazo",49,"CC-FIN","Sim"]
[null,null,"PROJ-057","Gestão de Riscos","Zenith Farmacêutica","Manutenção","Ricardo Monteiro","Crítica","2026-02-22","2026-11-11",null,"Em andamento",{"v":0.92,"d":"92%"},{"v":519119.85,"d":"519,119.85"},{"v":337854.81,"d":"337,854.81"},{"v":330795.25,"d":"330,795.25"},{"v":181265.03999999998,"d":"181,265.04"},{"v":188324.59999999998,"d":"188,324.60"},"No prazo",90,"CC-ENG","Sim"]
[null,null,"PROJ-058","Campanha Dia das Mães","Croma Design","Interno","Camila Duarte","Média","2026-03-12","2026-10-19",null,"Planejado",{"v":0,"d":"0%"},{"v":379155.37,"d":"379,155.37"},{"v":163315.67,"d":"163,315.67"},{"v":0,"d":"0.00"},{"v":215839.69999999998,"d":"215,839.70"},{"v":379155.37,"d":"379,155.37"},"No prazo",67,"CC-OPS","Sim"]
[null,null,"PROJ-059","Otimização SEO","Fortuna Investimentos","Manutenção","André Machado","Média","2026-03-02","2026-10-01",null,"Em andamento",{"v":0.77,"d":"77%"},{"v":98933.96,"d":"98,933.96"},{"v":64024.02,"d":"64,024.02"},{"v":35320.48,"d":"35,320.48"},{"v":34909.94000000001,"d":"34,909.94"},{"v":63613.48,"d":"63,613.48"},"No prazo",49,"CC-OPS","Sim"]
[null,null,"PROJ-060","Plataforma de Dados","Onda Verde Ambiental","Marketing","Beatriz Alves","Baixa","2025-11-25","2026-02-25",null,"Em andamento",{"v":0.49,"d":"49%"},{"v":469331.94,"d":"469,331.94"},{"v":267875.71,"d":"267,875.71"},{"v":130741.77,"d":"130,741.77"},{"v":201456.22999999998,"d":"201,456.23"},{"v":338590.17,"d":"338,590.17"},"Atrasado",-169,"CC-ENG","Sim"]
[null,null,"PROJ-061","Sistema de Compras","Atlas Transporte","Marketing","Diego Fonseca","Média","2025-11-15","2026-01-31",null,"Planejado",{"v":0,"d":"0%"},{"v":97334.29,"d":"97,334.29"},{"v":39130.22,"d":"39,130.22"},{"v":0,"d":"0.00"},{"v":58204.06999999999,"d":"58,204.07"},{"v":97334.29,"d":"97,334.29"},"Atrasado",-194,"CC-COM","Sim"]
[null,null,"PROJ-062","Novo Almoxarifado","Magma Siderurgia","Consultoria","Elisa Prado","Média","2026-03-15","2026-09-24",null,"Em pausa",{"v":0.24,"d":"24%"},{"v":762447.44,"d":"762,447.44"},{"v":351258.87,"d":"351,258.87"},{"v":96390.61,"d":"96,390.61"},{"v":411188.56999999995,"d":"411,188.57"},{"v":666056.83,"d":"666,056.83"},"No prazo",42,"CC-ENG","Sim"]
[null,null,"PROJ-063","Integração Bancária","Criativa Publicidade","Desenvolvimento","Felipe Neves","Média","2026-03-01","2026-08-27",null,"Planejado",{"v":0,"d":"0%"},{"v":358438.12,"d":"358,438.12"},{"v":232476.94,"d":"232,476.94"},{"v":0,"d":"0.00"},{"v":125961.18,"d":"125,961.18"},{"v":358438.12,"d":"358,438.12"},"No prazo",14,"CC-OPS","Sim"]
[null,null,"PROJ-064","Campanha Institucional","Primus Saúde","Consultoria","Ricardo Monteiro","Média","2026-01-08","2026-03-09",null,"Em pausa",{"v":0.21,"d":"21%"},{"v":558776.84,"d":"558,776.84"},{"v":349182.1,"d":"349,182.10"},{"v":62384.78,"d":"62,384.78"},{"v":209594.74,"d":"209,594.74"},{"v":496392.05999999994,"d":"496,392.06"},"Atrasado",-157,"CC-ENG","Sim"]
[null,null,"PROJ-065","Projeto IoT","Velox TI","Interno","Camila Duarte","Crítica","2025-10-29","2026-06-12",null,"Em andamento",{"v":0.25,"d":"25%"},{"v":551881.48,"d":"551,881.48"},{"v":467095.43,"d":"467,095.43"},{"v":127037.07,"d":"127,037.07"},{"v":84786.04999999999,"d":"84,786.05"},{"v":424844.41,"d":"424,844.41"},"Atrasado",-62,"CC-FIN","Sim"]
[null,null,"PROJ-066","Migração Database","Terra Nova Agro","Implantação","André Machado","Baixa","2026-02-04","2026-07-02",null,"Em andamento",{"v":0.76,"d":"76%"},{"v":429674.7,"d":"429,674.70"},{"v":310742.92,"d":"310,742.92"},{"v":190894.95,"d":"190,894.95"},{"v":118931.78000000003,"d":"118,931.78"},{"v":238779.75,"d":"238,779.75"},"Atrasado",-42,"CC-ADM","Sim"]
[null,null,"PROJ-067","Expansão Nordeste","Safira Joias","Interno","Beatriz Alves","Média","2025-11-28","2026-03-17",null,"Em pausa",{"v":0.56,"d":"56%"},{"v":473677.95,"d":"473,677.95"},{"v":250969.26,"d":"250,969.26"},{"v":141161.18,"d":"141,161.18"},{"v":222708.69,"d":"222,708.69"},{"v":332516.77,"d":"332,516.77"},"Atrasado",-149,"CC-ENG","Sim"]

{"sheet":"Cronograma","index":5,"n_rows":122,"n_cols":80,"rows_kept":122,"hidden":true,"merged":[[1,2,1,18],[2,2,2,18],[3,2,3,18]]}
[]
[null,null,"CRONOGRAMA DE TAREFAS"]
[]
[]
[]
[{"$nulls":20},"GANTT — Próximos 60 dias"]
[null,null,"Cod_Item","Cod_Projeto","Projeto","Etapa","Tarefa","Responsavel","Data_Inicio_Plan","Data_Fim_Plan","Data_Inicio_Real","Data_Fim_Real","Duracao_Planejada","Duracao_Real","Status_Tarefa","Perc_Conclusao","Dependencia","Atraso_Dias","Observacoes",null,"2026-05-03T00:29:29.015Z","2026-05-04T00:29:29.015Z","2026-05-05T00:29:29.015Z","2026-05-06T00:29:29.015Z","2026-05-07T00:29:29.015Z","2026-05-08T00:29:29.015Z","2026-05-09T00:29:29.015Z","2026-05-10T00:29:29.015Z","2026-05-11T00:29:29.015Z","2026-05-12T00:29:29.015Z","2026-05-13T00:29:29.015Z","2026-05-14T00:29:29.015Z","2026-05-15T00:29:29.015Z","2026-05-16T00:29:29.015Z","2026-05-17T00:29:29.015Z","2026-05-18T00:29:29.015Z","2026-05-19T00:29:29.015Z","2026-05-20T00:29:29.015Z","2026-05-21T00:29:29.015Z","2026-05-22T00:29:29.015Z","2026-05-23T00:29:29.015Z","2026-05-24T00:29:29.015Z","2026-05-25T00:29:29.015Z","2026-05-26T00:29:29.015Z","2026-05-27T00:29:29.015Z","2026-05-28T00:29:29.015Z","2026-05-29T00:29:29.015Z","2026-05-30T00:29:29.015Z","2026-05-31T00:29:29.015Z","2026-06-01T00:29:29.015Z","2026-06-02T00:29:29.015Z","2026-06-03T00:29:29.015Z","2026-06-04T00:29:29.015Z","2026-06-05T00:29:29.015Z","2026-06-06T00:29:29.015Z","2026-06-07T00:29:29.015Z","2026-06-08T00:29:29.015Z","2026-06-09T00:29:29.015Z","2026-06-10T00:29:29.015Z","2026-06-11T00:29:29.015Z","2026-06-12T00:29:29.015Z","2026-06-13T00:29:29.015Z","2026-06-14T00:29:29.015Z","2026-06-15T00:29:29.015Z","2026-06-16T00:29:29.015Z","2026-06-17T00:29:29.015Z","2026-06-18T00:29:29.015Z","2026-06-19T00:29:29.015Z","2026-06-20T00:29:29.015Z","2026-06-21T00:29:29.015Z","2026-06-22T00:29:29.015Z","2026-06-23T00:29:29.015Z","2026-06-24T00:29:29.015Z","2026-06-25T00:29:29.015Z","2026-06-26T00:29:29.015Z","2026-06-27T00:29:29.015Z","2026-06-28T00:29:29.015Z","2026-06-29T00:29:29.015Z","2026-06-30T00:29:29.015Z","2026-07-01T00:29:29.015Z"]
[null,null,"TAR-0001","PROJ-001",{"$f":"IFERROR(VLOOKUP(D8,tbProjetos[],2,FALSE),\"\")","v":"Migração de ERP"},"Planejamento","Definição de escopo","Camila Duarte","2024-02-28","2024-03-06","2024-02-28","2024-03-11",{"$f":"IF(OR(J8=\"\",I8=\"\"),\"\",J8-I8+1)","v":8},{"$f":"IF(AND(K8<>\"\",L8<>\"\"),L8-K8+1,\"\")","v":13},"Concluída",{"v":1,"d":"100%"},null,{"$f":"IF(OR(O8=\"\",J8=\"\",tbCronograma[[#This Row],[Status_Tarefa]]=\"Suspensa\"),\"\",IF(O8=\"Concluída\",MAX(0,L8-J8),IF(O8=\"Não iniciada\",0,MAX(0,TODAY()-J8))))","v":5},null,null,{"$f":"IF(AND(U$7>=$I8,U$7<=$J8),IF($O8=\"Concluída\",\"■\",\"□\"),\"\")","v":""},{"$f":"IF(AND(V$7>=$I8,V$7<=$J8),IF($O8=\"Concluída\",\"■\",\"□\"),\"\")","v":""},"","","","","","","","","","","","","","","","","","","","","","","","","","","","","","","","","","","","","","","","","","","","","","","","","","","","","",""]
[null,null,"TAR-0002","PROJ-001",{"$f":"IFERROR(VLOOKUP(D9,tbProjetos[],2,FALSE),\"\")","v":"Migração de ERP"},"Execução","Desenvolvimento do protótipo","André Machado","2024-03-07","2024-03-10","2024-03-07","2024-03-12",4,{"$f":"IF(AND(K9<>\"\",L9<>\"\"),L9-K9+1,\"\")","v":6},"Concluída",{"v":1,"d":"100%"},null,{"$f":"IF(OR(O9=\"\",J9=\"\",tbCronograma[[#This Row],[Status_Tarefa]]=\"Suspensa\"),\"\",IF(O9=\"Concluída\",MAX(0,L9-J9),IF(O9=\"Não iniciada\",0,MAX(0,TODAY()-J9))))","v":2}]
[null,null,"TAR-0003","PROJ-001",{"$f":"IFERROR(VLOOKUP(D10,tbProjetos[],2,FALSE),\"\")","v":"Migração de ERP"},"Testes","Testes de integração","Camila Duarte","2024-03-08","2024-03-15","2024-03-11","2024-03-14",8,4,"Concluída",{"v":1,"d":"100%"},null,{"$f":"IF(OR(O10=\"\",J10=\"\",tbCronograma[[#This Row],[Status_Tarefa]]=\"Suspensa\"),\"\",IF(O10=\"Concluída\",MAX(0,L10-J10),IF(O10=\"Não iniciada\",0,MAX(0,TODAY()-J10))))","v":0}]
[null,null,"TAR-0004","PROJ-001",{"$f":"IFERROR(VLOOKUP(D11,tbProjetos[],2,FALSE),\"\")","v":"Migração de ERP"},"Implantação","Preparação do ambiente produtivo","Felipe Neves","2024-03-12","2024-03-20","2024-03-13","2024-03-20",9,8,"Concluída",{"v":1,"d":"100%"},null,{"$f":"IF(OR(O11=\"\",J11=\"\",tbCronograma[[#This Row],[Status_Tarefa]]=\"Suspensa\"),\"\",IF(O11=\"Concluída\",MAX(0,L11-J11),IF(O11=\"Não iniciada\",0,MAX(0,TODAY()-J11))))","v":0}]
[null,null,"TAR-0005","PROJ-001",{"$f":"IFERROR(VLOOKUP(D12,tbProjetos[],2,FALSE),\"\")","v":"Migração de ERP"},"Encerramento","Encerramento administrativo","Camila Duarte","2024-03-21","2024-03-28","2024-03-21","2024-03-28",8,8,"Concluída",{"v":1,"d":"100%"},null,{"$f":"IF(OR(O12=\"\",J12=\"\",tbCronograma[[#This Row],[Status_Tarefa]]=\"Suspensa\"),\"\",IF(O12=\"Concluída\",MAX(0,L12-J12),IF(O12=\"Não iniciada\",0,MAX(0,TODAY()-J12))))","v":0}]
[null,null,"TAR-0006","PROJ-002",{"$f":"IFERROR(VLOOKUP(D13,tbProjetos[],2,FALSE),\"\")","v":"Novo Portal Web"},"Planejamento","Análise de viabilidade","André Machado","2024-04-17","2024-05-05","2024-04-19","2024-05-03",19,15,"Concluída",{"v":1,"d":"100%"},null,{"$f":"IF(OR(O13=\"\",J13=\"\",tbCronograma[[#This Row],[Status_Tarefa]]=\"Suspensa\"),\"\",IF(O13=\"Concluída\",MAX(0,L13-J13),IF(O13=\"Não iniciada\",0,MAX(0,TODAY()-J13))))","v":0}]
[null,null,"TAR-0007","PROJ-002",{"$f":"IFERROR(VLOOKUP(D14,tbProjetos[],2,FALSE),\"\")","v":"Novo Portal Web"},"Execução","Desenvolvimento do protótipo","Diego Fonseca","2024-05-06","2024-05-24","2024-05-07","2024-06-05",19,30,"Concluída",{"v":1,"d":"100%"},"TAR-0006",{"$f":"IF(OR(O14=\"\",J14=\"\",tbCronograma[[#This Row],[Status_Tarefa]]=\"Suspensa\"),\"\",IF(O14=\"Concluída\",MAX(0,L14-J14),IF(O14=\"Não iniciada\",0,MAX(0,TODAY()-J14))))","v":12}]
[null,null,"TAR-0008","PROJ-002",{"$f":"IFERROR(VLOOKUP(D15,tbProjetos[],2,FALSE),\"\")","v":"Novo Portal Web"},"Testes","Testes de integração","Camila Duarte","2024-05-25","2024-06-12","2024-05-23","2024-06-09",19,18,"Concluída",{"v":1,"d":"100%"},null,{"$f":"IF(OR(O15=\"\",J15=\"\",tbCronograma[[#This Row],[Status_Tarefa]]=\"Suspensa\"),\"\",IF(O15=\"Concluída\",MAX(0,L15-J15),IF(O15=\"Não iniciada\",0,MAX(0,TODAY()-J15))))","v":0}]
[null,null,"TAR-0009","PROJ-002",{"$f":"IFERROR(VLOOKUP(D16,tbProjetos[],2,FALSE),\"\")","v":"Novo Portal Web"},"Implantação","Suporte pós-implantação","Beatriz Alves","2024-06-13","2024-07-01","2024-06-18","2024-06-28",19,11,"Concluída",{"v":1,"d":"100%"},"TAR-0008",{"$f":"IF(OR(O16=\"\",J16=\"\",tbCronograma[[#This Row],[Status_Tarefa]]=\"Suspensa\"),\"\",IF(O16=\"Concluída\",MAX(0,L16-J16),IF(O16=\"Não iniciada\",0,MAX(0,TODAY()-J16))))","v":0}]
[null,null,"TAR-0010","PROJ-002",{"$f":"IFERROR(VLOOKUP(D17,tbProjetos[],2,FALSE),\"\")","v":"Novo Portal Web"},"Encerramento","Lições aprendidas","Elisa Prado","2024-07-02","2024-07-20","2024-07-04","2024-07-17",19,14,"Concluída",{"v":1,"d":"100%"},"TAR-0009",{"$f":"IF(OR(O17=\"\",J17=\"\",tbCronograma[[#This Row],[Status_Tarefa]]=\"Suspensa\"),\"\",IF(O17=\"Concluída\",MAX(0,L17-J17),IF(O17=\"Não iniciada\",0,MAX(0,TODAY()-J17))))","v":0}]
[null,null,"TAR-0011","PROJ-002",{"$f":"IFERROR(VLOOKUP(D18,tbProjetos[],2,FALSE),\"\")","v":"Novo Portal Web"},"Encerramento","Encerramento administrativo","Felipe Neves","2024-07-21","2024-08-08","2024-07-19","2024-08-20",19,33,"Concluída",{"v":1,"d":"100%"},null,{"$f":"IF(OR(O18=\"\",J18=\"\",tbCronograma[[#This Row],[Status_Tarefa]]=\"Suspensa\"),\"\",IF(O18=\"Concluída\",MAX(0,L18-J18),IF(O18=\"Não iniciada\",0,MAX(0,TODAY()-J18))))","v":12}]
[null,null,"TAR-0012","PROJ-003",{"$f":"IFERROR(VLOOKUP(D19,tbProjetos[],2,FALSE),\"\")","v":"App Mobile Vendas"},"Planejamento","Elaboração do cronograma","Elisa Prado","2024-01-22","2024-02-29","2024-01-27","2024-02-27",39,32,"Concluída",{"v":1,"d":"100%"},null,{"$f":"IF(OR(O19=\"\",J19=\"\",tbCronograma[[#This Row],[Status_Tarefa]]=\"Suspensa\"),\"\",IF(O19=\"Concluída\",MAX(0,L19-J19),IF(O19=\"Não iniciada\",0,MAX(0,TODAY()-J19))))","v":0}]
[null,null,"TAR-0013","PROJ-003",{"$f":"IFERROR(VLOOKUP(D20,tbProjetos[],2,FALSE),\"\")","v":"App Mobile Vendas"},"Execução","Integração de sistemas","Diego Fonseca","2024-03-01","2024-04-08","2024-02-27","2024-04-15",39,49,"Concluída",{"v":1,"d":"100%"},null,{"$f":"IF(OR(O20=\"\",J20=\"\",tbCronograma[[#This Row],[Status_Tarefa]]=\"Suspensa\"),\"\",IF(O20=\"Concluída\",MAX(0,L20-J20),IF(O20=\"Não iniciada\",0,MAX(0,TODAY()-J20))))","v":7}]
[null,null,"TAR-0014","PROJ-003",{"$f":"IFERROR(VLOOKUP(D21,tbProjetos[],2,FALSE),\"\")","v":"App Mobile Vendas"},"Testes","Homologação","Diego Fonseca","2024-04-09","2024-05-17","2024-04-09","2024-05-19",39,41,"Concluída",{"v":1,"d":"100%"},null,{"$f":"IF(OR(O21=\"\",J21=\"\",tbCronograma[[#This Row],[Status_Tarefa]]=\"Suspensa\"),\"\",IF(O21=\"Concluída\",MAX(0,L21-J21),IF(O21=\"Não iniciada\",0,MAX(0,TODAY()-J21))))","v":2}]
[null,null,"TAR-0015","PROJ-003",{"$f":"IFERROR(VLOOKUP(D22,tbProjetos[],2,FALSE),\"\")","v":"App Mobile Vendas"},"Implantação","Go-live","Elisa Prado","2024-05-18","2024-06-25","2024-05-17","2024-07-02",39,47,"Concluída",{"v":1,"d":"100%"},"TAR-0014",{"$f":"IF(OR(O22=\"\",J22=\"\",tbCronograma[[#This Row],[Status_Tarefa]]=\"Suspensa\"),\"\",IF(O22=\"Concluída\",MAX(0,L22-J22),IF(O22=\"Não iniciada\",0,MAX(0,TODAY()-J22))))","v":7}]
[null,null,"TAR-0016","PROJ-003",{"$f":"IFERROR(VLOOKUP(D23,tbProjetos[],2,FALSE),\"\")","v":"App Mobile Vendas"},"Encerramento","Documentação final","Ricardo Monteiro","2024-06-26","2024-08-03","2024-06-30","2024-08-18",39,50,"Concluída",{"v":1,"d":"100%"},"TAR-0015",{"$f":"IF(OR(O23=\"\",J23=\"\",tbCronograma[[#This Row],[Status_Tarefa]]=\"Suspensa\"),\"\",IF(O23=\"Concluída\",MAX(0,L23-J23),IF(O23=\"Não iniciada\",0,MAX(0,TODAY()-J23))))","v":15}]
[null,null,"TAR-0017","PROJ-004",{"$f":"IFERROR(VLOOKUP(D24,tbProjetos[],2,FALSE),\"\")","v":"Automação de RH"},"Planejamento","Elaboração do cronograma","Ricardo Monteiro","2024-04-28","2024-06-04","2024-05-01",null,38,"","Suspensa",{"v":0.3,"d":"30%"},null,{"$f":"IF(OR(O24=\"\",J24=\"\",tbCronograma[[#This Row],[Status_Tarefa]]=\"Suspensa\"),\"\",IF(O24=\"Concluída\",MAX(0,L24-J24),IF(O24=\"Não iniciada\",0,MAX(0,TODAY()-J24))))","v":""}]
[null,null,"TAR-0018","PROJ-004",{"$f":"IFERROR(VLOOKUP(D25,tbProjetos[],2,FALSE),\"\")","v":"Automação de RH"},"Execução","Desenvolvimento do protótipo","Elisa Prado","2024-06-05","2024-07-12",null,null,38,"","Suspensa",{"v":0.14,"d":"14%"},null,{"$f":"IF(OR(O25=\"\",J25=\"\",tbCronograma[[#This Row],[Status_Tarefa]]=\"Suspensa\"),\"\",IF(O25=\"Concluída\",MAX(0,L25-J25),IF(O25=\"Não iniciada\",0,MAX(0,TODAY()-J25))))","v":""}]
[null,null,"TAR-0019","PROJ-004",{"$f":"IFERROR(VLOOKUP(D26,tbProjetos[],2,FALSE),\"\")","v":"Automação de RH"},"Testes","Testes unitários","Camila Duarte","2024-07-13","2024-08-19",null,null,38,"","Suspensa",{"v":0.09,"d":"9%"},"TAR-0018",{"$f":"IF(OR(O26=\"\",J26=\"\",tbCronograma[[#This Row],[Status_Tarefa]]=\"Suspensa\"),\"\",IF(O26=\"Concluída\",MAX(0,L26-J26),IF(O26=\"Não iniciada\",0,MAX(0,TODAY()-J26))))","v":""}]
[null,null,"TAR-0020","PROJ-004",{"$f":"IFERROR(VLOOKUP(D27,tbProjetos[],2,FALSE),\"\")","v":"Automação de RH"},"Implantação","Go-live","André Machado","2024-08-20","2024-09-26",null,null,38,"","Suspensa",{"v":0.28,"d":"28%"},null,{"$f":"IF(OR(O27=\"\",J27=\"\",tbCronograma[[#This Row],[Status_Tarefa]]=\"Suspensa\"),\"\",IF(O27=\"Concluída\",MAX(0,L27-J27),IF(O27=\"Não iniciada\",0,MAX(0,TODAY()-J27))))","v":""}]
[null,null,"TAR-0021","PROJ-004",{"$f":"IFERROR(VLOOKUP(D28,tbProjetos[],2,FALSE),\"\")","v":"Automação de RH"},"Encerramento","Documentação final","Ricardo Monteiro","2024-09-27","2024-11-03",null,null,38,"","Suspensa",{"v":0.24,"d":"24%"},"TAR-0020",{"$f":"IF(OR(O28=\"\",J28=\"\",tbCronograma[[#This Row],[Status_Tarefa]]=\"Suspensa\"),\"\",IF(O28=\"Concluída\",MAX(0,L28-J28),IF(O28=\"Não iniciada\",0,MAX(0,TODAY()-J28))))","v":""}]
[null,null,"TAR-0022","PROJ-005",{"$f":"IFERROR(VLOOKUP(D29,tbProjetos[],2,FALSE),\"\")","v":"BI Dashboard"},"Planejamento","Levantamento de requisitos","Camila Duarte","2024-04-23","2024-05-27","2024-04-26","2024-05-27",35,32,"Concluída",{"v":1,"d":"100%"},null,{"$f":"IF(OR(O29=\"\",J29=\"\",tbCronograma[[#This Row],[Status_Tarefa]]=\"Suspensa\"),\"\",IF(O29=\"Concluída\",MAX(0,L29-J29),IF(O29=\"Não iniciada\",0,MAX(0,TODAY()-J29))))","v":0}]
[null,null,"TAR-0023","PROJ-005",{"$f":"IFERROR(VLOOKUP(D30,tbProjetos[],2,FALSE),\"\")","v":"BI Dashboard"},"Execução","Configuração do ambiente","Beatriz Alves","2024-05-28","2024-07-01",null,null,35,"","Suspensa",{"v":0.03,"d":"3%"},null,{"$f":"IF(OR(O30=\"\",J30=\"\",tbCronograma[[#This Row],[Status_Tarefa]]=\"Suspensa\"),\"\",IF(O30=\"Concluída\",MAX(0,L30-J30),IF(O30=\"Não iniciada\",0,MAX(0,TODAY()-J30))))","v":""}]
[null,null,"TAR-0024","PROJ-005",{"$f":"IFERROR(VLOOKUP(D31,tbProjetos[],2,FALSE),\"\")","v":"BI Dashboard"},"Testes","Testes de integração","André Machado","2024-07-02","2024-08-05",null,null,35,"","Suspensa",{"v":0.06,"d":"6%"},null,{"$f":"IF(OR(O31=\"\",J31=\"\",tbCronograma[[#This Row],[Status_Tarefa]]=\"Suspensa\"),\"\",IF(O31=\"Concluída\",MAX(0,L31-J31),IF(O31=\"Não iniciada\",0,MAX(0,TODAY()-J31))))","v":""}]
[null,null,"TAR-0025","PROJ-006",{"$f":"IFERROR(VLOOKUP(D32,tbProjetos[],2,FALSE),\"\")","v":"Integração CRM"},"Planejamento","Análise de viabilidade","Camila Duarte","2024-04-18","2024-05-07","2024-04-15","2024-05-03",20,19,"Concluída",{"v":1,"d":"100%"},null,{"$f":"IF(OR(O32=\"\",J32=\"\",tbCronograma[[#This Row],[Status_Tarefa]]=\"Suspensa\"),\"\",IF(O32=\"Concluída\",MAX(0,L32-J32),IF(O32=\"Não iniciada\",0,MAX(0,TODAY()-J32))))","v":0}]
[null,null,"TAR-0026","PROJ-006",{"$f":"IFERROR(VLOOKUP(D33,tbProjetos[],2,FALSE),\"\")","v":"Integração CRM"},"Execução","Implementação do módulo principal","Elisa Prado","2024-05-08","2024-05-27","2024-05-13","2024-06-03",20,22,"Concluída",{"v":1,"d":"100%"},null,{"$f":"IF(OR(O33=\"\",J33=\"\",tbCronograma[[#This Row],[Status_Tarefa]]=\"Suspensa\"),\"\",IF(O33=\"Concluída\",MAX(0,L33-J33),IF(O33=\"Não iniciada\",0,MAX(0,TODAY()-J33))))","v":7}]
[null,null,"TAR-0027","PROJ-006",{"$f":"IFERROR(VLOOKUP(D34,tbProjetos[],2,FALSE),\"\")","v":"Integração CRM"},"Testes","Homologação","Elisa Prado","2024-05-28","2024-06-16","2024-05-31","2024-06-26",20,27,"Concluída",{"v":1,"d":"100%"},null,{"$f":"IF(OR(O34=\"\",J34=\"\",tbCronograma[[#This Row],[Status_Tarefa]]=\"Suspensa\"),\"\",IF(O34=\"Concluída\",MAX(0,L34-J34),IF(O34=\"Não iniciada\",0,MAX(0,TODAY()-J34))))","v":10}]
[null,null,"TAR-0028","PROJ-006",{"$f":"IFERROR(VLOOKUP(D35,tbProjetos[],2,FALSE),\"\")","v":"Integração CRM"},"Implantação","Suporte pós-implantação","Felipe Neves","2024-06-17","2024-07-06","2024-06-15","2024-07-16",20,32,"Concluída",{"v":1,"d":"100%"},null,{"$f":"IF(OR(O35=\"\",J35=\"\",tbCronograma[[#This Row],[Status_Tarefa]]=\"Suspensa\"),\"\",IF(O35=\"Concluída\",MAX(0,L35-J35),IF(O35=\"Não iniciada\",0,MAX(0,TODAY()-J35))))","v":10}]
[null,null,"TAR-0029","PROJ-007",{"$f":"IFERROR(VLOOKUP(D36,tbProjetos[],2,FALSE),\"\")","v":"Reforma Sede"},"Planejamento","Aprovação do projeto","André Machado","2024-05-19","2024-06-19","2024-05-20",null,32,"","Suspensa",{"v":0.14,"d":"14%"},null,{"$f":"IF(OR(O36=\"\",J36=\"\",tbCronograma[[#This Row],[Status_Tarefa]]=\"Suspensa\"),\"\",IF(O36=\"Concluída\",MAX(0,L36-J36),IF(O36=\"Não iniciada\",0,MAX(0,TODAY()-J36))))","v":""}]
[null,null,"TAR-0030","PROJ-007",{"$f":"IFERROR(VLOOKUP(D37,tbProjetos[],2,FALSE),\"\")","v":"Reforma Sede"},"Execução","Desenvolvimento do protótipo","Diego Fonseca","2024-06-20","2024-07-21",null,null,32,"","Suspensa",{"v":0.15,"d":"15%"},"TAR-0029",{"$f":"IF(OR(O37=\"\",J37=\"\",tbCronograma[[#This Row],[Status_Tarefa]]=\"Suspensa\"),\"\",IF(O37=\"Concluída\",MAX(0,L37-J37),IF(O37=\"Não iniciada\",0,MAX(0,TODAY()-J37))))","v":""}]
[null,null,"TAR-0031","PROJ-007",{"$f":"IFERROR(VLOOKUP(D38,tbProjetos[],2,FALSE),\"\")","v":"Reforma Sede"},"Testes","Testes de integração","Elisa Prado","2024-07-22","2024-08-22",null,null,32,"","Suspensa",{"v":0.27,"d":"27%"},null,{"$f":"IF(OR(O38=\"\",J38=\"\",tbCronograma[[#This Row],[Status_Tarefa]]=\"Suspensa\"),\"\",IF(O38=\"Concluída\",MAX(0,L38-J38),IF(O38=\"Não iniciada\",0,MAX(0,TODAY()-J38))))","v":""}]
[null,null,"TAR-0032","PROJ-007",{"$f":"IFERROR(VLOOKUP(D39,tbProjetos[],2,FALSE),\"\")","v":"Reforma Sede"},"Implantação","Go-live","Ricardo Monteiro","2024-08-23","2024-09-23",null,null,32,"","Suspensa",{"v":0.23,"d":"23%"},null,{"$f":"IF(OR(O39=\"\",J39=\"\",tbCronograma[[#This Row],[Status_Tarefa]]=\"Suspensa\"),\"\",IF(O39=\"Concluída\",MAX(0,L39-J39),IF(O39=\"Não iniciada\",0,MAX(0,TODAY()-J39))))","v":""}]
[null,null,"TAR-0033","PROJ-008",{"$f":"IFERROR(VLOOKUP(D40,tbProjetos[],2,FALSE),\"\")","v":"Campanha Digital Q1"},"Planejamento","Aprovação do projeto","Diego Fonseca","2024-04-29","2024-06-01","2024-05-01","2024-05-31",{"$f":"IF(OR(J40=\"\",I40=\"\"),\"\",J40-I40+1)","v":34},31,"Concluída",{"v":1,"d":"100%"},null,{"$f":"IF(OR(O40=\"\",J40=\"\",tbCronograma[[#This Row],[Status_Tarefa]]=\"Suspensa\"),\"\",IF(O40=\"Concluída\",MAX(0,L40-J40),IF(O40=\"Não iniciada\",0,MAX(0,TODAY()-J40))))","v":0}]
[null,null,"TAR-0034","PROJ-008",{"$f":"IFERROR(VLOOKUP(D41,tbProjetos[],2,FALSE),\"\")","v":"Campanha Digital Q1"},"Execução","Implementação do módulo principal","Elisa Prado","2024-06-02","2024-07-05","2024-06-02","2024-07-13",34,42,"Concluída",{"v":1,"d":"100%"},"TAR-0033",{"$f":"IF(OR(O41=\"\",J41=\"\",tbCronograma[[#This Row],[Status_Tarefa]]=\"Suspensa\"),\"\",IF(O41=\"Concluída\",MAX(0,L41-J41),IF(O41=\"Não iniciada\",0,MAX(0,TODAY()-J41))))","v":8}]
[null,null,"TAR-0035","PROJ-008",{"$f":"IFERROR(VLOOKUP(D42,tbProjetos[],2,FALSE),\"\")","v":"Campanha Digital Q1"},"Testes","Homologação","Beatriz Alves","2024-07-06","2024-08-08","2024-07-07","2024-08-17",34,42,"Concluída",{"v":1,"d":"100%"},null,{"$f":"IF(OR(O42=\"\",J42=\"\",tbCronograma[[#This Row],[Status_Tarefa]]=\"Suspensa\"),\"\",IF(O42=\"Concluída\",MAX(0,L42-J42),IF(O42=\"Não iniciada\",0,MAX(0,TODAY()-J42))))","v":9}]
[null,null,"TAR-0036","PROJ-008",{"$f":"IFERROR(VLOOKUP(D43,tbProjetos[],2,FALSE),\"\")","v":"Campanha Digital Q1"},"Implantação","Go-live","Ricardo Monteiro","2024-08-09","2024-09-11","2024-08-12","2024-09-09",34,29,"Concluída",{"v":1,"d":"100%"},"TAR-0035",{"$f":"IF(OR(O43=\"\",J43=\"\",tbCronograma[[#This Row],[Status_Tarefa]]=\"Suspensa\"),\"\",IF(O43=\"Concluída\",MAX(0,L43-J43),IF(O43=\"Não iniciada\",0,MAX(0,TODAY()-J43))))","v":0}]
[null,null,"TAR-0037","PROJ-008",{"$f":"IFERROR(VLOOKUP(D44,tbProjetos[],2,FALSE),\"\")","v":"Campanha Digital Q1"},"Encerramento","Entrega formal","Camila Duarte","2024-09-12","2024-10-15","2024-09-16","2024-10-17",34,32,"Concluída",{"v":1,"d":"100%"},null,{"$f":"IF(OR(O44=\"\",J44=\"\",tbCronograma[[#This Row],[Status_Tarefa]]=\"Suspensa\"),\"\",IF(O44=\"Concluída\",MAX(0,L44-J44),IF(O44=\"Não iniciada\",0,MAX(0,TODAY()-J44))))","v":2}]
[null,null,"TAR-0038","PROJ-009",{"$f":"IFERROR(VLOOKUP(D45,tbProjetos[],2,FALSE),\"\")","v":"Auditoria Fiscal"},"Planejamento","Aprovação do projeto","Beatriz Alves","2024-06-27","2024-08-12","2024-06-30","2024-08-21",47,53,"Concluída",{"v":1,"d":"100%"},null,{"$f":"IF(OR(O45=\"\",J45=\"\",tbCronograma[[#This Row],[Status_Tarefa]]=\"Suspensa\"),\"\",IF(O45=\"Concluída\",MAX(0,L45-J45),IF(O45=\"Não iniciada\",0,MAX(0,TODAY()-J45))))","v":9}]
[null,null,"TAR-0039","PROJ-009",{"$f":"IFERROR(VLOOKUP(D46,tbProjetos[],2,FALSE),\"\")","v":"Auditoria Fiscal"},"Execução","Migração de dados","Diego Fonseca","2024-08-13","2024-09-28","2024-08-14","2024-09-21",47,39,"Concluída",{"v":1,"d":"100%"},null,{"$f":"IF(OR(O46=\"\",J46=\"\",tbCronograma[[#This Row],[Status_Tarefa]]=\"Suspensa\"),\"\",IF(O46=\"Concluída\",MAX(0,L46-J46),IF(O46=\"Não iniciada\",0,MAX(0,TODAY()-J46))))","v":0}]
[null,null,"TAR-0040","PROJ-009",{"$f":"IFERROR(VLOOKUP(D47,tbProjetos[],2,FALSE),\"\")","v":"Auditoria Fiscal"},"Testes","Homologação","Beatriz Alves","2024-09-29","2024-11-14","2024-09-28","2024-11-10",47,44,"Concluída",{"v":1,"d":"100%"},null,{"$f":"IF(OR(O47=\"\",J47=\"\",tbCronograma[[#This Row],[Status_Tarefa]]=\"Suspensa\"),\"\",IF(O47=\"Concluída\",MAX(0,L47-J47),IF(O47=\"Não iniciada\",0,MAX(0,TODAY()-J47))))","v":0}]
[null,null,"TAR-0041","PROJ-009",{"$f":"IFERROR(VLOOKUP(D48,tbProjetos[],2,FALSE),\"\")","v":"Auditoria Fiscal"},"Implantação","Preparação do ambiente produtivo","André Machado","2024-11-15","2024-12-31","2024-11-18","2025-01-08",47,52,"Concluída",{"v":1,"d":"100%"},null,{"$f":"IF(OR(O48=\"\",J48=\"\",tbCronograma[[#This Row],[Status_Tarefa]]=\"Suspensa\"),\"\",IF(O48=\"Concluída\",MAX(0,L48-J48),IF(O48=\"Não iniciada\",0,MAX(0,TODAY()-J48))))","v":8}]
[null,null,"TAR-0042","PROJ-010",{"$f":"IFERROR(VLOOKUP(D49,tbProjetos[],2,FALSE),\"\")","v":"Consultoria ISO 9001"},"Planejamento","Análise de viabilidade","Ricardo Monteiro","2024-04-18","2024-05-04","2024-04-16","2024-05-08",17,23,"Concluída",{"v":1,"d":"100%"},null,{"$f":"IF(OR(O49=\"\",J49=\"\",tbCronograma[[#This Row],[Status_Tarefa]]=\"Suspensa\"),\"\",IF(O49=\"Concluída\",MAX(0,L49-J49),IF(O49=\"Não iniciada\",0,MAX(0,TODAY()-J49))))","v":4}]
[null,null,"TAR-0043","PROJ-010",{"$f":"IFERROR(VLOOKUP(D50,tbProjetos[],2,FALSE),\"\")","v":"Consultoria ISO 9001"},"Execução","Configuração do ambiente","André Machado","2024-05-05","2024-05-21","2024-05-06","2024-06-05",17,31,"Concluída",{"v":1,"d":"100%"},null,{"$f":"IF(OR(O50=\"\",J50=\"\",tbCronograma[[#This Row],[Status_Tarefa]]=\"Suspensa\"),\"\",IF(O50=\"Concluída\",MAX(0,L50-J50),IF(O50=\"Não iniciada\",0,MAX(0,TODAY()-J50))))","v":15}]
[null,null,"TAR-0044","PROJ-010",{"$f":"IFERROR(VLOOKUP(D51,tbProjetos[],2,FALSE),\"\")","v":"Consultoria ISO 9001"},"Testes","Testes de aceitação","Diego Fonseca","2024-05-22","2024-06-07","2024-05-19","2024-06-16",17,29,"Concluída",{"v":1,"d":"100%"},null,{"$f":"IF(OR(O51=\"\",J51=\"\",tbCronograma[[#This Row],[Status_Tarefa]]=\"Suspensa\"),\"\",IF(O51=\"Concluída\",MAX(0,L51-J51),IF(O51=\"Não iniciada\",0,MAX(0,TODAY()-J51))))","v":9}]
[null,null,"TAR-0045","PROJ-010",{"$f":"IFERROR(VLOOKUP(D52,tbProjetos[],2,FALSE),\"\")","v":"Consultoria ISO 9001"},"Implantação","Treinamento de usuários","Beatriz Alves","2024-06-08","2024-06-24","2024-06-12","2024-06-28",17,17,"Concluída",{"v":1,"d":"100%"},"TAR-0044",{"$f":"IF(OR(O52=\"\",J52=\"\",tbCronograma[[#This Row],[Status_Tarefa]]=\"Suspensa\"),\"\",IF(O52=\"Concluída\",MAX(0,L52-J52),IF(O52=\"Não iniciada\",0,MAX(0,TODAY()-J52))))","v":4}]
[null,null,"TAR-0046","PROJ-010",{"$f":"IFERROR(VLOOKUP(D53,tbProjetos[],2,FALSE),\"\")","v":"Consultoria ISO 9001"},"Encerramento","Lições aprendidas","Elisa Prado","2024-06-25","2024-07-11","2024-06-27","2024-07-26",17,30,"Concluída",{"v":1,"d":"100%"},null,{"$f":"IF(OR(O53=\"\",J53=\"\",tbCronograma[[#This Row],[Status_Tarefa]]=\"Suspensa\"),\"\",IF(O53=\"Concluída\",MAX(0,L53-J53),IF(O53=\"Não iniciada\",0,MAX(0,TODAY()-J53))))","v":15}]
[null,null,"TAR-0069","PROJ-015",{"$f":"IFERROR(VLOOKUP(D54,tbProjetos[],2,FALSE),\"\")","v":"Gestão de Frotas"},"Encerramento","Entrega formal","André Machado","2025-07-06","2025-07-26","2025-07-05","2025-07-31",21,27,"Concluída",{"v":1,"d":"100%"},null,{"$f":"IF(OR(O54=\"\",J54=\"\",tbCronograma[[#This Row],[Status_Tarefa]]=\"Suspensa\"),\"\",IF(O54=\"Concluída\",MAX(0,L54-J54),IF(O54=\"Não iniciada\",0,MAX(0,TODAY()-J54))))","v":5}]
[null,null,"TAR-0070","PROJ-016",{"$f":"IFERROR(VLOOKUP(D55,tbProjetos[],2,FALSE),\"\")","v":"Portal do Fornecedor"},"Planejamento","Análise de viabilidade","André Machado","2025-01-27","2025-02-22","2025-01-30","2025-02-17",27,19,"Concluída",{"v":1,"d":"100%"},null,{"$f":"IF(OR(O55=\"\",J55=\"\",tbCronograma[[#This Row],[Status_Tarefa]]=\"Suspensa\"),\"\",IF(O55=\"Concluída\",MAX(0,L55-J55),IF(O55=\"Não iniciada\",0,MAX(0,TODAY()-J55))))","v":0}]
[null,null,"TAR-0071","PROJ-016",{"$f":"IFERROR(VLOOKUP(D56,tbProjetos[],2,FALSE),\"\")","v":"Portal do Fornecedor"},"Execução","Configuração do ambiente","Diego Fonseca","2025-02-23","2025-03-21","2025-02-21","2025-04-01",27,40,"Concluída",{"v":1,"d":"100%"},null,{"$f":"IF(OR(O56=\"\",J56=\"\",tbCronograma[[#This Row],[Status_Tarefa]]=\"Suspensa\"),\"\",IF(O56=\"Concluída\",MAX(0,L56-J56),IF(O56=\"Não iniciada\",0,MAX(0,TODAY()-J56))))","v":11}]
[null,null,"TAR-0072","PROJ-016",{"$f":"IFERROR(VLOOKUP(D57,tbProjetos[],2,FALSE),\"\")","v":"Portal do Fornecedor"},"Testes","Testes de integração","Camila Duarte","2025-03-22","2025-04-17","2025-03-19","2025-04-27",27,40,"Concluída",{"v":1,"d":"100%"},"TAR-0071",{"$f":"IF(OR(O57=\"\",J57=\"\",tbCronograma[[#This Row],[Status_Tarefa]]=\"Suspensa\"),\"\",IF(O57=\"Concluída\",MAX(0,L57-J57),IF(O57=\"Não iniciada\",0,MAX(0,TODAY()-J57))))","v":10}]
[null,null,"TAR-0073","PROJ-016",{"$f":"IFERROR(VLOOKUP(D58,tbProjetos[],2,FALSE),\"\")","v":"Portal do Fornecedor"},"Implantação","Go-live","Ricardo Monteiro","2025-04-18","2025-05-14","2025-04-16","2025-05-09",27,24,"Concluída",{"v":1,"d":"100%"},"TAR-0072",{"$f":"IF(OR(O58=\"\",J58=\"\",tbCronograma[[#This Row],[Status_Tarefa]]=\"Suspensa\"),\"\",IF(O58=\"Concluída\",MAX(0,L58-J58),IF(O58=\"Não iniciada\",0,MAX(0,TODAY()-J58))))","v":0}]
[null,null,"TAR-0074","PROJ-017",{"$f":"IFERROR(VLOOKUP(D59,tbProjetos[],2,FALSE),\"\")","v":"Chatbot Atendimento"},"Planejamento","Elaboração do cronograma","Beatriz Alves","2024-12-25","2025-02-02","2024-12-24","2025-02-05",40,44,"Concluída",{"v":1,"d":"100%"},null,{"$f":"IF(OR(O59=\"\",J59=\"\",tbCronograma[[#This Row],[Status_Tarefa]]=\"Suspensa\"),\"\",IF(O59=\"Concluída\",MAX(0,L59-J59),IF(O59=\"Não iniciada\",0,MAX(0,TODAY()-J59))))","v":3}]
[null,null,"TAR-0075","PROJ-017",{"$f":"IFERROR(VLOOKUP(D60,tbProjetos[],2,FALSE),\"\")","v":"Chatbot Atendimento"},"Execução","Migração de dados","André Machado","2025-02-03","2025-03-14","2025-02-01","2025-03-16",40,44,"Concluída",{"v":1,"d":"100%"},"TAR-0074",{"$f":"IF(OR(O60=\"\",J60=\"\",tbCronograma[[#This Row],[Status_Tarefa]]=\"Suspensa\"),\"\",IF(O60=\"Concluída\",MAX(0,L60-J60),IF(O60=\"Não iniciada\",0,MAX(0,TODAY()-J60))))","v":2}]
[null,null,"TAR-0076","PROJ-017",{"$f":"IFERROR(VLOOKUP(D61,tbProjetos[],2,FALSE),\"\")","v":"Chatbot Atendimento"},"Testes","Homologação","Felipe Neves","2025-03-15","2025-04-23","2025-03-18","2025-04-29",40,43,"Concluída",{"v":1,"d":"100%"},"TAR-0075",{"$f":"IF(OR(O61=\"\",J61=\"\",tbCronograma[[#This Row],[Status_Tarefa]]=\"Suspensa\"),\"\",IF(O61=\"Concluída\",MAX(0,L61-J61),IF(O61=\"Não iniciada\",0,MAX(0,TODAY()-J61))))","v":6}]
[null,null,"TAR-0077","PROJ-017",{"$f":"IFERROR(VLOOKUP(D62,tbProjetos[],2,FALSE),\"\")","v":"Chatbot Atendimento"},"Implantação","Suporte pós-implantação","Diego Fonseca","2025-04-24","2025-06-02","2025-04-25","2025-06-10",40,47,"Concluída",{"v":1,"d":"100%"},null,{"$f":"IF(OR(O62=\"\",J62=\"\",tbCronograma[[#This Row],[Status_Tarefa]]=\"Suspensa\"),\"\",IF(O62=\"Concluída\",MAX(0,L62-J62),IF(O62=\"Não iniciada\",0,MAX(0,TODAY()-J62))))","v":8}]
[null,null,"TAR-0078","PROJ-017",{"$f":"IFERROR(VLOOKUP(D63,tbProjetos[],2,FALSE),\"\")","v":"Chatbot Atendimento"},"Encerramento","Encerramento administrativo","Camila Duarte","2025-06-03","2025-07-12","2025-06-08","2025-07-23",40,46,"Concluída",{"v":1,"d":"100%"},null,{"$f":"IF(OR(O63=\"\",J63=\"\",tbCronograma[[#This Row],[Status_Tarefa]]=\"Suspensa\"),\"\",IF(O63=\"Concluída\",MAX(0,L63-J63),IF(O63=\"Não iniciada\",0,MAX(0,TODAY()-J63))))","v":11}]
[null,null,"TAR-0079","PROJ-018",{"$f":"IFERROR(VLOOKUP(D64,tbProjetos[],2,FALSE),\"\")","v":"Migração Cloud AWS"},"Planejamento","Aprovação do projeto","Beatriz Alves","2024-06-07","2024-07-10","2024-06-05","2024-07-16",34,42,"Concluída",{"v":1,"d":"100%"},null,{"$f":"IF(OR(O64=\"\",J64=\"\",tbCronograma[[#This Row],[Status_Tarefa]]=\"Suspensa\"),\"\",IF(O64=\"Concluída\",MAX(0,L64-J64),IF(O64=\"Não iniciada\",0,MAX(0,TODAY()-J64))))","v":6}]
[null,null,"TAR-0080","PROJ-018",{"$f":"IFERROR(VLOOKUP(D65,tbProjetos[],2,FALSE),\"\")","v":"Migração Cloud AWS"},"Execução","Implementação do módulo principal","Ricardo Monteiro","2024-07-11","2024-08-13","2024-07-15","2024-08-15",34,32,"Concluída",{"v":1,"d":"100%"},"TAR-0079",{"$f":"IF(OR(O65=\"\",J65=\"\",tbCronograma[[#This Row],[Status_Tarefa]]=\"Suspensa\"),\"\",IF(O65=\"Concluída\",MAX(0,L65-J65),IF(O65=\"Não iniciada\",0,MAX(0,TODAY()-J65))))","v":2}]
[null,null,"TAR-0081","PROJ-018",{"$f":"IFERROR(VLOOKUP(D66,tbProjetos[],2,FALSE),\"\")","v":"Migração Cloud AWS"},"Testes","Homologação","André Machado","2024-08-14","2024-09-16","2024-08-15","2024-09-21",34,38,"Concluída",{"v":1,"d":"100%"},null,{"$f":"IF(OR(O66=\"\",J66=\"\",tbCronograma[[#This Row],[Status_Tarefa]]=\"Suspensa\"),\"\",IF(O66=\"Concluída\",MAX(0,L66-J66),IF(O66=\"Não iniciada\",0,MAX(0,TODAY()-J66))))","v":5}]
[null,null,"TAR-0082","PROJ-018",{"$f":"IFERROR(VLOOKUP(D67,tbProjetos[],2,FALSE),\"\")","v":"Migração Cloud AWS"},"Implantação","Treinamento de usuários","Elisa Prado","2024-09-17","2024-10-20","2024-09-19","2024-10-22",34,34,"Concluída",{"v":1,"d":"100%"},null,{"$f":"IF(OR(O67=\"\",J67=\"\",tbCronograma[[#This Row],[Status_Tarefa]]=\"Suspensa\"),\"\",IF(O67=\"Concluída\",MAX(0,L67-J67),IF(O67=\"Não iniciada\",0,MAX(0,TODAY()-J67))))","v":2}]
[null,null,"TAR-0083","PROJ-018",{"$f":"IFERROR(VLOOKUP(D68,tbProjetos[],2,FALSE),\"\")","v":"Migração Cloud AWS"},"Encerramento","Documentação final","Ricardo Monteiro","2024-10-21","2024-11-23","2024-10-18","2024-12-05",34,49,"Concluída",{"v":1,"d":"100%"},"TAR-0082",{"$f":"IF(OR(O68=\"\",J68=\"\",tbCronograma[[#This Row],[Status_Tarefa]]=\"Suspensa\"),\"\",IF(O68=\"Concluída\",MAX(0,L68-J68),IF(O68=\"Não iniciada\",0,MAX(0,TODAY()-J68))))","v":12}]
[null,null,"TAR-0084","PROJ-018",{"$f":"IFERROR(VLOOKUP(D69,tbProjetos[],2,FALSE),\"\")","v":"Migração Cloud AWS"},"Encerramento","Documentação final","Beatriz Alves","2024-11-24","2024-12-27","2024-11-22","2024-12-28",34,37,"Concluída",{"v":1,"d":"100%"},null,{"$f":"IF(OR(O69=\"\",J69=\"\",tbCronograma[[#This Row],[Status_Tarefa]]=\"Suspensa\"),\"\",IF(O69=\"Concluída\",MAX(0,L69-J69),IF(O69=\"Não iniciada\",0,MAX(0,TODAY()-J69))))","v":1}]
[null,null,"TAR-0085","PROJ-019",{"$f":"IFERROR(VLOOKUP(D70,tbProjetos[],2,FALSE),\"\")","v":"Projeto Sustentabilidade"},"Planejamento","Análise de viabilidade","Diego Fonseca","2024-11-18","2024-12-14","2024-11-19",null,27,"","Suspensa",{"v":0.56,"d":"56%"},null,{"$f":"IF(OR(O70=\"\",J70=\"\",tbCronograma[[#This Row],[Status_Tarefa]]=\"Suspensa\"),\"\",IF(O70=\"Concluída\",MAX(0,L70-J70),IF(O70=\"Não iniciada\",0,MAX(0,TODAY()-J70))))","v":""}]
[null,null,"TAR-0086","PROJ-019",{"$f":"IFERROR(VLOOKUP(D71,tbProjetos[],2,FALSE),\"\")","v":"Projeto Sustentabilidade"},"Execução","Integração de sistemas","André Machado","2024-12-15","2025-01-10","2024-12-15","2025-01-18",27,35,"Concluída",{"v":1,"d":"100%"},"TAR-0085",{"$f":"IF(OR(O71=\"\",J71=\"\",tbCronograma[[#This Row],[Status_Tarefa]]=\"Suspensa\"),\"\",IF(O71=\"Concluída\",MAX(0,L71-J71),IF(O71=\"Não iniciada\",0,MAX(0,TODAY()-J71))))","v":8}]
[null,null,"TAR-0087","PROJ-019",{"$f":"IFERROR(VLOOKUP(D72,tbProjetos[],2,FALSE),\"\")","v":"Projeto Sustentabilidade"},"Testes","Homologação","Diego Fonseca","2025-01-11","2025-02-06","2025-01-14",null,{"$f":"IF(OR(J72=\"\",I72=\"\"),\"\",J72-I72+1)","v":27},"","Suspensa",{"v":0.29,"d":"29%"},"TAR-0086",{"$f":"IF(OR(O72=\"\",J72=\"\",tbCronograma[[#This Row],[Status_Tarefa]]=\"Suspensa\"),\"\",IF(O72=\"Concluída\",MAX(0,L72-J72),IF(O72=\"Não iniciada\",0,MAX(0,TODAY()-J72))))","v":""}]
[null,null,"TAR-0088","PROJ-019",{"$f":"IFERROR(VLOOKUP(D73,tbProjetos[],2,FALSE),\"\")","v":"Projeto Sustentabilidade"},"Implantação","Go-live","Camila Duarte","2025-02-07","2025-03-05",null,null,27,{"$f":"IF(AND(K73<>\"\",L73<>\"\"),L73-K73+1,\"\")","v":""},"Suspensa",{"v":0,"d":"0%"},"TAR-0087",{"$f":"IF(OR(O73=\"\",J73=\"\",tbCronograma[[#This Row],[Status_Tarefa]]=\"Suspensa\"),\"\",IF(O73=\"Concluída\",MAX(0,L73-J73),IF(O73=\"Não iniciada\",0,MAX(0,TODAY()-J73))))","v":""}]
[null,null,"TAR-0089","PROJ-019",{"$f":"IFERROR(VLOOKUP(D74,tbProjetos[],2,FALSE),\"\")","v":"Projeto Sustentabilidade"},"Encerramento","Documentação final","Ricardo Monteiro","2025-03-06","2025-04-01",null,null,27,"","Suspensa",{"v":0,"d":"0%"},"TAR-0088",{"$f":"IF(OR(O74=\"\",J74=\"\",tbCronograma[[#This Row],[Status_Tarefa]]=\"Suspensa\"),\"\",IF(O74=\"Concluída\",MAX(0,L74-J74),IF(O74=\"Não iniciada\",0,MAX(0,TODAY()-J74))))","v":""}]
[null,null,"TAR-0090","PROJ-019",{"$f":"IFERROR(VLOOKUP(D75,tbProjetos[],2,FALSE),\"\")","v":"Projeto Sustentabilidade"},"Encerramento","Entrega formal","Felipe Neves","2025-04-02","2025-04-28",null,null,27,"","Suspensa",{"v":0,"d":"0%"},"TAR-0089",{"$f":"IF(OR(O75=\"\",J75=\"\",tbCronograma[[#This Row],[Status_Tarefa]]=\"Suspensa\"),\"\",IF(O75=\"Concluída\",MAX(0,L75-J75),IF(O75=\"Não iniciada\",0,MAX(0,TODAY()-J75))))","v":""}]
[null,null,"TAR-0091","PROJ-020",{"$f":"IFERROR(VLOOKUP(D76,tbProjetos[],2,FALSE),\"\")","v":"Análise de Mercado"},"Planejamento","Aprovação do projeto","Ricardo Monteiro","2024-07-30","2024-08-23","2024-07-31","2024-08-31",25,32,"Concluída",{"v":1,"d":"100%"},null,{"$f":"IF(OR(O76=\"\",J76=\"\",tbCronograma[[#This Row],[Status_Tarefa]]=\"Suspensa\"),\"\",IF(O76=\"Concluída\",MAX(0,L76-J76),IF(O76=\"Não iniciada\",0,MAX(0,TODAY()-J76))))","v":8}]
[null,null,"TAR-0092","PROJ-020",{"$f":"IFERROR(VLOOKUP(D77,tbProjetos[],2,FALSE),\"\")","v":"Análise de Mercado"},"Execução","Migração de dados","Ricardo Monteiro","2024-08-24","2024-09-17","2024-08-28","2024-09-13",25,17,"Concluída",{"v":1,"d":"100%"},"TAR-0091",{"$f":"IF(OR(O77=\"\",J77=\"\",tbCronograma[[#This Row],[Status_Tarefa]]=\"Suspensa\"),\"\",IF(O77=\"Concluída\",MAX(0,L77-J77),IF(O77=\"Não iniciada\",0,MAX(0,TODAY()-J77))))","v":0}]
[null,null,"TAR-0093","PROJ-020",{"$f":"IFERROR(VLOOKUP(D78,tbProjetos[],2,FALSE),\"\")","v":"Análise de Mercado"},"Testes","Testes de aceitação","Beatriz Alves","2024-09-18","2024-10-12","2024-09-17","2024-10-10",25,24,"Concluída",{"v":1,"d":"100%"},null,{"$f":"IF(OR(O78=\"\",J78=\"\",tbCronograma[[#This Row],[Status_Tarefa]]=\"Suspensa\"),\"\",IF(O78=\"Concluída\",MAX(0,L78-J78),IF(O78=\"Não iniciada\",0,MAX(0,TODAY()-J78))))","v":0}]
[null,null,"TAR-0094","PROJ-020",{"$f":"IFERROR(VLOOKUP(D79,tbProjetos[],2,FALSE),\"\")","v":"Análise de Mercado"},"Implantação","Suporte pós-implantação","André Machado","2024-10-13","2024-11-06","2024-10-14","2024-11-04",25,22,"Concluída",{"v":1,"d":"100%"},null,{"$f":"IF(OR(O79=\"\",J79=\"\",tbCronograma[[#This Row],[Status_Tarefa]]=\"Suspensa\"),\"\",IF(O79=\"Concluída\",MAX(0,L79-J79),IF(O79=\"Não iniciada\",0,MAX(0,TODAY()-J79))))","v":0}]
[null,null,"TAR-0095","PROJ-020",{"$f":"IFERROR(VLOOKUP(D80,tbProjetos[],2,FALSE),\"\")","v":"Análise de Mercado"},"Encerramento","Entrega formal","Felipe Neves","2024-11-07","2024-12-01","2024-11-12","2024-12-04",25,23,"Concluída",{"v":1,"d":"100%"},"TAR-0094",{"$f":"IF(OR(O80=\"\",J80=\"\",tbCronograma[[#This Row],[Status_Tarefa]]=\"Suspensa\"),\"\",IF(O80=\"Concluída\",MAX(0,L80-J80),IF(O80=\"Não iniciada\",0,MAX(0,TODAY()-J80))))","v":3}]
[null,null,"TAR-0096","PROJ-020",{"$f":"IFERROR(VLOOKUP(D81,tbProjetos[],2,FALSE),\"\")","v":"Análise de Mercado"},"Encerramento","Entrega formal","André Machado","2024-12-02","2024-12-26","2024-12-06","2024-12-28",25,23,"Concluída",{"v":1,"d":"100%"},"TAR-0095",{"$f":"IF(OR(O81=\"\",J81=\"\",tbCronograma[[#This Row],[Status_Tarefa]]=\"Suspensa\"),\"\",IF(O81=\"Concluída\",MAX(0,L81-J81),IF(O81=\"Não iniciada\",0,MAX(0,TODAY()-J81))))","v":2}]
[null,null,"TAR-0097","PROJ-021",{"$f":"IFERROR(VLOOKUP(D82,tbProjetos[],2,FALSE),\"\")","v":"Redesign Marca"},"Planejamento","Análise de viabilidade","Elisa Prado","2024-07-25","2024-08-08","2024-07-30","2024-08-10",15,12,"Concluída",{"v":1,"d":"100%"},null,{"$f":"IF(OR(O82=\"\",J82=\"\",tbCronograma[[#This Row],[Status_Tarefa]]=\"Suspensa\"),\"\",IF(O82=\"Concluída\",MAX(0,L82-J82),IF(O82=\"Não iniciada\",0,MAX(0,TODAY()-J82))))","v":2}]
[null,null,"TAR-0098","PROJ-021",{"$f":"IFERROR(VLOOKUP(D83,tbProjetos[],2,FALSE),\"\")","v":"Redesign Marca"},"Execução","Desenvolvimento do protótipo","Felipe Neves","2024-08-09","2024-08-23","2024-08-14",null,15,"","Atrasada",{"v":0.82,"d":"82%"},"TAR-0097",{"$f":"IF(OR(O83=\"\",J83=\"\",tbCronograma[[#This Row],[Status_Tarefa]]=\"Suspensa\"),\"\",IF(O83=\"Concluída\",MAX(0,L83-J83),IF(O83=\"Não iniciada\",0,MAX(0,TODAY()-J83))))","v":720}]
[null,null,"TAR-0099","PROJ-021",{"$f":"IFERROR(VLOOKUP(D84,tbProjetos[],2,FALSE),\"\")","v":"Redesign Marca"},"Testes","Correção de bugs","Camila Duarte","2024-08-24","2024-09-07","2024-08-26",null,15,"","Atrasada",{"v":0.55,"d":"55%"},null,{"$f":"IF(OR(O84=\"\",J84=\"\",tbCronograma[[#This Row],[Status_Tarefa]]=\"Suspensa\"),\"\",IF(O84=\"Concluída\",MAX(0,L84-J84),IF(O84=\"Não iniciada\",0,MAX(0,TODAY()-J84))))","v":705}]
[null,null,"TAR-0100","PROJ-021",{"$f":"IFERROR(VLOOKUP(D85,tbProjetos[],2,FALSE),\"\")","v":"Redesign Marca"},"Implantação","Treinamento de usuários","André Machado","2024-09-08","2024-09-22","2024-09-13","2024-09-26",15,14,"Concluída",{"v":1,"d":"100%"},null,{"$f":"IF(OR(O85=\"\",J85=\"\",tbCronograma[[#This Row],[Status_Tarefa]]=\"Suspensa\"),\"\",IF(O85=\"Concluída\",MAX(0,L85-J85),IF(O85=\"Não iniciada\",0,MAX(0,TODAY()-J85))))","v":4}]
[null,null,"TAR-0101","PROJ-021",{"$f":"IFERROR(VLOOKUP(D86,tbProjetos[],2,FALSE),\"\")","v":"Redesign Marca"},"Encerramento","Encerramento administrativo","Ricardo Monteiro","2024-09-23","2024-10-07","2024-09-21","2024-10-07",15,17,"Concluída",{"v":1,"d":"100%"},null,{"$f":"IF(OR(O86=\"\",J86=\"\",tbCronograma[[#This Row],[Status_Tarefa]]=\"Suspensa\"),\"\",IF(O86=\"Concluída\",MAX(0,L86-J86),IF(O86=\"Não iniciada\",0,MAX(0,TODAY()-J86))))","v":0}]
[null,null,"TAR-0102","PROJ-022",{"$f":"IFERROR(VLOOKUP(D87,tbProjetos[],2,FALSE),\"\")","v":"Implantação SAP"},"Planejamento","Análise de viabilidade","André Machado","2025-01-27","2025-03-10","2025-02-01","2025-03-15",43,43,"Concluída",{"v":1,"d":"100%"},null,{"$f":"IF(OR(O87=\"\",J87=\"\",tbCronograma[[#This Row],[Status_Tarefa]]=\"Suspensa\"),\"\",IF(O87=\"Concluída\",MAX(0,L87-J87),IF(O87=\"Não iniciada\",0,MAX(0,TODAY()-J87))))","v":5}]
[null,null,"TAR-0103","PROJ-022",{"$f":"IFERROR(VLOOKUP(D88,tbProjetos[],2,FALSE),\"\")","v":"Implantação SAP"},"Execução","Migração de dados","Camila Duarte","2025-03-11","2025-04-22","2025-03-11","2025-05-04",43,55,"Concluída",{"v":1,"d":"100%"},null,{"$f":"IF(OR(O88=\"\",J88=\"\",tbCronograma[[#This Row],[Status_Tarefa]]=\"Suspensa\"),\"\",IF(O88=\"Concluída\",MAX(0,L88-J88),IF(O88=\"Não iniciada\",0,MAX(0,TODAY()-J88))))","v":12}]
[null,null,"TAR-0104","PROJ-022",{"$f":"IFERROR(VLOOKUP(D89,tbProjetos[],2,FALSE),\"\")","v":"Implantação SAP"},"Testes","Testes de aceitação","Diego Fonseca","2025-04-23","2025-06-04","2025-04-28",null,43,"","Atrasada",{"v":0.59,"d":"59%"},"TAR-0103",{"$f":"IF(OR(O89=\"\",J89=\"\",tbCronograma[[#This Row],[Status_Tarefa]]=\"Suspensa\"),\"\",IF(O89=\"Concluída\",MAX(0,L89-J89),IF(O89=\"Não iniciada\",0,MAX(0,TODAY()-J89))))","v":435}]
[null,null,"TAR-0105","PROJ-023",{"$f":"IFERROR(VLOOKUP(D90,tbProjetos[],2,FALSE),\"\")","v":"Otimização Logística"},"Planejamento","Elaboração do cronograma","Ricardo Monteiro","2024-08-25","2024-09-26","2024-08-26","2024-09-24",33,30,"Concluída",{"v":1,"d":"100%"},null,{"$f":"IF(OR(O90=\"\",J90=\"\",tbCronograma[[#This Row],[Status_Tarefa]]=\"Suspensa\"),\"\",IF(O90=\"Concluída\",MAX(0,L90-J90),IF(O90=\"Não iniciada\",0,MAX(0,TODAY()-J90))))","v":0}]
[null,null,"TAR-0106","PROJ-023",{"$f":"IFERROR(VLOOKUP(D91,tbProjetos[],2,FALSE),\"\")","v":"Otimização Logística"},"Execução","Migração de dados","Camila Duarte","2024-09-27","2024-10-29","2024-09-27",null,33,"","Suspensa",{"v":0.65,"d":"65%"},"TAR-0105",{"$f":"IF(OR(O91=\"\",J91=\"\",tbCronograma[[#This Row],[Status_Tarefa]]=\"Suspensa\"),\"\",IF(O91=\"Concluída\",MAX(0,L91-J91),IF(O91=\"Não iniciada\",0,MAX(0,TODAY()-J91))))","v":""}]
[null,null,"TAR-0107","PROJ-023",{"$f":"IFERROR(VLOOKUP(D92,tbProjetos[],2,FALSE),\"\")","v":"Otimização Logística"},"Testes","Testes de integração","Diego Fonseca","2024-10-30","2024-12-01","2024-10-31",null,33,"","Suspensa",{"v":0.5,"d":"50%"},"TAR-0106",{"$f":"IF(OR(O92=\"\",J92=\"\",tbCronograma[[#This Row],[Status_Tarefa]]=\"Suspensa\"),\"\",IF(O92=\"Concluída\",MAX(0,L92-J92),IF(O92=\"Não iniciada\",0,MAX(0,TODAY()-J92))))","v":""}]
[null,null,"TAR-0108","PROJ-023",{"$f":"IFERROR(VLOOKUP(D93,tbProjetos[],2,FALSE),\"\")","v":"Otimização Logística"},"Implantação","Treinamento de usuários","Beatriz Alves","2024-12-02","2025-01-03",null,null,33,"","Suspensa",{"v":0,"d":"0%"},null,{"$f":"IF(OR(O93=\"\",J93=\"\",tbCronograma[[#This Row],[Status_Tarefa]]=\"Suspensa\"),\"\",IF(O93=\"Concluída\",MAX(0,L93-J93),IF(O93=\"Não iniciada\",0,MAX(0,TODAY()-J93))))","v":""}]
[null,null,"TAR-0109","PROJ-023",{"$f":"IFERROR(VLOOKUP(D94,tbProjetos[],2,FALSE),\"\")","v":"Otimização Logística"},"Encerramento","Documentação final","Diego Fonseca","2025-01-04","2025-02-05",null,null,33,"","Suspensa",{"v":0,"d":"0%"},"TAR-0108",{"$f":"IF(OR(O94=\"\",J94=\"\",tbCronograma[[#This Row],[Status_Tarefa]]=\"Suspensa\"),\"\",IF(O94=\"Concluída\",MAX(0,L94-J94),IF(O94=\"Não iniciada\",0,MAX(0,TODAY()-J94))))","v":""}]
[null,null,"TAR-0110","PROJ-023",{"$f":"IFERROR(VLOOKUP(D95,tbProjetos[],2,FALSE),\"\")","v":"Otimização Logística"},"Encerramento","Documentação final","Beatriz Alves","2025-02-06","2025-03-10",null,null,33,"","Suspensa",{"v":0,"d":"0%"},null,{"$f":"IF(OR(O95=\"\",J95=\"\",tbCronograma[[#This Row],[Status_Tarefa]]=\"Suspensa\"),\"\",IF(O95=\"Concluída\",MAX(0,L95-J95),IF(O95=\"Não iniciada\",0,MAX(0,TODAY()-J95))))","v":""}]
[null,null,"TAR-0111","PROJ-024",{"$f":"IFERROR(VLOOKUP(D96,tbProjetos[],2,FALSE),\"\")","v":"Sistema de Ponto"},"Planejamento","Elaboração do cronograma","André Machado","2024-09-18","2024-11-01","2024-09-17","2024-11-12",45,57,"Concluída",{"v":1,"d":"100%"},null,{"$f":"IF(OR(O96=\"\",J96=\"\",tbCronograma[[#This Row],[Status_Tarefa]]=\"Suspensa\"),\"\",IF(O96=\"Concluída\",MAX(0,L96-J96),IF(O96=\"Não iniciada\",0,MAX(0,TODAY()-J96))))","v":11}]
[null,null,"TAR-0112","PROJ-024",{"$f":"IFERROR(VLOOKUP(D97,tbProjetos[],2,FALSE),\"\")","v":"Sistema de Ponto"},"Execução","Implementação do módulo principal","Elisa Prado","2024-11-02","2024-12-16","2024-11-06","2024-12-11",45,36,"Concluída",{"v":1,"d":"100%"},"TAR-0111",{"$f":"IF(OR(O97=\"\",J97=\"\",tbCronograma[[#This Row],[Status_Tarefa]]=\"Suspensa\"),\"\",IF(O97=\"Concluída\",MAX(0,L97-J97),IF(O97=\"Não iniciada\",0,MAX(0,TODAY()-J97))))","v":0}]
[null,null,"TAR-0113","PROJ-024",{"$f":"IFERROR(VLOOKUP(D98,tbProjetos[],2,FALSE),\"\")","v":"Sistema de Ponto"},"Testes","Correção de bugs","Beatriz Alves","2024-12-17","2025-01-30","2024-12-20","2025-02-02",45,45,"Concluída",{"v":1,"d":"100%"},"TAR-0112",{"$f":"IF(OR(O98=\"\",J98=\"\",tbCronograma[[#This Row],[Status_Tarefa]]=\"Suspensa\"),\"\",IF(O98=\"Concluída\",MAX(0,L98-J98),IF(O98=\"Não iniciada\",0,MAX(0,TODAY()-J98))))","v":3}]
[null,null,"TAR-0114","PROJ-024",{"$f":"IFERROR(VLOOKUP(D99,tbProjetos[],2,FALSE),\"\")","v":"Sistema de Ponto"},"Implantação","Preparação do ambiente produtivo","Felipe Neves","2025-01-31","2025-03-16","2025-01-29","2025-03-18",45,49,"Concluída",{"v":1,"d":"100%"},"TAR-0113",{"$f":"IF(OR(O99=\"\",J99=\"\",tbCronograma[[#This Row],[Status_Tarefa]]=\"Suspensa\"),\"\",IF(O99=\"Concluída\",MAX(0,L99-J99),IF(O99=\"Não iniciada\",0,MAX(0,TODAY()-J99))))","v":2}]
[null,null,"TAR-0115","PROJ-024",{"$f":"IFERROR(VLOOKUP(D100,tbProjetos[],2,FALSE),\"\")","v":"Sistema de Ponto"},"Encerramento","Documentação final","André Machado","2025-03-17","2025-04-30","2025-03-18","2025-04-28",45,42,"Concluída",{"v":1,"d":"100%"},"TAR-0114",{"$f":"IF(OR(O100=\"\",J100=\"\",tbCronograma[[#This Row],[Status_Tarefa]]=\"Suspensa\"),\"\",IF(O100=\"Concluída\",MAX(0,L100-J100),IF(O100=\"Não iniciada\",0,MAX(0,TODAY()-J100))))","v":0}]
[null,null,"TAR-0116","PROJ-025",{"$f":"IFERROR(VLOOKUP(D101,tbProjetos[],2,FALSE),\"\")","v":"Campanha Black Friday"},"Planejamento","Análise de viabilidade","Felipe Neves","2024-07-03","2024-08-16","2024-07-06","2024-08-21",45,47,"Concluída",{"v":1,"d":"100%"},null,{"$f":"IF(OR(O101=\"\",J101=\"\",tbCronograma[[#This Row],[Status_Tarefa]]=\"Suspensa\"),\"\",IF(O101=\"Concluída\",MAX(0,L101-J101),IF(O101=\"Não iniciada\",0,MAX(0,TODAY()-J101))))","v":5}]
[null,null,"TAR-0117","PROJ-025",{"$f":"IFERROR(VLOOKUP(D102,tbProjetos[],2,FALSE),\"\")","v":"Campanha Black Friday"},"Execução","Desenvolvimento do protótipo","Ricardo Monteiro","2024-08-17","2024-09-30","2024-08-18","2024-10-08",45,52,"Concluída",{"v":1,"d":"100%"},"TAR-0116",{"$f":"IF(OR(O102=\"\",J102=\"\",tbCronograma[[#This Row],[Status_Tarefa]]=\"Suspensa\"),\"\",IF(O102=\"Concluída\",MAX(0,L102-J102),IF(O102=\"Não iniciada\",0,MAX(0,TODAY()-J102))))","v":8}]
[null,null,"TAR-0118","PROJ-025",{"$f":"IFERROR(VLOOKUP(D103,tbProjetos[],2,FALSE),\"\")","v":"Campanha Black Friday"},"Testes","Testes de aceitação","André Machado","2024-10-01","2024-11-14","2024-09-28","2024-11-18",45,52,"Concluída",{"v":1,"d":"100%"},null,{"$f":"IF(OR(O103=\"\",J103=\"\",tbCronograma[[#This Row],[Status_Tarefa]]=\"Suspensa\"),\"\",IF(O103=\"Concluída\",MAX(0,L103-J103),IF(O103=\"Não iniciada\",0,MAX(0,TODAY()-J103))))","v":4}]
[null,null,"TAR-0119","PROJ-025",{"$f":"IFERROR(VLOOKUP(D104,tbProjetos[],2,FALSE),\"\")","v":"Campanha Black Friday"},"Implantação","Treinamento de usuários","André Machado","2024-11-15","2024-12-29","2024-11-13","2024-12-30",{"$f":"IF(OR(J104=\"\",I104=\"\"),\"\",J104-I104+1)","v":45},48,"Concluída",{"v":1,"d":"100%"},null,{"$f":"IF(OR(O104=\"\",J104=\"\",tbCronograma[[#This Row],[Status_Tarefa]]=\"Suspensa\"),\"\",IF(O104=\"Concluída\",MAX(0,L104-J104),IF(O104=\"Não iniciada\",0,MAX(0,TODAY()-J104))))","v":1}]
[null,null,"TAR-0120","PROJ-025",{"$f":"IFERROR(VLOOKUP(D105,tbProjetos[],2,FALSE),\"\")","v":"Campanha Black Friday"},"Encerramento","Documentação final","Beatriz Alves","2024-12-30","2025-02-12","2025-01-04","2025-02-22",45,50,"Concluída",{"v":1,"d":"100%"},"TAR-0119",{"$f":"IF(OR(O105=\"\",J105=\"\",tbCronograma[[#This Row],[Status_Tarefa]]=\"Suspensa\"),\"\",IF(O105=\"Concluída\",MAX(0,L105-J105),IF(O105=\"Não iniciada\",0,MAX(0,TODAY()-J105))))","v":10}]
[null,null,"TAR-0121","PROJ-025",{"$f":"IFERROR(VLOOKUP(D106,tbProjetos[],2,FALSE),\"\")","v":"Campanha Black Friday"},"Encerramento","Entrega formal","Felipe Neves","2025-02-13","2025-03-29","2025-02-16","2025-03-25",45,38,"Concluída",{"v":1,"d":"100%"},null,{"$f":"IF(OR(O106=\"\",J106=\"\",tbCronograma[[#This Row],[Status_Tarefa]]=\"Suspensa\"),\"\",IF(O106=\"Concluída\",MAX(0,L106-J106),IF(O106=\"Não iniciada\",0,MAX(0,TODAY()-J106))))","v":0}]
[null,null,"TAR-0100","PROJ-022",{"$f":"IFERROR(VLOOKUP(D107,tbProjetos[],2,FALSE),\"\")","v":"Implantação SAP"},{"$nulls":7},"","",{"$nulls":3},{"$f":"IF(OR(O107=\"\",J107=\"\",tbCronograma[[#This Row],[Status_Tarefa]]=\"Suspensa\"),\"\",IF(O107=\"Concluída\",MAX(0,L107-J107),IF(O107=\"Não iniciada\",0,MAX(0,TODAY()-J107))))","v":""}]
[null,null,"TAR-0101","PROJ-023",{"$f":"IFERROR(VLOOKUP(D108,tbProjetos[],2,FALSE),\"\")","v":"Otimização Logística"},{"$nulls":7},"","",{"$nulls":3},{"$f":"IF(OR(O108=\"\",J108=\"\",tbCronograma[[#This Row],[Status_Tarefa]]=\"Suspensa\"),\"\",IF(O108=\"Concluída\",MAX(0,L108-J108),IF(O108=\"Não iniciada\",0,MAX(0,TODAY()-J108))))","v":""}]
[null,null,"TAR-0102","PROJ-023",{"$f":"IFERROR(VLOOKUP(D109,tbProjetos[],2,FALSE),\"\")","v":"Otimização Logística"},{"$nulls":7},"","",{"$nulls":3},{"$f":"IF(OR(O109=\"\",J109=\"\",tbCronograma[[#This Row],[Status_Tarefa]]=\"Suspensa\"),\"\",IF(O109=\"Concluída\",MAX(0,L109-J109),IF(O109=\"Não iniciada\",0,MAX(0,TODAY()-J109))))","v":""}]
[null,null,"TAR-0103","PROJ-023",{"$f":"IFERROR(VLOOKUP(D110,tbProjetos[],2,FALSE),\"\")","v":"Otimização Logística"},{"$nulls":7},"","",{"$nulls":3},{"$f":"IF(OR(O110=\"\",J110=\"\",tbCronograma[[#This Row],[Status_Tarefa]]=\"Suspensa\"),\"\",IF(O110=\"Concluída\",MAX(0,L110-J110),IF(O110=\"Não iniciada\",0,MAX(0,TODAY()-J110))))","v":""}]
[null,null,"TAR-0104","PROJ-024",{"$f":"IFERROR(VLOOKUP(D111,tbProjetos[],2,FALSE),\"\")","v":"Sistema de Ponto"},{"$nulls":7},"","",{"$nulls":3},{"$f":"IF(OR(O111=\"\",J111=\"\",tbCronograma[[#This Row],[Status_Tarefa]]=\"Suspensa\"),\"\",IF(O111=\"Concluída\",MAX(0,L111-J111),IF(O111=\"Não iniciada\",0,MAX(0,TODAY()-J111))))","v":""}]
[null,null,"TAR-0105","PROJ-024",{"$f":"IFERROR(VLOOKUP(D112,tbProjetos[],2,FALSE),\"\")","v":"Sistema de Ponto"},{"$nulls":7},"","",{"$nulls":3},{"$f":"IF(OR(O112=\"\",J112=\"\",tbCronograma[[#This Row],[Status_Tarefa]]=\"Suspensa\"),\"\",IF(O112=\"Concluída\",MAX(0,L112-J112),IF(O112=\"Não iniciada\",0,MAX(0,TODAY()-J112))))","v":""}]
[null,null,"TAR-0106","PROJ-024",{"$f":"IFERROR(VLOOKUP(D113,tbProjetos[],2,FALSE),\"\")","v":"Sistema de Ponto"},{"$nulls":7},"","",{"$nulls":3},{"$f":"IF(OR(O113=\"\",J113=\"\",tbCronograma[[#This Row],[Status_Tarefa]]=\"Suspensa\"),\"\",IF(O113=\"Concluída\",MAX(0,L113-J113),IF(O113=\"Não iniciada\",0,MAX(0,TODAY()-J113))))","v":""}]
[null,null,"TAR-0107","PROJ-024",{"$f":"IFERROR(VLOOKUP(D114,tbProjetos[],2,FALSE),\"\")","v":"Sistema de Ponto"},{"$nulls":7},"","",{"$nulls":3},{"$f":"IF(OR(O114=\"\",J114=\"\",tbCronograma[[#This Row],[Status_Tarefa]]=\"Suspensa\"),\"\",IF(O114=\"Concluída\",MAX(0,L114-J114),IF(O114=\"Não iniciada\",0,MAX(0,TODAY()-J114))))","v":""}]
[null,null,"TAR-0108","PROJ-025",{"$f":"IFERROR(VLOOKUP(D115,tbProjetos[],2,FALSE),\"\")","v":"Campanha Black Friday"},{"$nulls":7},"","",{"$nulls":3},{"$f":"IF(OR(O115=\"\",J115=\"\",tbCronograma[[#This Row],[Status_Tarefa]]=\"Suspensa\"),\"\",IF(O115=\"Concluída\",MAX(0,L115-J115),IF(O115=\"Não iniciada\",0,MAX(0,TODAY()-J115))))","v":""}]
[null,null,"TAR-0109","PROJ-025",{"$f":"IFERROR(VLOOKUP(D116,tbProjetos[],2,FALSE),\"\")","v":"Campanha Black Friday"},{"$nulls":7},"","",{"$nulls":3},{"$f":"IF(OR(O116=\"\",J116=\"\",tbCronograma[[#This Row],[Status_Tarefa]]=\"Suspensa\"),\"\",IF(O116=\"Concluída\",MAX(0,L116-J116),IF(O116=\"Não iniciada\",0,MAX(0,TODAY()-J116))))","v":""}]
[null,null,"TAR-0110","PROJ-025",{"$f":"IFERROR(VLOOKUP(D117,tbProjetos[],2,FALSE),\"\")","v":"Campanha Black Friday"},{"$nulls":7},"","",{"$nulls":3},{"$f":"IF(OR(O117=\"\",J117=\"\",tbCronograma[[#This Row],[Status_Tarefa]]=\"Suspensa\"),\"\",IF(O117=\"Concluída\",MAX(0,L117-J117),IF(O117=\"Não iniciada\",0,MAX(0,TODAY()-J117))))","v":""}]
[null,null,"TAR-0111","PROJ-025",{"$f":"IFERROR(VLOOKUP(D118,tbProjetos[],2,FALSE),\"\")","v":"Campanha Black Friday"},{"$nulls":7},"","",{"$nulls":3},{"$f":"IF(OR(O118=\"\",J118=\"\",tbCronograma[[#This Row],[Status_Tarefa]]=\"Suspensa\"),\"\",IF(O118=\"Concluída\",MAX(0,L118-J118),IF(O118=\"Não iniciada\",0,MAX(0,TODAY()-J118))))","v":""}]
[null,null,"TAR-0112","PROJ-025",{"$f":"IFERROR(VLOOKUP(D119,tbProjetos[],2,FALSE),\"\")","v":"Campanha Black Friday"},{"$nulls":7},"","",{"$nulls":3},{"$f":"IF(OR(O119=\"\",J119=\"\",tbCronograma[[#This Row],[Status_Tarefa]]=\"Suspensa\"),\"\",IF(O119=\"Concluída\",MAX(0,L119-J119),IF(O119=\"Não iniciada\",0,MAX(0,TODAY()-J119))))","v":""}]
[null,null,"TAR-0113","PROJ-025",{"$f":"IFERROR(VLOOKUP(D120,tbProjetos[],2,FALSE),\"\")","v":"Campanha Black Friday"},{"$nulls":7},"","",{"$nulls":3},{"$f":"IF(OR(O120=\"\",J120=\"\",tbCronograma[[#This Row],[Status_Tarefa]]=\"Suspensa\"),\"\",IF(O120=\"Concluída\",MAX(0,L120-J120),IF(O120=\"Não iniciada\",0,MAX(0,TODAY()-J120))))","v":""}]
[null,null,"TAR-0114","PROJ-026",{"$f":"IFERROR(VLOOKUP(D121,tbProjetos[],2,FALSE),\"\")","v":"Compliance LGPD"},{"$nulls":7},"","",{"$nulls":3},{"$f":"IF(OR(O121=\"\",J121=\"\",tbCronograma[[#This Row],[Status_Tarefa]]=\"Suspensa\"),\"\",IF(O121=\"Concluída\",MAX(0,L121-J121),IF(O121=\"Não iniciada\",0,MAX(0,TODAY()-J121))))","v":""}]
[null,null,"TAR-0115","PROJ-026",{"$f":"IFERROR(VLOOKUP(D122,tbProjetos[],2,FALSE),\"\")","v":"Compliance LGPD"},{"$nulls":7},"","",{"$nulls":3},{"$f":"IF(OR(O122=\"\",J122=\"\",tbCronograma[[#This Row],[Status_Tarefa]]=\"Suspensa\"),\"\",IF(O122=\"Concluída\",MAX(0,L122-J122),IF(O122=\"Não iniciada\",0,MAX(0,TODAY()-J122))))","v":""}]

{"sheet":"Orcamento","index":6,"n_rows":22,"n_cols":19,"rows_kept":22,"hidden":true,"merged":[[1,2,1,18],[2,2,2,18],[3,2,3,18]]}
[]
[null,null,"ORÇAMENTO E CONTROLE FINANCEIRO"]
[]
[]
[]
[]
[null,null,"Cod_Lancamento","Cod_Projeto","Projeto","Data_Lancamento","Tipo_Valor","Categoria_Custo","Descricao","Fornecedor","Valor_Previsto","Valor_Realizado","Diferenca","Status_Orcamento","Receita_Prevista","Receita_Realizada","Resultado_Real","Competencia","Observacoes"]
[null,null,"ORC-001","PROJ-011",{"$f":"IFERROR(VLOOKUP(tbOrcamento[[#This Row],[Cod_Projeto]],tbProjetos[[Cod_Projeto]:[Projeto]],2,0),\"\")","v":"Expansão Filial Norte"},"2026-02-02","Custo","Mão de obra","Equipe desenvolvimento front-end","Interno",{"v":42000,"d":"R$ 42,000.00"},{"v":38500,"d":"R$ 38,500.00"},{"$f":"K8-L8","v":{"v":3500,"d":"R$ 3,500.00"}},{"$f":"IF(G8=\"Custo\",IF(L8>K8,\"Acima do previsto\",IF(L8=K8,\"Dentro do previsto\",\"Abaixo do previsto\")),\"\")","v":"Abaixo do previsto"},{"v":498789.54,"d":"R$ 498,789.54"},0,{"$f":"P8-L8","v":{"v":-38500,"d":"-R$ 38,500.00"}},"2026-02-25"]
[null,null,"ORC-002","PROJ-011",{"$f":"IFERROR(VLOOKUP(tbOrcamento[[#This Row],[Cod_Projeto]],tbProjetos[[Cod_Projeto]:[Projeto]],2,0),\"\")","v":"Expansão Filial Norte"},"2026-02-15","Custo","Software","Licença plataforma gestão","SAP Brasil",{"v":28000,"d":"R$ 28,000.00"},{"v":31200,"d":"R$ 31,200.00"},{"$f":"K9-L9","v":{"v":-3200,"d":"-R$ 3,200.00"}},{"$f":"IF(G9=\"Custo\",IF(L9>K9,\"Acima do previsto\",IF(L9=K9,\"Dentro do previsto\",\"Abaixo do previsto\")),\"\")","v":"Acima do previsto"},0,0,{"$f":"P9-L9","v":{"v":-31200,"d":"-R$ 31,200.00"}},"2026-02-25"]
[null,null,"ORC-003","PROJ-011",{"$f":"IFERROR(VLOOKUP(tbOrcamento[[#This Row],[Cod_Projeto]],tbProjetos[[Cod_Projeto]:[Projeto]],2,0),\"\")","v":"Expansão Filial Norte"},"2026-03-01","Custo","Terceiros","Consultoria especializada expansão","Consultoria Norte Ltda",{"v":55000,"d":"R$ 55,000.00"},{"v":48200,"d":"R$ 48,200.00"},{"v":6800,"d":"R$ 6,800.00"},"Abaixo do previsto",0,0,{"v":-48200,"d":"-R$ 48,200.00"},"2026-03-28"]
[null,null,"ORC-004","PROJ-014",{"$f":"IFERROR(VLOOKUP(tbOrcamento[[#This Row],[Cod_Projeto]],tbProjetos[[Cod_Projeto]:[Projeto]],2,0),\"\")","v":"Sistema de Tickets"},"2026-01-18","Custo","Mão de obra","Desenvolvimento módulo tickets","Interno",{"v":18000,"d":"R$ 18,000.00"},{"v":16500,"d":"R$ 16,500.00"},{"v":1500,"d":"R$ 1,500.00"},"Abaixo do previsto",{"v":68614.67,"d":"R$ 68,614.67"},0,{"v":-16500,"d":"-R$ 16,500.00"},"2026-01-18"]
[null,null,"ORC-005","PROJ-014",{"$f":"IFERROR(VLOOKUP(tbOrcamento[[#This Row],[Cod_Projeto]],tbProjetos[[Cod_Projeto]:[Projeto]],2,0),\"\")","v":"Sistema de Tickets"},"2026-02-02","Custo","Software","Infraestrutura cloud","AWS Brasil",{"v":12000,"d":"R$ 12,000.00"},{"v":11500,"d":"R$ 11,500.00"},{"v":500,"d":"R$ 500.00"},"Abaixo do previsto",0,0,{"v":-11500,"d":"-R$ 11,500.00"},"2026-02-25"]
[null,null,"ORC-006","PROJ-017",{"$f":"IFERROR(VLOOKUP(tbOrcamento[[#This Row],[Cod_Projeto]],tbProjetos[[Cod_Projeto]:[Projeto]],2,0),\"\")","v":"Chatbot Atendimento"},"2025-12-19","Custo","Terceiros","Desenvolvimento chatbot IA","TechBot Soluções",{"v":35000,"d":"R$ 35,000.00"},{"v":33800,"d":"R$ 33,800.00"},{"v":1200,"d":"R$ 1,200.00"},"Abaixo do previsto",{"v":193447.67,"d":"R$ 193,447.67"},0,{"v":-33800,"d":"-R$ 33,800.00"},"2026-01-18"]
[null,null,"ORC-007","PROJ-017",{"$f":"IFERROR(VLOOKUP(tbOrcamento[[#This Row],[Cod_Projeto]],tbProjetos[[Cod_Projeto]:[Projeto]],2,0),\"\")","v":"Chatbot Atendimento"},"2026-01-18","Custo","Mão de obra","Integração API atendimento","Interno",{"v":22000,"d":"R$ 22,000.00"},{"v":19800,"d":"R$ 19,800.00"},{"v":2200,"d":"R$ 2,200.00"},"Abaixo do previsto",0,0,{"v":-19800,"d":"-R$ 19,800.00"},"2026-01-18"]
[null,null,"ORC-008","PROJ-019",{"$f":"IFERROR(VLOOKUP(tbOrcamento[[#This Row],[Cod_Projeto]],tbProjetos[[Cod_Projeto]:[Projeto]],2,0),\"\")","v":"Projeto Sustentabilidade"},"2026-01-01","Custo","Mão de obra","Equipe análise sustentabilidade","Interno",{"v":48000,"d":"R$ 48,000.00"},{"v":44700,"d":"R$ 44,700.00"},{"v":3300,"d":"R$ 3,300.00"},"Abaixo do previsto",{"v":551903.23,"d":"R$ 551,903.23"},0,{"v":-44700,"d":"-R$ 44,700.00"},"2026-01-29"]
[null,null,"ORC-009","PROJ-019",{"$f":"IFERROR(VLOOKUP(tbOrcamento[[#This Row],[Cod_Projeto]],tbProjetos[[Cod_Projeto]:[Projeto]],2,0),\"\")","v":"Projeto Sustentabilidade"},"2026-01-29","Custo","Terceiros","Auditoria ambiental externa","EcoVeritas Consultoria",{"v":30000,"d":"R$ 30,000.00"},0,{"v":30000,"d":"R$ 30,000.00"},"Abaixo do previsto",0,0,0,"2026-02-25"]
[null,null,"ORC-010","PROJ-021",{"$f":"IFERROR(VLOOKUP(tbOrcamento[[#This Row],[Cod_Projeto]],tbProjetos[[Cod_Projeto]:[Projeto]],2,0),\"\")","v":"Redesign Marca"},"2025-12-07","Custo","Mão de obra","Equipe design identidade visual","Interno",{"v":62000,"d":"R$ 62,000.00"},{"v":58900,"d":"R$ 58,900.00"},{"v":3100,"d":"R$ 3,100.00"},"Abaixo do previsto",{"v":377853.82,"d":"R$ 377,853.82"},0,{"v":-58900,"d":"-R$ 58,900.00"},"2026-01-01"]
[null,null,"ORC-011","PROJ-021",{"$f":"IFERROR(VLOOKUP(tbOrcamento[[#This Row],[Cod_Projeto]],tbProjetos[[Cod_Projeto]:[Projeto]],2,0),\"\")","v":"Redesign Marca"},"2026-01-01","Custo","Terceiros","Fotografia e produção de conteúdo","Visual Studio MG",{"v":18500,"d":"R$ 18,500.00"},{"v":21000,"d":"R$ 21,000.00"},{"v":-2500,"d":"-R$ 2,500.00"},"Acima do previsto",0,0,{"v":-21000,"d":"-R$ 21,000.00"},"2026-01-29"]
[null,null,"ORC-012","PROJ-016",{"$f":"IFERROR(VLOOKUP(tbOrcamento[[#This Row],[Cod_Projeto]],tbProjetos[[Cod_Projeto]:[Projeto]],2,0),\"\")","v":"Portal do Fornecedor"},"2025-12-19","Custo","Software","Licença ERP fornecedores","Oracle Brasil",{"v":45000,"d":"R$ 45,000.00"},0,{"v":45000,"d":"R$ 45,000.00"},"Abaixo do previsto",{"v":389124.08,"d":"R$ 389,124.08"},0,0,"2026-01-18"]
[null,null,"ORC-013","PROJ-016",{"$f":"IFERROR(VLOOKUP(tbOrcamento[[#This Row],[Cod_Projeto]],tbProjetos[[Cod_Projeto]:[Projeto]],2,0),\"\")","v":"Portal do Fornecedor"},"2026-01-18","Custo","Mão de obra","Desenvolvimento portal fornecedores","Interno",{"v":38000,"d":"R$ 38,000.00"},{"v":25012.58,"d":"R$ 25,012.58"},{"v":12987.419999999998,"d":"R$ 12,987.42"},"Abaixo do previsto",0,0,{"v":-25012.58,"d":"-R$ 25,012.58"},"2026-01-18"]
[null,null,"ORC-014","PROJ-023",{"$f":"IFERROR(VLOOKUP(tbOrcamento[[#This Row],[Cod_Projeto]],tbProjetos[[Cod_Projeto]:[Projeto]],2,0),\"\")","v":"Otimização Logística"},"2025-12-07","Custo","Terceiros","Análise de rotas logísticas","LogTech Brasil",{"v":52000,"d":"R$ 52,000.00"},{"v":44514.24,"d":"R$ 44,514.24"},{"v":7485.760000000002,"d":"R$ 7,485.76"},"Abaixo do previsto",{"v":381632.69,"d":"R$ 381,632.69"},0,{"v":-44514.24,"d":"-R$ 44,514.24"},"2026-01-01"]
[null,null,"ORC-015","PROJ-023",{"$f":"IFERROR(VLOOKUP(tbOrcamento[[#This Row],[Cod_Projeto]],tbProjetos[[Cod_Projeto]:[Projeto]],2,0),\"\")","v":"Otimização Logística"},"2026-01-01","Custo","Software","Sistema WMS integração","Totvs S.A.",{"v":35000,"d":"R$ 35,000.00"},0,{"v":35000,"d":"R$ 35,000.00"},"Abaixo do previsto",0,0,0,"2026-01-29"]

{"sheet":"Ocorrencias","index":7,"n_rows":14,"n_cols":14,"rows_kept":14,"hidden":true,"merged":[[1,2,1,13],[2,2,2,13],[3,2,3,13]]}
[]
[null,null,"REGISTRO DE OCORRÊNCIAS"]
[]
[]
[]
[]
[null,null,"Cod_Ocorrencia","Data_Registro","Cod_Projeto","Projeto","Tipo_Registro","Descricao","Impacto","Responsavel","Acao_Definida","Status","Data_Limite","Observacoes"]
[null,null,"OCO-001","2026-02-02","PROJ-011","Expansão Filial Norte","Risco","Risco de atraso na entrega por escassez de mão de obra especializada na região Norte","Alto","Ricardo Monteiro","Contratar equipe temporária e acionar parceiros locais","Em andamento","2026-03-28"]
[null,null,"OCO-002","2026-01-18","PROJ-014","Sistema de Tickets","Problema","Instabilidade no ambiente de testes afetando homologação do módulo de tickets","Médio","Felipe Neves","Reinicialização do servidor e abertura de chamado com fornecedor de infra","Resolvida","2026-01-25"]
[null,null,"OCO-003","2025-12-19","PROJ-017","Chatbot Atendimento","Mudança","Solicitação de inclusão de canal WhatsApp Business no escopo do chatbot","Alto","André Machado","Avaliar impacto no cronograma e orçamento antes de aprovar a mudança","Pendente","2026-01-08"]
[null,null,"OCO-004","2026-01-01","PROJ-019","Projeto Sustentabilidade","Risco","Parecer ambiental negativo pode inviabilizar certificados do projeto de sustentabilidade","Alto","Diego Fonseca","Engajar consultoria ambiental e rever plano de ação com stakeholders","Em andamento","2026-02-25"]
[null,null,"OCO-005","2025-12-07","PROJ-021","Redesign Marca","Alinhamento","Reunião de alinhamento com direção sobre novas diretrizes de identidade visual da marca","Baixo","Felipe Neves","Documentação das diretrizes aprovadas e distribuição para equipe criativa","Resolvida","2025-12-14"]
[null,null,"OCO-006","2026-01-18","PROJ-016","Portal do Fornecedor","Pendência","Documentação de homologação do portal pendente de aprovação pelo cliente Magma Siderurgia","Médio","Camila Duarte","Enviar lembretes formais e escalar para gerente de conta","Em andamento","2026-03-01"]
[null,null,"OCO-007","2026-01-01","PROJ-023","Otimização Logística","Problema","Dados de rotas logísticas divergentes entre sistema legado e nova plataforma","Médio","Camila Duarte","Mapear inconsistências e executar processo de conciliação de dados","Em andamento","2026-02-02"]

{"sheet":"Relatorios","index":8,"n_rows":52,"n_cols":18,"rows_kept":52,"hidden":true,"merged":[[1,2,1,17],[2,2,2,17],[3,2,3,17],[6,2,6,3],[6,5,6,6],[6,8,6,9],[6,11,6,12],[6,14,6,15],[6,17,6,18],[7,2,7,3],[7,5,7,6],[7,8,7,9],[7,11,7,12],[7,14,7,15],[7,17,7,18],[8,2,8,3],[8,5,8,6],[8,8,8,9],[8,11,8,12],[8,14,8,15],[8,17,8,18]]}
[]
[null,null,"RELATÓRIOS E ACOMPANHAMENTO"]
[]
[]
[]
[]
[null,null,"Total de Projetos",null,null,"Projetos Ativos",null,null,"Projetos Atrasados",null,null,"% Médio Conclusão",null,null,"Receita Total",null,null,"Margem Real Total"]
[null,null,{"$f":"Calculos!D7","v":67},null,null,{"$f":"Calculos!D8","v":44},null,null,{"$f":"Calculos!D10","v":39},null,null,{"$f":"Calculos!D16","v":{"v":0.5140298507462687,"d":"51%"}},null,null,{"$f":"Calculos!D11","v":{"v":30024312.370000005,"d":"30,024,312.37"}},null,null,{"$f":"Calculos!D15","v":{"v":20682845.599999998,"d":"20,682,845.60"}}]
{"$rows_empty":32}
[null,null,"PROJETOS CRÍTICOS - TOP 10"]
[null,null,"Projeto","Responsável","Prazo","Situação Prazo","% Conclusão","Margem Real"]
[null,null,{"$f":"IFERROR(INDEX(tbProjetos[Projeto],1),\"\")","v":"Migração de ERP"},{"$f":"IF(C43=\"\",\"\",INDEX(tbProjetos[Responsavel],1))","v":"Ricardo Monteiro"},{"$f":"IF(C43=\"\",\"\",INDEX(tbProjetos[Prazo],1))","v":"2024-06-30"},{"$f":"IF(C43=\"\",\"\",INDEX(tbProjetos[Situacao_Prazo],1))","v":"Finalizado"},{"$f":"IF(C43=\"\",\"\",INDEX(tbProjetos[Perc_Conclusao],1))","v":{"v":1,"d":"100%"}},{"$f":"IF(C43=\"\",\"\",INDEX(tbProjetos[Margem_Real],1))","v":{"v":77806.94,"d":"R$ 77,806.94"}}]
[null,null,{"$f":"IFERROR(INDEX(tbProjetos[Projeto],2),\"\")","v":"Novo Portal Web"},{"$f":"IF(C44=\"\",\"\",INDEX(tbProjetos[Responsavel],2))","v":"Camila Duarte"},{"$f":"IF(C44=\"\",\"\",INDEX(tbProjetos[Prazo],2))","v":"2024-05-26"},{"$f":"IF(C44=\"\",\"\",INDEX(tbProjetos[Situacao_Prazo],2))","v":"Finalizado"},{"$f":"IF(C44=\"\",\"\",INDEX(tbProjetos[Perc_Conclusao],2))","v":{"v":1,"d":"100%"}},{"$f":"IF(C44=\"\",\"\",INDEX(tbProjetos[Margem_Real],2))","v":{"v":80763.01000000001,"d":"R$ 80,763.01"}}]
[null,null,{"$f":"IFERROR(INDEX(tbProjetos[Projeto],3),\"\")","v":"App Mobile Vendas"},{"$f":"IF(C45=\"\",\"\",INDEX(tbProjetos[Responsavel],3))","v":"André Machado"},{"$f":"IF(C45=\"\",\"\",INDEX(tbProjetos[Prazo],3))","v":"2024-09-10"},{"$f":"IF(C45=\"\",\"\",INDEX(tbProjetos[Situacao_Prazo],3))","v":"Finalizado"},{"$f":"IF(C45=\"\",\"\",INDEX(tbProjetos[Perc_Conclusao],3))","v":{"v":1,"d":"100%"}},{"$f":"IF(C45=\"\",\"\",INDEX(tbProjetos[Margem_Real],3))","v":{"v":107083.10000000003,"d":"R$ 107,083.10"}}]
[null,null,{"$f":"IFERROR(INDEX(tbProjetos[Projeto],4),\"\")","v":"Automação de RH"},{"$f":"IF(C46=\"\",\"\",INDEX(tbProjetos[Responsavel],4))","v":"Beatriz Alves"},{"$f":"IF(C46=\"\",\"\",INDEX(tbProjetos[Prazo],4))","v":"2024-04-24"},{"$f":"IF(C46=\"\",\"\",INDEX(tbProjetos[Situacao_Prazo],4))","v":"Finalizado"},{"$f":"IF(C46=\"\",\"\",INDEX(tbProjetos[Perc_Conclusao],4))","v":{"v":1,"d":"100%"}},{"$f":"IF(C46=\"\",\"\",INDEX(tbProjetos[Margem_Real],4))","v":{"v":370304.47000000003,"d":"R$ 370,304.47"}}]
[null,null,{"$f":"IFERROR(INDEX(tbProjetos[Projeto],5),\"\")","v":"BI Dashboard"},{"$f":"IF(C47=\"\",\"\",INDEX(tbProjetos[Responsavel],5))","v":"Diego Fonseca"},{"$f":"IF(C47=\"\",\"\",INDEX(tbProjetos[Prazo],5))","v":"2024-11-08"},{"$f":"IF(C47=\"\",\"\",INDEX(tbProjetos[Situacao_Prazo],5))","v":"Finalizado"},{"$f":"IF(C47=\"\",\"\",INDEX(tbProjetos[Perc_Conclusao],5))","v":{"v":1,"d":"100%"}},{"$f":"IF(C47=\"\",\"\",INDEX(tbProjetos[Margem_Real],5))","v":{"v":29545.549999999996,"d":"R$ 29,545.55"}}]
[null,null,{"$f":"IFERROR(INDEX(tbProjetos[Projeto],6),\"\")","v":"Integração CRM"},{"$f":"IF(C48=\"\",\"\",INDEX(tbProjetos[Responsavel],6))","v":"Elisa Prado"},{"$f":"IF(C48=\"\",\"\",INDEX(tbProjetos[Prazo],6))","v":"2024-07-05"},{"$f":"IF(C48=\"\",\"\",INDEX(tbProjetos[Situacao_Prazo],6))","v":"Atrasado"},{"$f":"IF(C48=\"\",\"\",INDEX(tbProjetos[Perc_Conclusao],6))","v":{"v":0.05,"d":"5%"}},{"$f":"IF(C48=\"\",\"\",INDEX(tbProjetos[Margem_Real],6))","v":{"v":737653.06,"d":"R$ 737,653.06"}}]
[null,null,{"$f":"IFERROR(INDEX(tbProjetos[Projeto],7),\"\")","v":"Reforma Sede"},{"$f":"IF(C49=\"\",\"\",INDEX(tbProjetos[Responsavel],7))","v":"Felipe Neves"},{"$f":"IF(C49=\"\",\"\",INDEX(tbProjetos[Prazo],7))","v":"2024-07-01"},{"$f":"IF(C49=\"\",\"\",INDEX(tbProjetos[Situacao_Prazo],7))","v":"Finalizado"},{"$f":"IF(C49=\"\",\"\",INDEX(tbProjetos[Perc_Conclusao],7))","v":{"v":1,"d":"100%"}},{"$f":"IF(C49=\"\",\"\",INDEX(tbProjetos[Margem_Real],7))","v":{"v":203247.19000000006,"d":"R$ 203,247.19"}}]
[null,null,{"$f":"IFERROR(INDEX(tbProjetos[Projeto],8),\"\")","v":"Campanha Digital Q1"},{"$f":"IF(C50=\"\",\"\",INDEX(tbProjetos[Responsavel],8))","v":"Ricardo Monteiro"},{"$f":"IF(C50=\"\",\"\",INDEX(tbProjetos[Prazo],8))","v":"2024-10-22"},{"$f":"IF(C50=\"\",\"\",INDEX(tbProjetos[Situacao_Prazo],8))","v":"Finalizado"},{"$f":"IF(C50=\"\",\"\",INDEX(tbProjetos[Perc_Conclusao],8))","v":{"v":1,"d":"100%"}},{"$f":"IF(C50=\"\",\"\",INDEX(tbProjetos[Margem_Real],8))","v":{"v":56029.19,"d":"R$ 56,029.19"}}]
[null,null,{"$f":"IFERROR(INDEX(tbProjetos[Projeto],9),\"\")","v":"Auditoria Fiscal"},{"$f":"IF(C51=\"\",\"\",INDEX(tbProjetos[Responsavel],9))","v":"Camila Duarte"},{"$f":"IF(C51=\"\",\"\",INDEX(tbProjetos[Prazo],9))","v":"2024-06-19"},{"$f":"IF(C51=\"\",\"\",INDEX(tbProjetos[Situacao_Prazo],9))","v":"Atrasado"},{"$f":"IF(C51=\"\",\"\",INDEX(tbProjetos[Perc_Conclusao],9))","v":{"v":0.3,"d":"30%"}},{"$f":"IF(C51=\"\",\"\",INDEX(tbProjetos[Margem_Real],9))","v":{"v":591218.46,"d":"R$ 591,218.46"}}]
[null,null,{"$f":"IFERROR(INDEX(tbProjetos[Projeto],10),\"\")","v":"Consultoria ISO 9001"},{"$f":"IF(C52=\"\",\"\",INDEX(tbProjetos[Responsavel],10))","v":"André Machado"},{"$f":"IF(C52=\"\",\"\",INDEX(tbProjetos[Prazo],10))","v":"2024-04-19"},{"$f":"IF(C52=\"\",\"\",INDEX(tbProjetos[Situacao_Prazo],10))","v":"Finalizado"},{"$f":"IF(C52=\"\",\"\",INDEX(tbProjetos[Perc_Conclusao],10))","v":{"v":1,"d":"100%"}},{"$f":"IF(C52=\"\",\"\",INDEX(tbProjetos[Margem_Real],10))","v":{"v":10370.409999999916,"d":"R$ 10,370.41"}}]

{"sheet":"Cad_Apoio","index":9,"n_rows":13,"n_cols":13,"rows_kept":13,"hidden":true,"merged":[[1,2,1,12],[2,2,2,12],[3,2,3,12]]}
[]
[null,null,"CADASTRO DE APOIO — Listas de Validação"]
[]
[]
[]
[null,null,"Status do Projeto",null,"Prioridade",null,"Categoria de Projeto",null,"Status de Tarefa",null,"Categoria de Custo",null,"Tipo de Registro"]
[null,null,"Planejado",null,"Baixa",null,"Implantação",null,"Não iniciada",null,"Mão de obra",null,"Risco"]
[null,null,"Em andamento",null,"Média",null,"Desenvolvimento",null,"Em andamento",null,"Software",null,"Problema"]
[null,null,"Em pausa",null,"Alta",null,"Consultoria",null,"Concluída",null,"Material",null,"Mudança"]
[null,null,"Concluído",null,"Crítica",null,"Marketing",null,"Atrasada",null,"Terceiros",null,"Alinhamento"]
[null,null,"Cancelado",{"$nulls":3},"Interno",null,"Suspensa",null,"Transporte",null,"Pendência"]
[{"$nulls":6},"Manutenção",{"$nulls":3},"Administrativo"]
[{"$nulls":10},"Outros"]

{"sheet":"Gantt","index":10,"n_rows":48,"n_cols":44,"rows_kept":48,"hidden":true,"merged":[[5,8,5,13],[6,8,6,37]]}
[]
[]
[]
[]
[]
[null,null,"PROJETO","DATA INÍCIO",{"$nulls":4},"💡 Ajuste DATA INÍCIO (D6) para navegar entre períodos"]
[null,null,"PROJ-001",{"$f":"IFERROR(MIN(AM9:AM48),TODAY())","v":"2024-02-28"},{"$nulls":4},{"$f":"TEXT($D$7,\"ddd dd/mm\")&\"  →  \"&TEXT($D$7+29,\"ddd dd/mm\")","v":"Wed 28/02  →  Thu 28/03"}]
[null,null,"Cód. Item","Projeto","Etapa","Tarefa","Responsável","Status",{"$f":"$D$7+0","v":"2024-02-28"},{"$f":"$D$7+1","v":"2024-02-29"},{"$f":"$D$7+2","v":"2024-03-01"},{"$f":"$D$7+3","v":"2024-03-02"},{"$f":"$D$7+4","v":"2024-03-03"},{"$f":"$D$7+5","v":"2024-03-04"},{"$f":"$D$7+6","v":"2024-03-05"},{"$f":"$D$7+7","v":"2024-03-06"},{"$f":"$D$7+8","v":"2024-03-07"},{"$f":"$D$7+9","v":"2024-03-08"},{"$f":"$D$7+10","v":"2024-03-09"},{"$f":"$D$7+11","v":"2024-03-10"},{"$f":"$D$7+12","v":"2024-03-11"},{"$f":"$D$7+13","v":"2024-03-12"},{"$f":"$D$7+14","v":"2024-03-13"},{"$f":"$D$7+15","v":"2024-03-14"},{"$f":"$D$7+16","v":"2024-03-15"},{"$f":"$D$7+17","v":"2024-03-16"},{"$f":"$D$7+18","v":"2024-03-17"},{"$f":"$D$7+19","v":"2024-03-18"},{"$f":"$D$7+20","v":"2024-03-19"},{"$f":"$D$7+21","v":"2024-03-20"},{"$f":"$D$7+22","v":"2024-03-21"},{"$f":"$D$7+23","v":"2024-03-22"},{"$f":"$D$7+24","v":"2024-03-23"},{"$f":"$D$7+25","v":"2024-03-24"},{"$f":"$D$7+26","v":"2024-03-25"},{"$f":"$D$7+27","v":"2024-03-26"},{"$f":"$D$7+28","v":"2024-03-27"},{"$f":"$D$7+29","v":"2024-03-28"}]
[null,null,{"$f":"IFERROR(INDEX(Cronograma!C:C,_xlfn.AGGREGATE(15,6,ROW(Cronograma!$D$8:$D$122)/(Cronograma!$D$8:$D$122=$C$7),1)),\"\")","v":"TAR-0001"},{"$f":"IFERROR(INDEX(Cronograma!E:E,_xlfn.AGGREGATE(15,6,ROW(Cronograma!$D$8:$D$122)/(Cronograma!$D$8:$D$122=$C$7),1)),\"\")","v":"Migração de ERP"},{"$f":"IFERROR(INDEX(Cronograma!F:F,_xlfn.AGGREGATE(15,6,ROW(Cronograma!$D$8:$D$122)/(Cronograma!$D$8:$D$122=$C$7),1)),\"\")","v":"Planejamento"},{"$f":"IFERROR(INDEX(Cronograma!G:G,_xlfn.AGGREGATE(15,6,ROW(Cronograma!$D$8:$D$122)/(Cronograma!$D$8:$D$122=$C$7),1)),\"\")","v":"Definição de escopo"},{"$f":"IFERROR(INDEX(Cronograma!H:H,_xlfn.AGGREGATE(15,6,ROW(Cronograma!$D$8:$D$122)/(Cronograma!$D$8:$D$122=$C$7),1)),\"\")","v":"Camila Duarte"},{"$f":"IFERROR(INDEX(Cronograma!O:O,_xlfn.AGGREGATE(15,6,ROW(Cronograma!$D$8:$D$122)/(Cronograma!$D$8:$D$122=$C$7),1)),\"\")","v":"Concluída"},{"$nulls":30},{"$f":"IFERROR(INDEX(Cronograma!I:I,_xlfn.AGGREGATE(15,6,ROW(Cronograma!$D$8:$D$122)/(Cronograma!$D$8:$D$122=$C$7),1)),\"\")","v":"2024-02-28"},{"$f":"IFERROR(INDEX(Cronograma!J:J,_xlfn.AGGREGATE(15,6,ROW(Cronograma!$D$8:$D$122)/(Cronograma!$D$8:$D$122=$C$7),1)),\"\")","v":"2024-03-06"},{"$f":"IFERROR(INDEX(Cronograma!K:K,_xlfn.AGGREGATE(15,6,ROW(Cronograma!$D$8:$D$122)/(Cronograma!$D$8:$D$122=$C$7),1)),\"\")","v":"2024-02-28"},{"$f":"IFERROR(INDEX(Cronograma!L:L,_xlfn.AGGREGATE(15,6,ROW(Cronograma!$D$8:$D$122)/(Cronograma!$D$8:$D$122=$C$7),1)),\"\")","v":"2024-03-11"},{"$f":"IFERROR(INDEX(Cronograma!P:P,_xlfn.AGGREGATE(15,6,ROW(Cronograma!$D$8:$D$122)/(Cronograma!$D$8:$D$122=$C$7),1)),\"\")","v":1},{"$f":"IFERROR(INDEX(Cronograma!R:R,_xlfn.AGGREGATE(15,6,ROW(Cronograma!$D$8:$D$122)/(Cronograma!$D$8:$D$122=$C$7),1)),\"\")","v":5}]
[null,null,{"$f":"IFERROR(INDEX(Cronograma!C:C,_xlfn.AGGREGATE(15,6,ROW(Cronograma!$D$8:$D$122)/(Cronograma!$D$8:$D$122=$C$7),2)),\"\")","v":"TAR-0002"},{"$f":"IFERROR(INDEX(Cronograma!E:E,_xlfn.AGGREGATE(15,6,ROW(Cronograma!$D$8:$D$122)/(Cronograma!$D$8:$D$122=$C$7),2)),\"\")","v":"Migração de ERP"},{"$f":"IFERROR(INDEX(Cronograma!F:F,_xlfn.AGGREGATE(15,6,ROW(Cronograma!$D$8:$D$122)/(Cronograma!$D$8:$D$122=$C$7),2)),\"\")","v":"Execução"},{"$f":"IFERROR(INDEX(Cronograma!G:G,_xlfn.AGGREGATE(15,6,ROW(Cronograma!$D$8:$D$122)/(Cronograma!$D$8:$D$122=$C$7),2)),\"\")","v":"Desenvolvimento do protótipo"},{"$f":"IFERROR(INDEX(Cronograma!H:H,_xlfn.AGGREGATE(15,6,ROW(Cronograma!$D$8:$D$122)/(Cronograma!$D$8:$D$122=$C$7),2)),\"\")","v":"André Machado"},{"$f":"IFERROR(INDEX(Cronograma!O:O,_xlfn.AGGREGATE(15,6,ROW(Cronograma!$D$8:$D$122)/(Cronograma!$D$8:$D$122=$C$7),2)),\"\")","v":"Concluída"},{"$nulls":30},{"$f":"IFERROR(INDEX(Cronograma!I:I,_xlfn.AGGREGATE(15,6,ROW(Cronograma!$D$8:$D$122)/(Cronograma!$D$8:$D$122=$C$7),2)),\"\")","v":"2024-03-07"},{"$f":"IFERROR(INDEX(Cronograma!J:J,_xlfn.AGGREGATE(15,6,ROW(Cronograma!$D$8:$D$122)/(Cronograma!$D$8:$D$122=$C$7),2)),\"\")","v":"2024-03-10"},{"$f":"IFERROR(INDEX(Cronograma!K:K,_xlfn.AGGREGATE(15,6,ROW(Cronograma!$D$8:$D$122)/(Cronograma!$D$8:$D$122=$C$7),2)),\"\")","v":"2024-03-07"},{"$f":"IFERROR(INDEX(Cronograma!L:L,_xlfn.AGGREGATE(15,6,ROW(Cronograma!$D$8:$D$122)/(Cronograma!$D$8:$D$122=$C$7),2)),\"\")","v":"2024-03-12"},{"$f":"IFERROR(INDEX(Cronograma!P:P,_xlfn.AGGREGATE(15,6,ROW(Cronograma!$D$8:$D$122)/(Cronograma!$D$8:$D$122=$C$7),2)),\"\")","v":1},{"$f":"IFERROR(INDEX(Cronograma!R:R,_xlfn.AGGREGATE(15,6,ROW(Cronograma!$D$8:$D$122)/(Cronograma!$D$8:$D$122=$C$7),2)),\"\")","v":2}]
[null,null,{"$f":"IFERROR(INDEX(Cronograma!C:C,_xlfn.AGGREGATE(15,6,ROW(Cronograma!$D$8:$D$122)/(Cronograma!$D$8:$D$122=$C$7),3)),\"\")","v":"TAR-0003"},{"$f":"IFERROR(INDEX(Cronograma!E:E,_xlfn.AGGREGATE(15,6,ROW(Cronograma!$D$8:$D$122)/(Cronograma!$D$8:$D$122=$C$7),3)),\"\")","v":"Migração de ERP"},{"$f":"IFERROR(INDEX(Cronograma!F:F,_xlfn.AGGREGATE(15,6,ROW(Cronograma!$D$8:$D$122)/(Cronograma!$D$8:$D$122=$C$7),3)),\"\")","v":"Testes"},{"$f":"IFERROR(INDEX(Cronograma!G:G,_xlfn.AGGREGATE(15,6,ROW(Cronograma!$D$8:$D$122)/(Cronograma!$D$8:$D$122=$C$7),3)),\"\")","v":"Testes de integração"},{"$f":"IFERROR(INDEX(Cronograma!H:H,_xlfn.AGGREGATE(15,6,ROW(Cronograma!$D$8:$D$122)/(Cronograma!$D$8:$D$122=$C$7),3)),\"\")","v":"Camila Duarte"},{"$f":"IFERROR(INDEX(Cronograma!O:O,_xlfn.AGGREGATE(15,6,ROW(Cronograma!$D$8:$D$122)/(Cronograma!$D$8:$D$122=$C$7),3)),\"\")","v":"Concluída"},{"$nulls":30},{"$f":"IFERROR(INDEX(Cronograma!I:I,_xlfn.AGGREGATE(15,6,ROW(Cronograma!$D$8:$D$122)/(Cronograma!$D$8:$D$122=$C$7),3)),\"\")","v":"2024-03-08"},{"$f":"IFERROR(INDEX(Cronograma!J:J,_xlfn.AGGREGATE(15,6,ROW(Cronograma!$D$8:$D$122)/(Cronograma!$D$8:$D$122=$C$7),3)),\"\")","v":"2024-03-15"},{"$f":"IFERROR(INDEX(Cronograma!K:K,_xlfn.AGGREGATE(15,6,ROW(Cronograma!$D$8:$D$122)/(Cronograma!$D$8:$D$122=$C$7),3)),\"\")","v":"2024-03-11"},{"$f":"IFERROR(INDEX(Cronograma!L:L,_xlfn.AGGREGATE(15,6,ROW(Cronograma!$D$8:$D$122)/(Cronograma!$D$8:$D$122=$C$7),3)),\"\")","v":"2024-03-14"},{"$f":"IFERROR(INDEX(Cronograma!P:P,_xlfn.AGGREGATE(15,6,ROW(Cronograma!$D$8:$D$122)/(Cronograma!$D$8:$D$122=$C$7),3)),\"\")","v":1},{"$f":"IFERROR(INDEX(Cronograma!R:R,_xlfn.AGGREGATE(15,6,ROW(Cronograma!$D$8:$D$122)/(Cronograma!$D$8:$D$122=$C$7),3)),\"\")","v":0}]
[null,null,{"$f":"IFERROR(INDEX(Cronograma!C:C,_xlfn.AGGREGATE(15,6,ROW(Cronograma!$D$8:$D$122)/(Cronograma!$D$8:$D$122=$C$7),4)),\"\")","v":"TAR-0004"},{"$f":"IFERROR(INDEX(Cronograma!E:E,_xlfn.AGGREGATE(15,6,ROW(Cronograma!$D$8:$D$122)/(Cronograma!$D$8:$D$122=$C$7),4)),\"\")","v":"Migração de ERP"},{"$f":"IFERROR(INDEX(Cronograma!F:F,_xlfn.AGGREGATE(15,6,ROW(Cronograma!$D$8:$D$122)/(Cronograma!$D$8:$D$122=$C$7),4)),\"\")","v":"Implantação"},{"$f":"IFERROR(INDEX(Cronograma!G:G,_xlfn.AGGREGATE(15,6,ROW(Cronograma!$D$8:$D$122)/(Cronograma!$D$8:$D$122=$C$7),4)),\"\")","v":"Preparação do ambiente produtivo"},{"$f":"IFERROR(INDEX(Cronograma!H:H,_xlfn.AGGREGATE(15,6,ROW(Cronograma!$D$8:$D$122)/(Cronograma!$D$8:$D$122=$C$7),4)),\"\")","v":"Felipe Neves"},{"$f":"IFERROR(INDEX(Cronograma!O:O,_xlfn.AGGREGATE(15,6,ROW(Cronograma!$D$8:$D$122)/(Cronograma!$D$8:$D$122=$C$7),4)),\"\")","v":"Concluída"},{"$nulls":30},{"$f":"IFERROR(INDEX(Cronograma!I:I,_xlfn.AGGREGATE(15,6,ROW(Cronograma!$D$8:$D$122)/(Cronograma!$D$8:$D$122=$C$7),4)),\"\")","v":"2024-03-12"},{"$f":"IFERROR(INDEX(Cronograma!J:J,_xlfn.AGGREGATE(15,6,ROW(Cronograma!$D$8:$D$122)/(Cronograma!$D$8:$D$122=$C$7),4)),\"\")","v":"2024-03-20"},{"$f":"IFERROR(INDEX(Cronograma!K:K,_xlfn.AGGREGATE(15,6,ROW(Cronograma!$D$8:$D$122)/(Cronograma!$D$8:$D$122=$C$7),4)),\"\")","v":"2024-03-13"},{"$f":"IFERROR(INDEX(Cronograma!L:L,_xlfn.AGGREGATE(15,6,ROW(Cronograma!$D$8:$D$122)/(Cronograma!$D$8:$D$122=$C$7),4)),\"\")","v":"2024-03-20"},{"$f":"IFERROR(INDEX(Cronograma!P:P,_xlfn.AGGREGATE(15,6,ROW(Cronograma!$D$8:$D$122)/(Cronograma!$D$8:$D$122=$C$7),4)),\"\")","v":1},{"$f":"IFERROR(INDEX(Cronograma!R:R,_xlfn.AGGREGATE(15,6,ROW(Cronograma!$D$8:$D$122)/(Cronograma!$D$8:$D$122=$C$7),4)),\"\")","v":0}]
[null,null,{"$f":"IFERROR(INDEX(Cronograma!C:C,_xlfn.AGGREGATE(15,6,ROW(Cronograma!$D$8:$D$122)/(Cronograma!$D$8:$D$122=$C$7),5)),\"\")","v":"TAR-0005"},{"$f":"IFERROR(INDEX(Cronograma!E:E,_xlfn.AGGREGATE(15,6,ROW(Cronograma!$D$8:$D$122)/(Cronograma!$D$8:$D$122=$C$7),5)),\"\")","v":"Migração de ERP"},{"$f":"IFERROR(INDEX(Cronograma!F:F,_xlfn.AGGREGATE(15,6,ROW(Cronograma!$D$8:$D$122)/(Cronograma!$D$8:$D$122=$C$7),5)),\"\")","v":"Encerramento"},{"$f":"IFERROR(INDEX(Cronograma!G:G,_xlfn.AGGREGATE(15,6,ROW(Cronograma!$D$8:$D$122)/(Cronograma!$D$8:$D$122=$C$7),5)),\"\")","v":"Encerramento administrativo"},{"$f":"IFERROR(INDEX(Cronograma!H:H,_xlfn.AGGREGATE(15,6,ROW(Cronograma!$D$8:$D$122)/(Cronograma!$D$8:$D$122=$C$7),5)),\"\")","v":"Camila Duarte"},{"$f":"IFERROR(INDEX(Cronograma!O:O,_xlfn.AGGREGATE(15,6,ROW(Cronograma!$D$8:$D$122)/(Cronograma!$D$8:$D$122=$C$7),5)),\"\")","v":"Concluída"},{"$nulls":30},{"$f":"IFERROR(INDEX(Cronograma!I:I,_xlfn.AGGREGATE(15,6,ROW(Cronograma!$D$8:$D$122)/(Cronograma!$D$8:$D$122=$C$7),5)),\"\")","v":"2024-03-21"},{"$f":"IFERROR(INDEX(Cronograma!J:J,_xlfn.AGGREGATE(15,6,ROW(Cronograma!$D$8:$D$122)/(Cronograma!$D$8:$D$122=$C$7),5)),\"\")","v":"2024-03-28"},{"$f":"IFERROR(INDEX(Cronograma!K:K,_xlfn.AGGREGATE(15,6,ROW(Cronograma!$D$8:$D$122)/(Cronograma!$D$8:$D$122=$C$7),5)),\"\")","v":"2024-03-21"},{"$f":"IFERROR(INDEX(Cronograma!L:L,_xlfn.AGGREGATE(15,6,ROW(Cronograma!$D$8:$D$122)/(Cronograma!$D$8:$D$122=$C$7),5)),\"\")","v":"2024-03-28"},{"$f":"IFERROR(INDEX(Cronograma!P:P,_xlfn.AGGREGATE(15,6,ROW(Cronograma!$D$8:$D$122)/(Cronograma!$D$8:$D$122=$C$7),5)),\"\")","v":1},{"$f":"IFERROR(INDEX(Cronograma!R:R,_xlfn.AGGREGATE(15,6,ROW(Cronograma!$D$8:$D$122)/(Cronograma!$D$8:$D$122=$C$7),5)),\"\")","v":0}]
[null,null,{"$f":"IFERROR(INDEX(Cronograma!C:C,_xlfn.AGGREGATE(15,6,ROW(Cronograma!$D$8:$D$122)/(Cronograma!$D$8:$D$122=$C$7),6)),\"\")","v":""},{"$f":"IFERROR(INDEX(Cronograma!E:E,_xlfn.AGGREGATE(15,6,ROW(Cronograma!$D$8:$D$122)/(Cronograma!$D$8:$D$122=$C$7),6)),\"\")","v":""},{"$f":"IFERROR(INDEX(Cronograma!F:F,_xlfn.AGGREGATE(15,6,ROW(Cronograma!$D$8:$D$122)/(Cronograma!$D$8:$D$122=$C$7),6)),\"\")","v":""},{"$f":"IFERROR(INDEX(Cronograma!G:G,_xlfn.AGGREGATE(15,6,ROW(Cronograma!$D$8:$D$122)/(Cronograma!$D$8:$D$122=$C$7),6)),\"\")","v":""},{"$f":"IFERROR(INDEX(Cronograma!H:H,_xlfn.AGGREGATE(15,6,ROW(Cronograma!$D$8:$D$122)/(Cronograma!$D$8:$D$122=$C$7),6)),\"\")","v":""},{"$f":"IFERROR(INDEX(Cronograma!O:O,_xlfn.AGGREGATE(15,6,ROW(Cronograma!$D$8:$D$122)/(Cronograma!$D$8:$D$122=$C$7),6)),\"\")","v":""},{"$nulls":30},{"$f":"IFERROR(INDEX(Cronograma!I:I,_xlfn.AGGREGATE(15,6,ROW(Cronograma!$D$8:$D$122)/(Cronograma!$D$8:$D$122=$C$7),6)),\"\")","v":""},{"$f":"IFERROR(INDEX(Cronograma!J:J,_xlfn.AGGREGATE(15,6,ROW(Cronograma!$D$8:$D$122)/(Cronograma!$D$8:$D$122=$C$7),6)),\"\")","v":""},{"$f":"IFERROR(INDEX(Cronograma!K:K,_xlfn.AGGREGATE(15,6,ROW(Cronograma!$D$8:$D$122)/(Cronograma!$D$8:$D$122=$C$7),6)),\"\")","v":""},{"$f":"IFERROR(INDEX(Cronograma!L:L,_xlfn.AGGREGATE(15,6,ROW(Cronograma!$D$8:$D$122)/(Cronograma!$D$8:$D$122=$C$7),6)),\"\")","v":""},{"$f":"IFERROR(INDEX(Cronograma!P:P,_xlfn.AGGREGATE(15,6,ROW(Cronograma!$D$8:$D$122)/(Cronograma!$D$8:$D$122=$C$7),6)),\"\")","v":""},{"$f":"IFERROR(INDEX(Cronograma!R:R,_xlfn.AGGREGATE(15,6,ROW(Cronograma!$D$8:$D$122)/(Cronograma!$D$8:$D$122=$C$7),6)),\"\")","v":""}]
[null,null,{"$f":"IFERROR(INDEX(Cronograma!C:C,_xlfn.AGGREGATE(15,6,ROW(Cronograma!$D$8:$D$122)/(Cronograma!$D$8:$D$122=$C$7),7)),\"\")","v":""},{"$f":"IFERROR(INDEX(Cronograma!E:E,_xlfn.AGGREGATE(15,6,ROW(Cronograma!$D$8:$D$122)/(Cronograma!$D$8:$D$122=$C$7),7)),\"\")","v":""},{"$f":"IFERROR(INDEX(Cronograma!F:F,_xlfn.AGGREGATE(15,6,ROW(Cronograma!$D$8:$D$122)/(Cronograma!$D$8:$D$122=$C$7),7)),\"\")","v":""},{"$f":"IFERROR(INDEX(Cronograma!G:G,_xlfn.AGGREGATE(15,6,ROW(Cronograma!$D$8:$D$122)/(Cronograma!$D$8:$D$122=$C$7),7)),\"\")","v":""},{"$f":"IFERROR(INDEX(Cronograma!H:H,_xlfn.AGGREGATE(15,6,ROW(Cronograma!$D$8:$D$122)/(Cronograma!$D$8:$D$122=$C$7),7)),\"\")","v":""},{"$f":"IFERROR(INDEX(Cronograma!O:O,_xlfn.AGGREGATE(15,6,ROW(Cronograma!$D$8:$D$122)/(Cronograma!$D$8:$D$122=$C$7),7)),\"\")","v":""},{"$nulls":30},{"$f":"IFERROR(INDEX(Cronograma!I:I,_xlfn.AGGREGATE(15,6,ROW(Cronograma!$D$8:$D$122)/(Cronograma!$D$8:$D$122=$C$7),7)),\"\")","v":""},{"$f":"IFERROR(INDEX(Cronograma!J:J,_xlfn.AGGREGATE(15,6,ROW(Cronograma!$D$8:$D$122)/(Cronograma!$D$8:$D$122=$C$7),7)),\"\")","v":""},{"$f":"IFERROR(INDEX(Cronograma!K:K,_xlfn.AGGREGATE(15,6,ROW(Cronograma!$D$8:$D$122)/(Cronograma!$D$8:$D$122=$C$7),7)),\"\")","v":""},{"$f":"IFERROR(INDEX(Cronograma!L:L,_xlfn.AGGREGATE(15,6,ROW(Cronograma!$D$8:$D$122)/(Cronograma!$D$8:$D$122=$C$7),7)),\"\")","v":""},{"$f":"IFERROR(INDEX(Cronograma!P:P,_xlfn.AGGREGATE(15,6,ROW(Cronograma!$D$8:$D$122)/(Cronograma!$D$8:$D$122=$C$7),7)),\"\")","v":""},{"$f":"IFERROR(INDEX(Cronograma!R:R,_xlfn.AGGREGATE(15,6,ROW(Cronograma!$D$8:$D$122)/(Cronograma!$D$8:$D$122=$C$7),7)),\"\")","v":""}]
[null,null,{"$f":"IFERROR(INDEX(Cronograma!C:C,_xlfn.AGGREGATE(15,6,ROW(Cronograma!$D$8:$D$122)/(Cronograma!$D$8:$D$122=$C$7),8)),\"\")","v":""},{"$f":"IFERROR(INDEX(Cronograma!E:E,_xlfn.AGGREGATE(15,6,ROW(Cronograma!$D$8:$D$122)/(Cronograma!$D$8:$D$122=$C$7),8)),\"\")","v":""},{"$f":"IFERROR(INDEX(Cronograma!F:F,_xlfn.AGGREGATE(15,6,ROW(Cronograma!$D$8:$D$122)/(Cronograma!$D$8:$D$122=$C$7),8)),\"\")","v":""},{"$f":"IFERROR(INDEX(Cronograma!G:G,_xlfn.AGGREGATE(15,6,ROW(Cronograma!$D$8:$D$122)/(Cronograma!$D$8:$D$122=$C$7),8)),\"\")","v":""},{"$f":"IFERROR(INDEX(Cronograma!H:H,_xlfn.AGGREGATE(15,6,ROW(Cronograma!$D$8:$D$122)/(Cronograma!$D$8:$D$122=$C$7),8)),\"\")","v":""},{"$f":"IFERROR(INDEX(Cronograma!O:O,_xlfn.AGGREGATE(15,6,ROW(Cronograma!$D$8:$D$122)/(Cronograma!$D$8:$D$122=$C$7),8)),\"\")","v":""},{"$nulls":30},{"$f":"IFERROR(INDEX(Cronograma!I:I,_xlfn.AGGREGATE(15,6,ROW(Cronograma!$D$8:$D$122)/(Cronograma!$D$8:$D$122=$C$7),8)),\"\")","v":""},{"$f":"IFERROR(INDEX(Cronograma!J:J,_xlfn.AGGREGATE(15,6,ROW(Cronograma!$D$8:$D$122)/(Cronograma!$D$8:$D$122=$C$7),8)),\"\")","v":""},{"$f":"IFERROR(INDEX(Cronograma!K:K,_xlfn.AGGREGATE(15,6,ROW(Cronograma!$D$8:$D$122)/(Cronograma!$D$8:$D$122=$C$7),8)),\"\")","v":""},{"$f":"IFERROR(INDEX(Cronograma!L:L,_xlfn.AGGREGATE(15,6,ROW(Cronograma!$D$8:$D$122)/(Cronograma!$D$8:$D$122=$C$7),8)),\"\")","v":""},{"$f":"IFERROR(INDEX(Cronograma!P:P,_xlfn.AGGREGATE(15,6,ROW(Cronograma!$D$8:$D$122)/(Cronograma!$D$8:$D$122=$C$7),8)),\"\")","v":""},{"$f":"IFERROR(INDEX(Cronograma!R:R,_xlfn.AGGREGATE(15,6,ROW(Cronograma!$D$8:$D$122)/(Cronograma!$D$8:$D$122=$C$7),8)),\"\")","v":""}]
[null,null,{"$f":"IFERROR(INDEX(Cronograma!C:C,_xlfn.AGGREGATE(15,6,ROW(Cronograma!$D$8:$D$122)/(Cronograma!$D$8:$D$122=$C$7),9)),\"\")","v":""},{"$f":"IFERROR(INDEX(Cronograma!E:E,_xlfn.AGGREGATE(15,6,ROW(Cronograma!$D$8:$D$122)/(Cronograma!$D$8:$D$122=$C$7),9)),\"\")","v":""},{"$f":"IFERROR(INDEX(Cronograma!F:F,_xlfn.AGGREGATE(15,6,ROW(Cronograma!$D$8:$D$122)/(Cronograma!$D$8:$D$122=$C$7),9)),\"\")","v":""},{"$f":"IFERROR(INDEX(Cronograma!G:G,_xlfn.AGGREGATE(15,6,ROW(Cronograma!$D$8:$D$122)/(Cronograma!$D$8:$D$122=$C$7),9)),\"\")","v":""},{"$f":"IFERROR(INDEX(Cronograma!H:H,_xlfn.AGGREGATE(15,6,ROW(Cronograma!$D$8:$D$122)/(Cronograma!$D$8:$D$122=$C$7),9)),\"\")","v":""},{"$f":"IFERROR(INDEX(Cronograma!O:O,_xlfn.AGGREGATE(15,6,ROW(Cronograma!$D$8:$D$122)/(Cronograma!$D$8:$D$122=$C$7),9)),\"\")","v":""},{"$nulls":30},{"$f":"IFERROR(INDEX(Cronograma!I:I,_xlfn.AGGREGATE(15,6,ROW(Cronograma!$D$8:$D$122)/(Cronograma!$D$8:$D$122=$C$7),9)),\"\")","v":""},{"$f":"IFERROR(INDEX(Cronograma!J:J,_xlfn.AGGREGATE(15,6,ROW(Cronograma!$D$8:$D$122)/(Cronograma!$D$8:$D$122=$C$7),9)),\"\")","v":""},{"$f":"IFERROR(INDEX(Cronograma!K:K,_xlfn.AGGREGATE(15,6,ROW(Cronograma!$D$8:$D$122)/(Cronograma!$D$8:$D$122=$C$7),9)),\"\")","v":""},{"$f":"IFERROR(INDEX(Cronograma!L:L,_xlfn.AGGREGATE(15,6,ROW(Cronograma!$D$8:$D$122)/(Cronograma!$D$8:$D$122=$C$7),9)),\"\")","v":""},{"$f":"IFERROR(INDEX(Cronograma!P:P,_xlfn.AGGREGATE(15,6,ROW(Cronograma!$D$8:$D$122)/(Cronograma!$D$8:$D$122=$C$7),9)),\"\")","v":""},{"$f":"IFERROR(INDEX(Cronograma!R:R,_xlfn.AGGREGATE(15,6,ROW(Cronograma!$D$8:$D$122)/(Cronograma!$D$8:$D$122=$C$7),9)),\"\")","v":""}]
[null,null,{"$f":"IFERROR(INDEX(Cronograma!C:C,_xlfn.AGGREGATE(15,6,ROW(Cronograma!$D$8:$D$122)/(Cronograma!$D$8:$D$122=$C$7),10)),\"\")","v":""},{"$f":"IFERROR(INDEX(Cronograma!E:E,_xlfn.AGGREGATE(15,6,ROW(Cronograma!$D$8:$D$122)/(Cronograma!$D$8:$D$122=$C$7),10)),\"\")","v":""},{"$f":"IFERROR(INDEX(Cronograma!F:F,_xlfn.AGGREGATE(15,6,ROW(Cronograma!$D$8:$D$122)/(Cronograma!$D$8:$D$122=$C$7),10)),\"\")","v":""},{"$f":"IFERROR(INDEX(Cronograma!G:G,_xlfn.AGGREGATE(15,6,ROW(Cronograma!$D$8:$D$122)/(Cronograma!$D$8:$D$122=$C$7),10)),\"\")","v":""},{"$f":"IFERROR(INDEX(Cronograma!H:H,_xlfn.AGGREGATE(15,6,ROW(Cronograma!$D$8:$D$122)/(Cronograma!$D$8:$D$122=$C$7),10)),\"\")","v":""},{"$f":"IFERROR(INDEX(Cronograma!O:O,_xlfn.AGGREGATE(15,6,ROW(Cronograma!$D$8:$D$122)/(Cronograma!$D$8:$D$122=$C$7),10)),\"\")","v":""},{"$nulls":30},{"$f":"IFERROR(INDEX(Cronograma!I:I,_xlfn.AGGREGATE(15,6,ROW(Cronograma!$D$8:$D$122)/(Cronograma!$D$8:$D$122=$C$7),10)),\"\")","v":""},{"$f":"IFERROR(INDEX(Cronograma!J:J,_xlfn.AGGREGATE(15,6,ROW(Cronograma!$D$8:$D$122)/(Cronograma!$D$8:$D$122=$C$7),10)),\"\")","v":""},{"$f":"IFERROR(INDEX(Cronograma!K:K,_xlfn.AGGREGATE(15,6,ROW(Cronograma!$D$8:$D$122)/(Cronograma!$D$8:$D$122=$C$7),10)),\"\")","v":""},{"$f":"IFERROR(INDEX(Cronograma!L:L,_xlfn.AGGREGATE(15,6,ROW(Cronograma!$D$8:$D$122)/(Cronograma!$D$8:$D$122=$C$7),10)),\"\")","v":""},{"$f":"IFERROR(INDEX(Cronograma!P:P,_xlfn.AGGREGATE(15,6,ROW(Cronograma!$D$8:$D$122)/(Cronograma!$D$8:$D$122=$C$7),10)),\"\")","v":""},{"$f":"IFERROR(INDEX(Cronograma!R:R,_xlfn.AGGREGATE(15,6,ROW(Cronograma!$D$8:$D$122)/(Cronograma!$D$8:$D$122=$C$7),10)),\"\")","v":""}]
[null,null,{"$f":"IFERROR(INDEX(Cronograma!C:C,_xlfn.AGGREGATE(15,6,ROW(Cronograma!$D$8:$D$122)/(Cronograma!$D$8:$D$122=$C$7),11)),\"\")","v":""},{"$f":"IFERROR(INDEX(Cronograma!E:E,_xlfn.AGGREGATE(15,6,ROW(Cronograma!$D$8:$D$122)/(Cronograma!$D$8:$D$122=$C$7),11)),\"\")","v":""},{"$f":"IFERROR(INDEX(Cronograma!F:F,_xlfn.AGGREGATE(15,6,ROW(Cronograma!$D$8:$D$122)/(Cronograma!$D$8:$D$122=$C$7),11)),\"\")","v":""},{"$f":"IFERROR(INDEX(Cronograma!G:G,_xlfn.AGGREGATE(15,6,ROW(Cronograma!$D$8:$D$122)/(Cronograma!$D$8:$D$122=$C$7),11)),\"\")","v":""},{"$f":"IFERROR(INDEX(Cronograma!H:H,_xlfn.AGGREGATE(15,6,ROW(Cronograma!$D$8:$D$122)/(Cronograma!$D$8:$D$122=$C$7),11)),\"\")","v":""},{"$f":"IFERROR(INDEX(Cronograma!O:O,_xlfn.AGGREGATE(15,6,ROW(Cronograma!$D$8:$D$122)/(Cronograma!$D$8:$D$122=$C$7),11)),\"\")","v":""},{"$nulls":30},{"$f":"IFERROR(INDEX(Cronograma!I:I,_xlfn.AGGREGATE(15,6,ROW(Cronograma!$D$8:$D$122)/(Cronograma!$D$8:$D$122=$C$7),11)),\"\")","v":""},{"$f":"IFERROR(INDEX(Cronograma!J:J,_xlfn.AGGREGATE(15,6,ROW(Cronograma!$D$8:$D$122)/(Cronograma!$D$8:$D$122=$C$7),11)),\"\")","v":""},{"$f":"IFERROR(INDEX(Cronograma!K:K,_xlfn.AGGREGATE(15,6,ROW(Cronograma!$D$8:$D$122)/(Cronograma!$D$8:$D$122=$C$7),11)),\"\")","v":""},{"$f":"IFERROR(INDEX(Cronograma!L:L,_xlfn.AGGREGATE(15,6,ROW(Cronograma!$D$8:$D$122)/(Cronograma!$D$8:$D$122=$C$7),11)),\"\")","v":""},{"$f":"IFERROR(INDEX(Cronograma!P:P,_xlfn.AGGREGATE(15,6,ROW(Cronograma!$D$8:$D$122)/(Cronograma!$D$8:$D$122=$C$7),11)),\"\")","v":""},{"$f":"IFERROR(INDEX(Cronograma!R:R,_xlfn.AGGREGATE(15,6,ROW(Cronograma!$D$8:$D$122)/(Cronograma!$D$8:$D$122=$C$7),11)),\"\")","v":""}]
[null,null,{"$f":"IFERROR(INDEX(Cronograma!C:C,_xlfn.AGGREGATE(15,6,ROW(Cronograma!$D$8:$D$122)/(Cronograma!$D$8:$D$122=$C$7),12)),\"\")","v":""},{"$f":"IFERROR(INDEX(Cronograma!E:E,_xlfn.AGGREGATE(15,6,ROW(Cronograma!$D$8:$D$122)/(Cronograma!$D$8:$D$122=$C$7),12)),\"\")","v":""},{"$f":"IFERROR(INDEX(Cronograma!F:F,_xlfn.AGGREGATE(15,6,ROW(Cronograma!$D$8:$D$122)/(Cronograma!$D$8:$D$122=$C$7),12)),\"\")","v":""},{"$f":"IFERROR(INDEX(Cronograma!G:G,_xlfn.AGGREGATE(15,6,ROW(Cronograma!$D$8:$D$122)/(Cronograma!$D$8:$D$122=$C$7),12)),\"\")","v":""},{"$f":"IFERROR(INDEX(Cronograma!H:H,_xlfn.AGGREGATE(15,6,ROW(Cronograma!$D$8:$D$122)/(Cronograma!$D$8:$D$122=$C$7),12)),\"\")","v":""},{"$f":"IFERROR(INDEX(Cronograma!O:O,_xlfn.AGGREGATE(15,6,ROW(Cronograma!$D$8:$D$122)/(Cronograma!$D$8:$D$122=$C$7),12)),\"\")","v":""},{"$nulls":30},{"$f":"IFERROR(INDEX(Cronograma!I:I,_xlfn.AGGREGATE(15,6,ROW(Cronograma!$D$8:$D$122)/(Cronograma!$D$8:$D$122=$C$7),12)),\"\")","v":""},{"$f":"IFERROR(INDEX(Cronograma!J:J,_xlfn.AGGREGATE(15,6,ROW(Cronograma!$D$8:$D$122)/(Cronograma!$D$8:$D$122=$C$7),12)),\"\")","v":""},{"$f":"IFERROR(INDEX(Cronograma!K:K,_xlfn.AGGREGATE(15,6,ROW(Cronograma!$D$8:$D$122)/(Cronograma!$D$8:$D$122=$C$7),12)),\"\")","v":""},{"$f":"IFERROR(INDEX(Cronograma!L:L,_xlfn.AGGREGATE(15,6,ROW(Cronograma!$D$8:$D$122)/(Cronograma!$D$8:$D$122=$C$7),12)),\"\")","v":""},{"$f":"IFERROR(INDEX(Cronograma!P:P,_xlfn.AGGREGATE(15,6,ROW(Cronograma!$D$8:$D$122)/(Cronograma!$D$8:$D$122=$C$7),12)),\"\")","v":""},{"$f":"IFERROR(INDEX(Cronograma!R:R,_xlfn.AGGREGATE(15,6,ROW(Cronograma!$D$8:$D$122)/(Cronograma!$D$8:$D$122=$C$7),12)),\"\")","v":""}]
[null,null,{"$f":"IFERROR(INDEX(Cronograma!C:C,_xlfn.AGGREGATE(15,6,ROW(Cronograma!$D$8:$D$122)/(Cronograma!$D$8:$D$122=$C$7),13)),\"\")","v":""},{"$f":"IFERROR(INDEX(Cronograma!E:E,_xlfn.AGGREGATE(15,6,ROW(Cronograma!$D$8:$D$122)/(Cronograma!$D$8:$D$122=$C$7),13)),\"\")","v":""},{"$f":"IFERROR(INDEX(Cronograma!F:F,_xlfn.AGGREGATE(15,6,ROW(Cronograma!$D$8:$D$122)/(Cronograma!$D$8:$D$122=$C$7),13)),\"\")","v":""},{"$f":"IFERROR(INDEX(Cronograma!G:G,_xlfn.AGGREGATE(15,6,ROW(Cronograma!$D$8:$D$122)/(Cronograma!$D$8:$D$122=$C$7),13)),\"\")","v":""},{"$f":"IFERROR(INDEX(Cronograma!H:H,_xlfn.AGGREGATE(15,6,ROW(Cronograma!$D$8:$D$122)/(Cronograma!$D$8:$D$122=$C$7),13)),\"\")","v":""},{"$f":"IFERROR(INDEX(Cronograma!O:O,_xlfn.AGGREGATE(15,6,ROW(Cronograma!$D$8:$D$122)/(Cronograma!$D$8:$D$122=$C$7),13)),\"\")","v":""},{"$nulls":30},{"$f":"IFERROR(INDEX(Cronograma!I:I,_xlfn.AGGREGATE(15,6,ROW(Cronograma!$D$8:$D$122)/(Cronograma!$D$8:$D$122=$C$7),13)),\"\")","v":""},{"$f":"IFERROR(INDEX(Cronograma!J:J,_xlfn.AGGREGATE(15,6,ROW(Cronograma!$D$8:$D$122)/(Cronograma!$D$8:$D$122=$C$7),13)),\"\")","v":""},{"$f":"IFERROR(INDEX(Cronograma!K:K,_xlfn.AGGREGATE(15,6,ROW(Cronograma!$D$8:$D$122)/(Cronograma!$D$8:$D$122=$C$7),13)),\"\")","v":""},{"$f":"IFERROR(INDEX(Cronograma!L:L,_xlfn.AGGREGATE(15,6,ROW(Cronograma!$D$8:$D$122)/(Cronograma!$D$8:$D$122=$C$7),13)),\"\")","v":""},{"$f":"IFERROR(INDEX(Cronograma!P:P,_xlfn.AGGREGATE(15,6,ROW(Cronograma!$D$8:$D$122)/(Cronograma!$D$8:$D$122=$C$7),13)),\"\")","v":""},{"$f":"IFERROR(INDEX(Cronograma!R:R,_xlfn.AGGREGATE(15,6,ROW(Cronograma!$D$8:$D$122)/(Cronograma!$D$8:$D$122=$C$7),13)),\"\")","v":""}]
[null,null,{"$f":"IFERROR(INDEX(Cronograma!C:C,_xlfn.AGGREGATE(15,6,ROW(Cronograma!$D$8:$D$122)/(Cronograma!$D$8:$D$122=$C$7),14)),\"\")","v":""},{"$f":"IFERROR(INDEX(Cronograma!E:E,_xlfn.AGGREGATE(15,6,ROW(Cronograma!$D$8:$D$122)/(Cronograma!$D$8:$D$122=$C$7),14)),\"\")","v":""},{"$f":"IFERROR(INDEX(Cronograma!F:F,_xlfn.AGGREGATE(15,6,ROW(Cronograma!$D$8:$D$122)/(Cronograma!$D$8:$D$122=$C$7),14)),\"\")","v":""},{"$f":"IFERROR(INDEX(Cronograma!G:G,_xlfn.AGGREGATE(15,6,ROW(Cronograma!$D$8:$D$122)/(Cronograma!$D$8:$D$122=$C$7),14)),\"\")","v":""},{"$f":"IFERROR(INDEX(Cronograma!H:H,_xlfn.AGGREGATE(15,6,ROW(Cronograma!$D$8:$D$122)/(Cronograma!$D$8:$D$122=$C$7),14)),\"\")","v":""},{"$f":"IFERROR(INDEX(Cronograma!O:O,_xlfn.AGGREGATE(15,6,ROW(Cronograma!$D$8:$D$122)/(Cronograma!$D$8:$D$122=$C$7),14)),\"\")","v":""},{"$nulls":30},{"$f":"IFERROR(INDEX(Cronograma!I:I,_xlfn.AGGREGATE(15,6,ROW(Cronograma!$D$8:$D$122)/(Cronograma!$D$8:$D$122=$C$7),14)),\"\")","v":""},{"$f":"IFERROR(INDEX(Cronograma!J:J,_xlfn.AGGREGATE(15,6,ROW(Cronograma!$D$8:$D$122)/(Cronograma!$D$8:$D$122=$C$7),14)),\"\")","v":""},{"$f":"IFERROR(INDEX(Cronograma!K:K,_xlfn.AGGREGATE(15,6,ROW(Cronograma!$D$8:$D$122)/(Cronograma!$D$8:$D$122=$C$7),14)),\"\")","v":""},{"$f":"IFERROR(INDEX(Cronograma!L:L,_xlfn.AGGREGATE(15,6,ROW(Cronograma!$D$8:$D$122)/(Cronograma!$D$8:$D$122=$C$7),14)),\"\")","v":""},{"$f":"IFERROR(INDEX(Cronograma!P:P,_xlfn.AGGREGATE(15,6,ROW(Cronograma!$D$8:$D$122)/(Cronograma!$D$8:$D$122=$C$7),14)),\"\")","v":""},{"$f":"IFERROR(INDEX(Cronograma!R:R,_xlfn.AGGREGATE(15,6,ROW(Cronograma!$D$8:$D$122)/(Cronograma!$D$8:$D$122=$C$7),14)),\"\")","v":""}]
[null,null,{"$f":"IFERROR(INDEX(Cronograma!C:C,_xlfn.AGGREGATE(15,6,ROW(Cronograma!$D$8:$D$122)/(Cronograma!$D$8:$D$122=$C$7),15)),\"\")","v":""},{"$f":"IFERROR(INDEX(Cronograma!E:E,_xlfn.AGGREGATE(15,6,ROW(Cronograma!$D$8:$D$122)/(Cronograma!$D$8:$D$122=$C$7),15)),\"\")","v":""},{"$f":"IFERROR(INDEX(Cronograma!F:F,_xlfn.AGGREGATE(15,6,ROW(Cronograma!$D$8:$D$122)/(Cronograma!$D$8:$D$122=$C$7),15)),\"\")","v":""},{"$f":"IFERROR(INDEX(Cronograma!G:G,_xlfn.AGGREGATE(15,6,ROW(Cronograma!$D$8:$D$122)/(Cronograma!$D$8:$D$122=$C$7),15)),\"\")","v":""},{"$f":"IFERROR(INDEX(Cronograma!H:H,_xlfn.AGGREGATE(15,6,ROW(Cronograma!$D$8:$D$122)/(Cronograma!$D$8:$D$122=$C$7),15)),\"\")","v":""},{"$f":"IFERROR(INDEX(Cronograma!O:O,_xlfn.AGGREGATE(15,6,ROW(Cronograma!$D$8:$D$122)/(Cronograma!$D$8:$D$122=$C$7),15)),\"\")","v":""},{"$nulls":30},{"$f":"IFERROR(INDEX(Cronograma!I:I,_xlfn.AGGREGATE(15,6,ROW(Cronograma!$D$8:$D$122)/(Cronograma!$D$8:$D$122=$C$7),15)),\"\")","v":""},{"$f":"IFERROR(INDEX(Cronograma!J:J,_xlfn.AGGREGATE(15,6,ROW(Cronograma!$D$8:$D$122)/(Cronograma!$D$8:$D$122=$C$7),15)),\"\")","v":""},{"$f":"IFERROR(INDEX(Cronograma!K:K,_xlfn.AGGREGATE(15,6,ROW(Cronograma!$D$8:$D$122)/(Cronograma!$D$8:$D$122=$C$7),15)),\"\")","v":""},{"$f":"IFERROR(INDEX(Cronograma!L:L,_xlfn.AGGREGATE(15,6,ROW(Cronograma!$D$8:$D$122)/(Cronograma!$D$8:$D$122=$C$7),15)),\"\")","v":""},{"$f":"IFERROR(INDEX(Cronograma!P:P,_xlfn.AGGREGATE(15,6,ROW(Cronograma!$D$8:$D$122)/(Cronograma!$D$8:$D$122=$C$7),15)),\"\")","v":""},{"$f":"IFERROR(INDEX(Cronograma!R:R,_xlfn.AGGREGATE(15,6,ROW(Cronograma!$D$8:$D$122)/(Cronograma!$D$8:$D$122=$C$7),15)),\"\")","v":""}]
[null,null,{"$f":"IFERROR(INDEX(Cronograma!C:C,_xlfn.AGGREGATE(15,6,ROW(Cronograma!$D$8:$D$122)/(Cronograma!$D$8:$D$122=$C$7),16)),\"\")","v":""},{"$f":"IFERROR(INDEX(Cronograma!E:E,_xlfn.AGGREGATE(15,6,ROW(Cronograma!$D$8:$D$122)/(Cronograma!$D$8:$D$122=$C$7),16)),\"\")","v":""},{"$f":"IFERROR(INDEX(Cronograma!F:F,_xlfn.AGGREGATE(15,6,ROW(Cronograma!$D$8:$D$122)/(Cronograma!$D$8:$D$122=$C$7),16)),\"\")","v":""},{"$f":"IFERROR(INDEX(Cronograma!G:G,_xlfn.AGGREGATE(15,6,ROW(Cronograma!$D$8:$D$122)/(Cronograma!$D$8:$D$122=$C$7),16)),\"\")","v":""},{"$f":"IFERROR(INDEX(Cronograma!H:H,_xlfn.AGGREGATE(15,6,ROW(Cronograma!$D$8:$D$122)/(Cronograma!$D$8:$D$122=$C$7),16)),\"\")","v":""},{"$f":"IFERROR(INDEX(Cronograma!O:O,_xlfn.AGGREGATE(15,6,ROW(Cronograma!$D$8:$D$122)/(Cronograma!$D$8:$D$122=$C$7),16)),\"\")","v":""},{"$nulls":30},{"$f":"IFERROR(INDEX(Cronograma!I:I,_xlfn.AGGREGATE(15,6,ROW(Cronograma!$D$8:$D$122)/(Cronograma!$D$8:$D$122=$C$7),16)),\"\")","v":""},{"$f":"IFERROR(INDEX(Cronograma!J:J,_xlfn.AGGREGATE(15,6,ROW(Cronograma!$D$8:$D$122)/(Cronograma!$D$8:$D$122=$C$7),16)),\"\")","v":""},{"$f":"IFERROR(INDEX(Cronograma!K:K,_xlfn.AGGREGATE(15,6,ROW(Cronograma!$D$8:$D$122)/(Cronograma!$D$8:$D$122=$C$7),16)),\"\")","v":""},{"$f":"IFERROR(INDEX(Cronograma!L:L,_xlfn.AGGREGATE(15,6,ROW(Cronograma!$D$8:$D$122)/(Cronograma!$D$8:$D$122=$C$7),16)),\"\")","v":""},{"$f":"IFERROR(INDEX(Cronograma!P:P,_xlfn.AGGREGATE(15,6,ROW(Cronograma!$D$8:$D$122)/(Cronograma!$D$8:$D$122=$C$7),16)),\"\")","v":""},{"$f":"IFERROR(INDEX(Cronograma!R:R,_xlfn.AGGREGATE(15,6,ROW(Cronograma!$D$8:$D$122)/(Cronograma!$D$8:$D$122=$C$7),16)),\"\")","v":""}]
[null,null,{"$f":"IFERROR(INDEX(Cronograma!C:C,_xlfn.AGGREGATE(15,6,ROW(Cronograma!$D$8:$D$122)/(Cronograma!$D$8:$D$122=$C$7),17)),\"\")","v":""},{"$f":"IFERROR(INDEX(Cronograma!E:E,_xlfn.AGGREGATE(15,6,ROW(Cronograma!$D$8:$D$122)/(Cronograma!$D$8:$D$122=$C$7),17)),\"\")","v":""},{"$f":"IFERROR(INDEX(Cronograma!F:F,_xlfn.AGGREGATE(15,6,ROW(Cronograma!$D$8:$D$122)/(Cronograma!$D$8:$D$122=$C$7),17)),\"\")","v":""},{"$f":"IFERROR(INDEX(Cronograma!G:G,_xlfn.AGGREGATE(15,6,ROW(Cronograma!$D$8:$D$122)/(Cronograma!$D$8:$D$122=$C$7),17)),\"\")","v":""},{"$f":"IFERROR(INDEX(Cronograma!H:H,_xlfn.AGGREGATE(15,6,ROW(Cronograma!$D$8:$D$122)/(Cronograma!$D$8:$D$122=$C$7),17)),\"\")","v":""},{"$f":"IFERROR(INDEX(Cronograma!O:O,_xlfn.AGGREGATE(15,6,ROW(Cronograma!$D$8:$D$122)/(Cronograma!$D$8:$D$122=$C$7),17)),\"\")","v":""},{"$nulls":30},{"$f":"IFERROR(INDEX(Cronograma!I:I,_xlfn.AGGREGATE(15,6,ROW(Cronograma!$D$8:$D$122)/(Cronograma!$D$8:$D$122=$C$7),17)),\"\")","v":""},{"$f":"IFERROR(INDEX(Cronograma!J:J,_xlfn.AGGREGATE(15,6,ROW(Cronograma!$D$8:$D$122)/(Cronograma!$D$8:$D$122=$C$7),17)),\"\")","v":""},{"$f":"IFERROR(INDEX(Cronograma!K:K,_xlfn.AGGREGATE(15,6,ROW(Cronograma!$D$8:$D$122)/(Cronograma!$D$8:$D$122=$C$7),17)),\"\")","v":""},{"$f":"IFERROR(INDEX(Cronograma!L:L,_xlfn.AGGREGATE(15,6,ROW(Cronograma!$D$8:$D$122)/(Cronograma!$D$8:$D$122=$C$7),17)),\"\")","v":""},{"$f":"IFERROR(INDEX(Cronograma!P:P,_xlfn.AGGREGATE(15,6,ROW(Cronograma!$D$8:$D$122)/(Cronograma!$D$8:$D$122=$C$7),17)),\"\")","v":""},{"$f":"IFERROR(INDEX(Cronograma!R:R,_xlfn.AGGREGATE(15,6,ROW(Cronograma!$D$8:$D$122)/(Cronograma!$D$8:$D$122=$C$7),17)),\"\")","v":""}]
[null,null,{"$f":"IFERROR(INDEX(Cronograma!C:C,_xlfn.AGGREGATE(15,6,ROW(Cronograma!$D$8:$D$122)/(Cronograma!$D$8:$D$122=$C$7),18)),\"\")","v":""},{"$f":"IFERROR(INDEX(Cronograma!E:E,_xlfn.AGGREGATE(15,6,ROW(Cronograma!$D$8:$D$122)/(Cronograma!$D$8:$D$122=$C$7),18)),\"\")","v":""},{"$f":"IFERROR(INDEX(Cronograma!F:F,_xlfn.AGGREGATE(15,6,ROW(Cronograma!$D$8:$D$122)/(Cronograma!$D$8:$D$122=$C$7),18)),\"\")","v":""},{"$f":"IFERROR(INDEX(Cronograma!G:G,_xlfn.AGGREGATE(15,6,ROW(Cronograma!$D$8:$D$122)/(Cronograma!$D$8:$D$122=$C$7),18)),\"\")","v":""},{"$f":"IFERROR(INDEX(Cronograma!H:H,_xlfn.AGGREGATE(15,6,ROW(Cronograma!$D$8:$D$122)/(Cronograma!$D$8:$D$122=$C$7),18)),\"\")","v":""},{"$f":"IFERROR(INDEX(Cronograma!O:O,_xlfn.AGGREGATE(15,6,ROW(Cronograma!$D$8:$D$122)/(Cronograma!$D$8:$D$122=$C$7),18)),\"\")","v":""},{"$nulls":30},{"$f":"IFERROR(INDEX(Cronograma!I:I,_xlfn.AGGREGATE(15,6,ROW(Cronograma!$D$8:$D$122)/(Cronograma!$D$8:$D$122=$C$7),18)),\"\")","v":""},{"$f":"IFERROR(INDEX(Cronograma!J:J,_xlfn.AGGREGATE(15,6,ROW(Cronograma!$D$8:$D$122)/(Cronograma!$D$8:$D$122=$C$7),18)),\"\")","v":""},{"$f":"IFERROR(INDEX(Cronograma!K:K,_xlfn.AGGREGATE(15,6,ROW(Cronograma!$D$8:$D$122)/(Cronograma!$D$8:$D$122=$C$7),18)),\"\")","v":""},{"$f":"IFERROR(INDEX(Cronograma!L:L,_xlfn.AGGREGATE(15,6,ROW(Cronograma!$D$8:$D$122)/(Cronograma!$D$8:$D$122=$C$7),18)),\"\")","v":""},{"$f":"IFERROR(INDEX(Cronograma!P:P,_xlfn.AGGREGATE(15,6,ROW(Cronograma!$D$8:$D$122)/(Cronograma!$D$8:$D$122=$C$7),18)),\"\")","v":""},{"$f":"IFERROR(INDEX(Cronograma!R:R,_xlfn.AGGREGATE(15,6,ROW(Cronograma!$D$8:$D$122)/(Cronograma!$D$8:$D$122=$C$7),18)),\"\")","v":""}]
[null,null,{"$f":"IFERROR(INDEX(Cronograma!C:C,_xlfn.AGGREGATE(15,6,ROW(Cronograma!$D$8:$D$122)/(Cronograma!$D$8:$D$122=$C$7),19)),\"\")","v":""},{"$f":"IFERROR(INDEX(Cronograma!E:E,_xlfn.AGGREGATE(15,6,ROW(Cronograma!$D$8:$D$122)/(Cronograma!$D$8:$D$122=$C$7),19)),\"\")","v":""},{"$f":"IFERROR(INDEX(Cronograma!F:F,_xlfn.AGGREGATE(15,6,ROW(Cronograma!$D$8:$D$122)/(Cronograma!$D$8:$D$122=$C$7),19)),\"\")","v":""},{"$f":"IFERROR(INDEX(Cronograma!G:G,_xlfn.AGGREGATE(15,6,ROW(Cronograma!$D$8:$D$122)/(Cronograma!$D$8:$D$122=$C$7),19)),\"\")","v":""},{"$f":"IFERROR(INDEX(Cronograma!H:H,_xlfn.AGGREGATE(15,6,ROW(Cronograma!$D$8:$D$122)/(Cronograma!$D$8:$D$122=$C$7),19)),\"\")","v":""},{"$f":"IFERROR(INDEX(Cronograma!O:O,_xlfn.AGGREGATE(15,6,ROW(Cronograma!$D$8:$D$122)/(Cronograma!$D$8:$D$122=$C$7),19)),\"\")","v":""},{"$nulls":30},{"$f":"IFERROR(INDEX(Cronograma!I:I,_xlfn.AGGREGATE(15,6,ROW(Cronograma!$D$8:$D$122)/(Cronograma!$D$8:$D$122=$C$7),19)),\"\")","v":""},{"$f":"IFERROR(INDEX(Cronograma!J:J,_xlfn.AGGREGATE(15,6,ROW(Cronograma!$D$8:$D$122)/(Cronograma!$D$8:$D$122=$C$7),19)),\"\")","v":""},{"$f":"IFERROR(INDEX(Cronograma!K:K,_xlfn.AGGREGATE(15,6,ROW(Cronograma!$D$8:$D$122)/(Cronograma!$D$8:$D$122=$C$7),19)),\"\")","v":""},{"$f":"IFERROR(INDEX(Cronograma!L:L,_xlfn.AGGREGATE(15,6,ROW(Cronograma!$D$8:$D$122)/(Cronograma!$D$8:$D$122=$C$7),19)),\"\")","v":""},{"$f":"IFERROR(INDEX(Cronograma!P:P,_xlfn.AGGREGATE(15,6,ROW(Cronograma!$D$8:$D$122)/(Cronograma!$D$8:$D$122=$C$7),19)),\"\")","v":""},{"$f":"IFERROR(INDEX(Cronograma!R:R,_xlfn.AGGREGATE(15,6,ROW(Cronograma!$D$8:$D$122)/(Cronograma!$D$8:$D$122=$C$7),19)),\"\")","v":""}]
[null,null,{"$f":"IFERROR(INDEX(Cronograma!C:C,_xlfn.AGGREGATE(15,6,ROW(Cronograma!$D$8:$D$122)/(Cronograma!$D$8:$D$122=$C$7),20)),\"\")","v":""},{"$f":"IFERROR(INDEX(Cronograma!E:E,_xlfn.AGGREGATE(15,6,ROW(Cronograma!$D$8:$D$122)/(Cronograma!$D$8:$D$122=$C$7),20)),\"\")","v":""},{"$f":"IFERROR(INDEX(Cronograma!F:F,_xlfn.AGGREGATE(15,6,ROW(Cronograma!$D$8:$D$122)/(Cronograma!$D$8:$D$122=$C$7),20)),\"\")","v":""},{"$f":"IFERROR(INDEX(Cronograma!G:G,_xlfn.AGGREGATE(15,6,ROW(Cronograma!$D$8:$D$122)/(Cronograma!$D$8:$D$122=$C$7),20)),\"\")","v":""},{"$f":"IFERROR(INDEX(Cronograma!H:H,_xlfn.AGGREGATE(15,6,ROW(Cronograma!$D$8:$D$122)/(Cronograma!$D$8:$D$122=$C$7),20)),\"\")","v":""},{"$f":"IFERROR(INDEX(Cronograma!O:O,_xlfn.AGGREGATE(15,6,ROW(Cronograma!$D$8:$D$122)/(Cronograma!$D$8:$D$122=$C$7),20)),\"\")","v":""},{"$nulls":30},{"$f":"IFERROR(INDEX(Cronograma!I:I,_xlfn.AGGREGATE(15,6,ROW(Cronograma!$D$8:$D$122)/(Cronograma!$D$8:$D$122=$C$7),20)),\"\")","v":""},{"$f":"IFERROR(INDEX(Cronograma!J:J,_xlfn.AGGREGATE(15,6,ROW(Cronograma!$D$8:$D$122)/(Cronograma!$D$8:$D$122=$C$7),20)),\"\")","v":""},{"$f":"IFERROR(INDEX(Cronograma!K:K,_xlfn.AGGREGATE(15,6,ROW(Cronograma!$D$8:$D$122)/(Cronograma!$D$8:$D$122=$C$7),20)),\"\")","v":""},{"$f":"IFERROR(INDEX(Cronograma!L:L,_xlfn.AGGREGATE(15,6,ROW(Cronograma!$D$8:$D$122)/(Cronograma!$D$8:$D$122=$C$7),20)),\"\")","v":""},{"$f":"IFERROR(INDEX(Cronograma!P:P,_xlfn.AGGREGATE(15,6,ROW(Cronograma!$D$8:$D$122)/(Cronograma!$D$8:$D$122=$C$7),20)),\"\")","v":""},{"$f":"IFERROR(INDEX(Cronograma!R:R,_xlfn.AGGREGATE(15,6,ROW(Cronograma!$D$8:$D$122)/(Cronograma!$D$8:$D$122=$C$7),20)),\"\")","v":""}]
[null,null,{"$f":"IFERROR(INDEX(Cronograma!C:C,_xlfn.AGGREGATE(15,6,ROW(Cronograma!$D$8:$D$122)/(Cronograma!$D$8:$D$122=$C$7),21)),\"\")","v":""},{"$f":"IFERROR(INDEX(Cronograma!E:E,_xlfn.AGGREGATE(15,6,ROW(Cronograma!$D$8:$D$122)/(Cronograma!$D$8:$D$122=$C$7),21)),\"\")","v":""},{"$f":"IFERROR(INDEX(Cronograma!F:F,_xlfn.AGGREGATE(15,6,ROW(Cronograma!$D$8:$D$122)/(Cronograma!$D$8:$D$122=$C$7),21)),\"\")","v":""},{"$f":"IFERROR(INDEX(Cronograma!G:G,_xlfn.AGGREGATE(15,6,ROW(Cronograma!$D$8:$D$122)/(Cronograma!$D$8:$D$122=$C$7),21)),\"\")","v":""},{"$f":"IFERROR(INDEX(Cronograma!H:H,_xlfn.AGGREGATE(15,6,ROW(Cronograma!$D$8:$D$122)/(Cronograma!$D$8:$D$122=$C$7),21)),\"\")","v":""},{"$f":"IFERROR(INDEX(Cronograma!O:O,_xlfn.AGGREGATE(15,6,ROW(Cronograma!$D$8:$D$122)/(Cronograma!$D$8:$D$122=$C$7),21)),\"\")","v":""},{"$nulls":30},{"$f":"IFERROR(INDEX(Cronograma!I:I,_xlfn.AGGREGATE(15,6,ROW(Cronograma!$D$8:$D$122)/(Cronograma!$D$8:$D$122=$C$7),21)),\"\")","v":""},{"$f":"IFERROR(INDEX(Cronograma!J:J,_xlfn.AGGREGATE(15,6,ROW(Cronograma!$D$8:$D$122)/(Cronograma!$D$8:$D$122=$C$7),21)),\"\")","v":""},{"$f":"IFERROR(INDEX(Cronograma!K:K,_xlfn.AGGREGATE(15,6,ROW(Cronograma!$D$8:$D$122)/(Cronograma!$D$8:$D$122=$C$7),21)),\"\")","v":""},{"$f":"IFERROR(INDEX(Cronograma!L:L,_xlfn.AGGREGATE(15,6,ROW(Cronograma!$D$8:$D$122)/(Cronograma!$D$8:$D$122=$C$7),21)),\"\")","v":""},{"$f":"IFERROR(INDEX(Cronograma!P:P,_xlfn.AGGREGATE(15,6,ROW(Cronograma!$D$8:$D$122)/(Cronograma!$D$8:$D$122=$C$7),21)),\"\")","v":""},{"$f":"IFERROR(INDEX(Cronograma!R:R,_xlfn.AGGREGATE(15,6,ROW(Cronograma!$D$8:$D$122)/(Cronograma!$D$8:$D$122=$C$7),21)),\"\")","v":""}]
[null,null,{"$f":"IFERROR(INDEX(Cronograma!C:C,_xlfn.AGGREGATE(15,6,ROW(Cronograma!$D$8:$D$122)/(Cronograma!$D$8:$D$122=$C$7),22)),\"\")","v":""},{"$f":"IFERROR(INDEX(Cronograma!E:E,_xlfn.AGGREGATE(15,6,ROW(Cronograma!$D$8:$D$122)/(Cronograma!$D$8:$D$122=$C$7),22)),\"\")","v":""},{"$f":"IFERROR(INDEX(Cronograma!F:F,_xlfn.AGGREGATE(15,6,ROW(Cronograma!$D$8:$D$122)/(Cronograma!$D$8:$D$122=$C$7),22)),\"\")","v":""},{"$f":"IFERROR(INDEX(Cronograma!G:G,_xlfn.AGGREGATE(15,6,ROW(Cronograma!$D$8:$D$122)/(Cronograma!$D$8:$D$122=$C$7),22)),\"\")","v":""},{"$f":"IFERROR(INDEX(Cronograma!H:H,_xlfn.AGGREGATE(15,6,ROW(Cronograma!$D$8:$D$122)/(Cronograma!$D$8:$D$122=$C$7),22)),\"\")","v":""},{"$f":"IFERROR(INDEX(Cronograma!O:O,_xlfn.AGGREGATE(15,6,ROW(Cronograma!$D$8:$D$122)/(Cronograma!$D$8:$D$122=$C$7),22)),\"\")","v":""},{"$nulls":30},{"$f":"IFERROR(INDEX(Cronograma!I:I,_xlfn.AGGREGATE(15,6,ROW(Cronograma!$D$8:$D$122)/(Cronograma!$D$8:$D$122=$C$7),22)),\"\")","v":""},{"$f":"IFERROR(INDEX(Cronograma!J:J,_xlfn.AGGREGATE(15,6,ROW(Cronograma!$D$8:$D$122)/(Cronograma!$D$8:$D$122=$C$7),22)),\"\")","v":""},{"$f":"IFERROR(INDEX(Cronograma!K:K,_xlfn.AGGREGATE(15,6,ROW(Cronograma!$D$8:$D$122)/(Cronograma!$D$8:$D$122=$C$7),22)),\"\")","v":""},{"$f":"IFERROR(INDEX(Cronograma!L:L,_xlfn.AGGREGATE(15,6,ROW(Cronograma!$D$8:$D$122)/(Cronograma!$D$8:$D$122=$C$7),22)),\"\")","v":""},{"$f":"IFERROR(INDEX(Cronograma!P:P,_xlfn.AGGREGATE(15,6,ROW(Cronograma!$D$8:$D$122)/(Cronograma!$D$8:$D$122=$C$7),22)),\"\")","v":""},{"$f":"IFERROR(INDEX(Cronograma!R:R,_xlfn.AGGREGATE(15,6,ROW(Cronograma!$D$8:$D$122)/(Cronograma!$D$8:$D$122=$C$7),22)),\"\")","v":""}]
[null,null,{"$f":"IFERROR(INDEX(Cronograma!C:C,_xlfn.AGGREGATE(15,6,ROW(Cronograma!$D$8:$D$122)/(Cronograma!$D$8:$D$122=$C$7),23)),\"\")","v":""},{"$f":"IFERROR(INDEX(Cronograma!E:E,_xlfn.AGGREGATE(15,6,ROW(Cronograma!$D$8:$D$122)/(Cronograma!$D$8:$D$122=$C$7),23)),\"\")","v":""},{"$f":"IFERROR(INDEX(Cronograma!F:F,_xlfn.AGGREGATE(15,6,ROW(Cronograma!$D$8:$D$122)/(Cronograma!$D$8:$D$122=$C$7),23)),\"\")","v":""},{"$f":"IFERROR(INDEX(Cronograma!G:G,_xlfn.AGGREGATE(15,6,ROW(Cronograma!$D$8:$D$122)/(Cronograma!$D$8:$D$122=$C$7),23)),\"\")","v":""},{"$f":"IFERROR(INDEX(Cronograma!H:H,_xlfn.AGGREGATE(15,6,ROW(Cronograma!$D$8:$D$122)/(Cronograma!$D$8:$D$122=$C$7),23)),\"\")","v":""},{"$f":"IFERROR(INDEX(Cronograma!O:O,_xlfn.AGGREGATE(15,6,ROW(Cronograma!$D$8:$D$122)/(Cronograma!$D$8:$D$122=$C$7),23)),\"\")","v":""},{"$nulls":30},{"$f":"IFERROR(INDEX(Cronograma!I:I,_xlfn.AGGREGATE(15,6,ROW(Cronograma!$D$8:$D$122)/(Cronograma!$D$8:$D$122=$C$7),23)),\"\")","v":""},{"$f":"IFERROR(INDEX(Cronograma!J:J,_xlfn.AGGREGATE(15,6,ROW(Cronograma!$D$8:$D$122)/(Cronograma!$D$8:$D$122=$C$7),23)),\"\")","v":""},{"$f":"IFERROR(INDEX(Cronograma!K:K,_xlfn.AGGREGATE(15,6,ROW(Cronograma!$D$8:$D$122)/(Cronograma!$D$8:$D$122=$C$7),23)),\"\")","v":""},{"$f":"IFERROR(INDEX(Cronograma!L:L,_xlfn.AGGREGATE(15,6,ROW(Cronograma!$D$8:$D$122)/(Cronograma!$D$8:$D$122=$C$7),23)),\"\")","v":""},{"$f":"IFERROR(INDEX(Cronograma!P:P,_xlfn.AGGREGATE(15,6,ROW(Cronograma!$D$8:$D$122)/(Cronograma!$D$8:$D$122=$C$7),23)),\"\")","v":""},{"$f":"IFERROR(INDEX(Cronograma!R:R,_xlfn.AGGREGATE(15,6,ROW(Cronograma!$D$8:$D$122)/(Cronograma!$D$8:$D$122=$C$7),23)),\"\")","v":""}]
[null,null,{"$f":"IFERROR(INDEX(Cronograma!C:C,_xlfn.AGGREGATE(15,6,ROW(Cronograma!$D$8:$D$122)/(Cronograma!$D$8:$D$122=$C$7),24)),\"\")","v":""},{"$f":"IFERROR(INDEX(Cronograma!E:E,_xlfn.AGGREGATE(15,6,ROW(Cronograma!$D$8:$D$122)/(Cronograma!$D$8:$D$122=$C$7),24)),\"\")","v":""},{"$f":"IFERROR(INDEX(Cronograma!F:F,_xlfn.AGGREGATE(15,6,ROW(Cronograma!$D$8:$D$122)/(Cronograma!$D$8:$D$122=$C$7),24)),\"\")","v":""},{"$f":"IFERROR(INDEX(Cronograma!G:G,_xlfn.AGGREGATE(15,6,ROW(Cronograma!$D$8:$D$122)/(Cronograma!$D$8:$D$122=$C$7),24)),\"\")","v":""},{"$f":"IFERROR(INDEX(Cronograma!H:H,_xlfn.AGGREGATE(15,6,ROW(Cronograma!$D$8:$D$122)/(Cronograma!$D$8:$D$122=$C$7),24)),\"\")","v":""},{"$f":"IFERROR(INDEX(Cronograma!O:O,_xlfn.AGGREGATE(15,6,ROW(Cronograma!$D$8:$D$122)/(Cronograma!$D$8:$D$122=$C$7),24)),\"\")","v":""},{"$nulls":30},{"$f":"IFERROR(INDEX(Cronograma!I:I,_xlfn.AGGREGATE(15,6,ROW(Cronograma!$D$8:$D$122)/(Cronograma!$D$8:$D$122=$C$7),24)),\"\")","v":""},{"$f":"IFERROR(INDEX(Cronograma!J:J,_xlfn.AGGREGATE(15,6,ROW(Cronograma!$D$8:$D$122)/(Cronograma!$D$8:$D$122=$C$7),24)),\"\")","v":""},{"$f":"IFERROR(INDEX(Cronograma!K:K,_xlfn.AGGREGATE(15,6,ROW(Cronograma!$D$8:$D$122)/(Cronograma!$D$8:$D$122=$C$7),24)),\"\")","v":""},{"$f":"IFERROR(INDEX(Cronograma!L:L,_xlfn.AGGREGATE(15,6,ROW(Cronograma!$D$8:$D$122)/(Cronograma!$D$8:$D$122=$C$7),24)),\"\")","v":""},{"$f":"IFERROR(INDEX(Cronograma!P:P,_xlfn.AGGREGATE(15,6,ROW(Cronograma!$D$8:$D$122)/(Cronograma!$D$8:$D$122=$C$7),24)),\"\")","v":""},{"$f":"IFERROR(INDEX(Cronograma!R:R,_xlfn.AGGREGATE(15,6,ROW(Cronograma!$D$8:$D$122)/(Cronograma!$D$8:$D$122=$C$7),24)),\"\")","v":""}]
[null,null,{"$f":"IFERROR(INDEX(Cronograma!C:C,_xlfn.AGGREGATE(15,6,ROW(Cronograma!$D$8:$D$122)/(Cronograma!$D$8:$D$122=$C$7),25)),\"\")","v":""},{"$f":"IFERROR(INDEX(Cronograma!E:E,_xlfn.AGGREGATE(15,6,ROW(Cronograma!$D$8:$D$122)/(Cronograma!$D$8:$D$122=$C$7),25)),\"\")","v":""},{"$f":"IFERROR(INDEX(Cronograma!F:F,_xlfn.AGGREGATE(15,6,ROW(Cronograma!$D$8:$D$122)/(Cronograma!$D$8:$D$122=$C$7),25)),\"\")","v":""},{"$f":"IFERROR(INDEX(Cronograma!G:G,_xlfn.AGGREGATE(15,6,ROW(Cronograma!$D$8:$D$122)/(Cronograma!$D$8:$D$122=$C$7),25)),\"\")","v":""},{"$f":"IFERROR(INDEX(Cronograma!H:H,_xlfn.AGGREGATE(15,6,ROW(Cronograma!$D$8:$D$122)/(Cronograma!$D$8:$D$122=$C$7),25)),\"\")","v":""},{"$f":"IFERROR(INDEX(Cronograma!O:O,_xlfn.AGGREGATE(15,6,ROW(Cronograma!$D$8:$D$122)/(Cronograma!$D$8:$D$122=$C$7),25)),\"\")","v":""},{"$nulls":30},{"$f":"IFERROR(INDEX(Cronograma!I:I,_xlfn.AGGREGATE(15,6,ROW(Cronograma!$D$8:$D$122)/(Cronograma!$D$8:$D$122=$C$7),25)),\"\")","v":""},{"$f":"IFERROR(INDEX(Cronograma!J:J,_xlfn.AGGREGATE(15,6,ROW(Cronograma!$D$8:$D$122)/(Cronograma!$D$8:$D$122=$C$7),25)),\"\")","v":""},{"$f":"IFERROR(INDEX(Cronograma!K:K,_xlfn.AGGREGATE(15,6,ROW(Cronograma!$D$8:$D$122)/(Cronograma!$D$8:$D$122=$C$7),25)),\"\")","v":""},{"$f":"IFERROR(INDEX(Cronograma!L:L,_xlfn.AGGREGATE(15,6,ROW(Cronograma!$D$8:$D$122)/(Cronograma!$D$8:$D$122=$C$7),25)),\"\")","v":""},{"$f":"IFERROR(INDEX(Cronograma!P:P,_xlfn.AGGREGATE(15,6,ROW(Cronograma!$D$8:$D$122)/(Cronograma!$D$8:$D$122=$C$7),25)),\"\")","v":""},{"$f":"IFERROR(INDEX(Cronograma!R:R,_xlfn.AGGREGATE(15,6,ROW(Cronograma!$D$8:$D$122)/(Cronograma!$D$8:$D$122=$C$7),25)),\"\")","v":""}]
[null,null,{"$f":"IFERROR(INDEX(Cronograma!C:C,_xlfn.AGGREGATE(15,6,ROW(Cronograma!$D$8:$D$122)/(Cronograma!$D$8:$D$122=$C$7),26)),\"\")","v":""},{"$f":"IFERROR(INDEX(Cronograma!E:E,_xlfn.AGGREGATE(15,6,ROW(Cronograma!$D$8:$D$122)/(Cronograma!$D$8:$D$122=$C$7),26)),\"\")","v":""},{"$f":"IFERROR(INDEX(Cronograma!F:F,_xlfn.AGGREGATE(15,6,ROW(Cronograma!$D$8:$D$122)/(Cronograma!$D$8:$D$122=$C$7),26)),\"\")","v":""},{"$f":"IFERROR(INDEX(Cronograma!G:G,_xlfn.AGGREGATE(15,6,ROW(Cronograma!$D$8:$D$122)/(Cronograma!$D$8:$D$122=$C$7),26)),\"\")","v":""},{"$f":"IFERROR(INDEX(Cronograma!H:H,_xlfn.AGGREGATE(15,6,ROW(Cronograma!$D$8:$D$122)/(Cronograma!$D$8:$D$122=$C$7),26)),\"\")","v":""},{"$f":"IFERROR(INDEX(Cronograma!O:O,_xlfn.AGGREGATE(15,6,ROW(Cronograma!$D$8:$D$122)/(Cronograma!$D$8:$D$122=$C$7),26)),\"\")","v":""},{"$nulls":30},{"$f":"IFERROR(INDEX(Cronograma!I:I,_xlfn.AGGREGATE(15,6,ROW(Cronograma!$D$8:$D$122)/(Cronograma!$D$8:$D$122=$C$7),26)),\"\")","v":""},{"$f":"IFERROR(INDEX(Cronograma!J:J,_xlfn.AGGREGATE(15,6,ROW(Cronograma!$D$8:$D$122)/(Cronograma!$D$8:$D$122=$C$7),26)),\"\")","v":""},{"$f":"IFERROR(INDEX(Cronograma!K:K,_xlfn.AGGREGATE(15,6,ROW(Cronograma!$D$8:$D$122)/(Cronograma!$D$8:$D$122=$C$7),26)),\"\")","v":""},{"$f":"IFERROR(INDEX(Cronograma!L:L,_xlfn.AGGREGATE(15,6,ROW(Cronograma!$D$8:$D$122)/(Cronograma!$D$8:$D$122=$C$7),26)),\"\")","v":""},{"$f":"IFERROR(INDEX(Cronograma!P:P,_xlfn.AGGREGATE(15,6,ROW(Cronograma!$D$8:$D$122)/(Cronograma!$D$8:$D$122=$C$7),26)),\"\")","v":""},{"$f":"IFERROR(INDEX(Cronograma!R:R,_xlfn.AGGREGATE(15,6,ROW(Cronograma!$D$8:$D$122)/(Cronograma!$D$8:$D$122=$C$7),26)),\"\")","v":""}]
[null,null,{"$f":"IFERROR(INDEX(Cronograma!C:C,_xlfn.AGGREGATE(15,6,ROW(Cronograma!$D$8:$D$122)/(Cronograma!$D$8:$D$122=$C$7),27)),\"\")","v":""},{"$f":"IFERROR(INDEX(Cronograma!E:E,_xlfn.AGGREGATE(15,6,ROW(Cronograma!$D$8:$D$122)/(Cronograma!$D$8:$D$122=$C$7),27)),\"\")","v":""},{"$f":"IFERROR(INDEX(Cronograma!F:F,_xlfn.AGGREGATE(15,6,ROW(Cronograma!$D$8:$D$122)/(Cronograma!$D$8:$D$122=$C$7),27)),\"\")","v":""},{"$f":"IFERROR(INDEX(Cronograma!G:G,_xlfn.AGGREGATE(15,6,ROW(Cronograma!$D$8:$D$122)/(Cronograma!$D$8:$D$122=$C$7),27)),\"\")","v":""},{"$f":"IFERROR(INDEX(Cronograma!H:H,_xlfn.AGGREGATE(15,6,ROW(Cronograma!$D$8:$D$122)/(Cronograma!$D$8:$D$122=$C$7),27)),\"\")","v":""},{"$f":"IFERROR(INDEX(Cronograma!O:O,_xlfn.AGGREGATE(15,6,ROW(Cronograma!$D$8:$D$122)/(Cronograma!$D$8:$D$122=$C$7),27)),\"\")","v":""},{"$nulls":30},{"$f":"IFERROR(INDEX(Cronograma!I:I,_xlfn.AGGREGATE(15,6,ROW(Cronograma!$D$8:$D$122)/(Cronograma!$D$8:$D$122=$C$7),27)),\"\")","v":""},{"$f":"IFERROR(INDEX(Cronograma!J:J,_xlfn.AGGREGATE(15,6,ROW(Cronograma!$D$8:$D$122)/(Cronograma!$D$8:$D$122=$C$7),27)),\"\")","v":""},{"$f":"IFERROR(INDEX(Cronograma!K:K,_xlfn.AGGREGATE(15,6,ROW(Cronograma!$D$8:$D$122)/(Cronograma!$D$8:$D$122=$C$7),27)),\"\")","v":""},{"$f":"IFERROR(INDEX(Cronograma!L:L,_xlfn.AGGREGATE(15,6,ROW(Cronograma!$D$8:$D$122)/(Cronograma!$D$8:$D$122=$C$7),27)),\"\")","v":""},{"$f":"IFERROR(INDEX(Cronograma!P:P,_xlfn.AGGREGATE(15,6,ROW(Cronograma!$D$8:$D$122)/(Cronograma!$D$8:$D$122=$C$7),27)),\"\")","v":""},{"$f":"IFERROR(INDEX(Cronograma!R:R,_xlfn.AGGREGATE(15,6,ROW(Cronograma!$D$8:$D$122)/(Cronograma!$D$8:$D$122=$C$7),27)),\"\")","v":""}]
[null,null,{"$f":"IFERROR(INDEX(Cronograma!C:C,_xlfn.AGGREGATE(15,6,ROW(Cronograma!$D$8:$D$122)/(Cronograma!$D$8:$D$122=$C$7),28)),\"\")","v":""},{"$f":"IFERROR(INDEX(Cronograma!E:E,_xlfn.AGGREGATE(15,6,ROW(Cronograma!$D$8:$D$122)/(Cronograma!$D$8:$D$122=$C$7),28)),\"\")","v":""},{"$f":"IFERROR(INDEX(Cronograma!F:F,_xlfn.AGGREGATE(15,6,ROW(Cronograma!$D$8:$D$122)/(Cronograma!$D$8:$D$122=$C$7),28)),\"\")","v":""},{"$f":"IFERROR(INDEX(Cronograma!G:G,_xlfn.AGGREGATE(15,6,ROW(Cronograma!$D$8:$D$122)/(Cronograma!$D$8:$D$122=$C$7),28)),\"\")","v":""},{"$f":"IFERROR(INDEX(Cronograma!H:H,_xlfn.AGGREGATE(15,6,ROW(Cronograma!$D$8:$D$122)/(Cronograma!$D$8:$D$122=$C$7),28)),\"\")","v":""},{"$f":"IFERROR(INDEX(Cronograma!O:O,_xlfn.AGGREGATE(15,6,ROW(Cronograma!$D$8:$D$122)/(Cronograma!$D$8:$D$122=$C$7),28)),\"\")","v":""},{"$nulls":30},{"$f":"IFERROR(INDEX(Cronograma!I:I,_xlfn.AGGREGATE(15,6,ROW(Cronograma!$D$8:$D$122)/(Cronograma!$D$8:$D$122=$C$7),28)),\"\")","v":""},{"$f":"IFERROR(INDEX(Cronograma!J:J,_xlfn.AGGREGATE(15,6,ROW(Cronograma!$D$8:$D$122)/(Cronograma!$D$8:$D$122=$C$7),28)),\"\")","v":""},{"$f":"IFERROR(INDEX(Cronograma!K:K,_xlfn.AGGREGATE(15,6,ROW(Cronograma!$D$8:$D$122)/(Cronograma!$D$8:$D$122=$C$7),28)),\"\")","v":""},{"$f":"IFERROR(INDEX(Cronograma!L:L,_xlfn.AGGREGATE(15,6,ROW(Cronograma!$D$8:$D$122)/(Cronograma!$D$8:$D$122=$C$7),28)),\"\")","v":""},{"$f":"IFERROR(INDEX(Cronograma!P:P,_xlfn.AGGREGATE(15,6,ROW(Cronograma!$D$8:$D$122)/(Cronograma!$D$8:$D$122=$C$7),28)),\"\")","v":""},{"$f":"IFERROR(INDEX(Cronograma!R:R,_xlfn.AGGREGATE(15,6,ROW(Cronograma!$D$8:$D$122)/(Cronograma!$D$8:$D$122=$C$7),28)),\"\")","v":""}]
[null,null,{"$f":"IFERROR(INDEX(Cronograma!C:C,_xlfn.AGGREGATE(15,6,ROW(Cronograma!$D$8:$D$122)/(Cronograma!$D$8:$D$122=$C$7),29)),\"\")","v":""},{"$f":"IFERROR(INDEX(Cronograma!E:E,_xlfn.AGGREGATE(15,6,ROW(Cronograma!$D$8:$D$122)/(Cronograma!$D$8:$D$122=$C$7),29)),\"\")","v":""},{"$f":"IFERROR(INDEX(Cronograma!F:F,_xlfn.AGGREGATE(15,6,ROW(Cronograma!$D$8:$D$122)/(Cronograma!$D$8:$D$122=$C$7),29)),\"\")","v":""},{"$f":"IFERROR(INDEX(Cronograma!G:G,_xlfn.AGGREGATE(15,6,ROW(Cronograma!$D$8:$D$122)/(Cronograma!$D$8:$D$122=$C$7),29)),\"\")","v":""},{"$f":"IFERROR(INDEX(Cronograma!H:H,_xlfn.AGGREGATE(15,6,ROW(Cronograma!$D$8:$D$122)/(Cronograma!$D$8:$D$122=$C$7),29)),\"\")","v":""},{"$f":"IFERROR(INDEX(Cronograma!O:O,_xlfn.AGGREGATE(15,6,ROW(Cronograma!$D$8:$D$122)/(Cronograma!$D$8:$D$122=$C$7),29)),\"\")","v":""},{"$nulls":30},{"$f":"IFERROR(INDEX(Cronograma!I:I,_xlfn.AGGREGATE(15,6,ROW(Cronograma!$D$8:$D$122)/(Cronograma!$D$8:$D$122=$C$7),29)),\"\")","v":""},{"$f":"IFERROR(INDEX(Cronograma!J:J,_xlfn.AGGREGATE(15,6,ROW(Cronograma!$D$8:$D$122)/(Cronograma!$D$8:$D$122=$C$7),29)),\"\")","v":""},{"$f":"IFERROR(INDEX(Cronograma!K:K,_xlfn.AGGREGATE(15,6,ROW(Cronograma!$D$8:$D$122)/(Cronograma!$D$8:$D$122=$C$7),29)),\"\")","v":""},{"$f":"IFERROR(INDEX(Cronograma!L:L,_xlfn.AGGREGATE(15,6,ROW(Cronograma!$D$8:$D$122)/(Cronograma!$D$8:$D$122=$C$7),29)),\"\")","v":""},{"$f":"IFERROR(INDEX(Cronograma!P:P,_xlfn.AGGREGATE(15,6,ROW(Cronograma!$D$8:$D$122)/(Cronograma!$D$8:$D$122=$C$7),29)),\"\")","v":""},{"$f":"IFERROR(INDEX(Cronograma!R:R,_xlfn.AGGREGATE(15,6,ROW(Cronograma!$D$8:$D$122)/(Cronograma!$D$8:$D$122=$C$7),29)),\"\")","v":""}]
[null,null,{"$f":"IFERROR(INDEX(Cronograma!C:C,_xlfn.AGGREGATE(15,6,ROW(Cronograma!$D$8:$D$122)/(Cronograma!$D$8:$D$122=$C$7),30)),\"\")","v":""},{"$f":"IFERROR(INDEX(Cronograma!E:E,_xlfn.AGGREGATE(15,6,ROW(Cronograma!$D$8:$D$122)/(Cronograma!$D$8:$D$122=$C$7),30)),\"\")","v":""},{"$f":"IFERROR(INDEX(Cronograma!F:F,_xlfn.AGGREGATE(15,6,ROW(Cronograma!$D$8:$D$122)/(Cronograma!$D$8:$D$122=$C$7),30)),\"\")","v":""},{"$f":"IFERROR(INDEX(Cronograma!G:G,_xlfn.AGGREGATE(15,6,ROW(Cronograma!$D$8:$D$122)/(Cronograma!$D$8:$D$122=$C$7),30)),\"\")","v":""},{"$f":"IFERROR(INDEX(Cronograma!H:H,_xlfn.AGGREGATE(15,6,ROW(Cronograma!$D$8:$D$122)/(Cronograma!$D$8:$D$122=$C$7),30)),\"\")","v":""},{"$f":"IFERROR(INDEX(Cronograma!O:O,_xlfn.AGGREGATE(15,6,ROW(Cronograma!$D$8:$D$122)/(Cronograma!$D$8:$D$122=$C$7),30)),\"\")","v":""},{"$nulls":30},{"$f":"IFERROR(INDEX(Cronograma!I:I,_xlfn.AGGREGATE(15,6,ROW(Cronograma!$D$8:$D$122)/(Cronograma!$D$8:$D$122=$C$7),30)),\"\")","v":""},{"$f":"IFERROR(INDEX(Cronograma!J:J,_xlfn.AGGREGATE(15,6,ROW(Cronograma!$D$8:$D$122)/(Cronograma!$D$8:$D$122=$C$7),30)),\"\")","v":""},{"$f":"IFERROR(INDEX(Cronograma!K:K,_xlfn.AGGREGATE(15,6,ROW(Cronograma!$D$8:$D$122)/(Cronograma!$D$8:$D$122=$C$7),30)),\"\")","v":""},{"$f":"IFERROR(INDEX(Cronograma!L:L,_xlfn.AGGREGATE(15,6,ROW(Cronograma!$D$8:$D$122)/(Cronograma!$D$8:$D$122=$C$7),30)),\"\")","v":""},{"$f":"IFERROR(INDEX(Cronograma!P:P,_xlfn.AGGREGATE(15,6,ROW(Cronograma!$D$8:$D$122)/(Cronograma!$D$8:$D$122=$C$7),30)),\"\")","v":""},{"$f":"IFERROR(INDEX(Cronograma!R:R,_xlfn.AGGREGATE(15,6,ROW(Cronograma!$D$8:$D$122)/(Cronograma!$D$8:$D$122=$C$7),30)),\"\")","v":""}]
[null,null,{"$f":"IFERROR(INDEX(Cronograma!C:C,_xlfn.AGGREGATE(15,6,ROW(Cronograma!$D$8:$D$122)/(Cronograma!$D$8:$D$122=$C$7),31)),\"\")","v":""},{"$f":"IFERROR(INDEX(Cronograma!E:E,_xlfn.AGGREGATE(15,6,ROW(Cronograma!$D$8:$D$122)/(Cronograma!$D$8:$D$122=$C$7),31)),\"\")","v":""},{"$f":"IFERROR(INDEX(Cronograma!F:F,_xlfn.AGGREGATE(15,6,ROW(Cronograma!$D$8:$D$122)/(Cronograma!$D$8:$D$122=$C$7),31)),\"\")","v":""},{"$f":"IFERROR(INDEX(Cronograma!G:G,_xlfn.AGGREGATE(15,6,ROW(Cronograma!$D$8:$D$122)/(Cronograma!$D$8:$D$122=$C$7),31)),\"\")","v":""},{"$f":"IFERROR(INDEX(Cronograma!H:H,_xlfn.AGGREGATE(15,6,ROW(Cronograma!$D$8:$D$122)/(Cronograma!$D$8:$D$122=$C$7),31)),\"\")","v":""},{"$f":"IFERROR(INDEX(Cronograma!O:O,_xlfn.AGGREGATE(15,6,ROW(Cronograma!$D$8:$D$122)/(Cronograma!$D$8:$D$122=$C$7),31)),\"\")","v":""},{"$nulls":30},{"$f":"IFERROR(INDEX(Cronograma!I:I,_xlfn.AGGREGATE(15,6,ROW(Cronograma!$D$8:$D$122)/(Cronograma!$D$8:$D$122=$C$7),31)),\"\")","v":""},{"$f":"IFERROR(INDEX(Cronograma!J:J,_xlfn.AGGREGATE(15,6,ROW(Cronograma!$D$8:$D$122)/(Cronograma!$D$8:$D$122=$C$7),31)),\"\")","v":""},{"$f":"IFERROR(INDEX(Cronograma!K:K,_xlfn.AGGREGATE(15,6,ROW(Cronograma!$D$8:$D$122)/(Cronograma!$D$8:$D$122=$C$7),31)),\"\")","v":""},{"$f":"IFERROR(INDEX(Cronograma!L:L,_xlfn.AGGREGATE(15,6,ROW(Cronograma!$D$8:$D$122)/(Cronograma!$D$8:$D$122=$C$7),31)),\"\")","v":""},{"$f":"IFERROR(INDEX(Cronograma!P:P,_xlfn.AGGREGATE(15,6,ROW(Cronograma!$D$8:$D$122)/(Cronograma!$D$8:$D$122=$C$7),31)),\"\")","v":""},{"$f":"IFERROR(INDEX(Cronograma!R:R,_xlfn.AGGREGATE(15,6,ROW(Cronograma!$D$8:$D$122)/(Cronograma!$D$8:$D$122=$C$7),31)),\"\")","v":""}]
[null,null,{"$f":"IFERROR(INDEX(Cronograma!C:C,_xlfn.AGGREGATE(15,6,ROW(Cronograma!$D$8:$D$122)/(Cronograma!$D$8:$D$122=$C$7),32)),\"\")","v":""},{"$f":"IFERROR(INDEX(Cronograma!E:E,_xlfn.AGGREGATE(15,6,ROW(Cronograma!$D$8:$D$122)/(Cronograma!$D$8:$D$122=$C$7),32)),\"\")","v":""},{"$f":"IFERROR(INDEX(Cronograma!F:F,_xlfn.AGGREGATE(15,6,ROW(Cronograma!$D$8:$D$122)/(Cronograma!$D$8:$D$122=$C$7),32)),\"\")","v":""},{"$f":"IFERROR(INDEX(Cronograma!G:G,_xlfn.AGGREGATE(15,6,ROW(Cronograma!$D$8:$D$122)/(Cronograma!$D$8:$D$122=$C$7),32)),\"\")","v":""},{"$f":"IFERROR(INDEX(Cronograma!H:H,_xlfn.AGGREGATE(15,6,ROW(Cronograma!$D$8:$D$122)/(Cronograma!$D$8:$D$122=$C$7),32)),\"\")","v":""},{"$f":"IFERROR(INDEX(Cronograma!O:O,_xlfn.AGGREGATE(15,6,ROW(Cronograma!$D$8:$D$122)/(Cronograma!$D$8:$D$122=$C$7),32)),\"\")","v":""},{"$nulls":30},{"$f":"IFERROR(INDEX(Cronograma!I:I,_xlfn.AGGREGATE(15,6,ROW(Cronograma!$D$8:$D$122)/(Cronograma!$D$8:$D$122=$C$7),32)),\"\")","v":""},{"$f":"IFERROR(INDEX(Cronograma!J:J,_xlfn.AGGREGATE(15,6,ROW(Cronograma!$D$8:$D$122)/(Cronograma!$D$8:$D$122=$C$7),32)),\"\")","v":""},{"$f":"IFERROR(INDEX(Cronograma!K:K,_xlfn.AGGREGATE(15,6,ROW(Cronograma!$D$8:$D$122)/(Cronograma!$D$8:$D$122=$C$7),32)),\"\")","v":""},{"$f":"IFERROR(INDEX(Cronograma!L:L,_xlfn.AGGREGATE(15,6,ROW(Cronograma!$D$8:$D$122)/(Cronograma!$D$8:$D$122=$C$7),32)),\"\")","v":""},{"$f":"IFERROR(INDEX(Cronograma!P:P,_xlfn.AGGREGATE(15,6,ROW(Cronograma!$D$8:$D$122)/(Cronograma!$D$8:$D$122=$C$7),32)),\"\")","v":""},{"$f":"IFERROR(INDEX(Cronograma!R:R,_xlfn.AGGREGATE(15,6,ROW(Cronograma!$D$8:$D$122)/(Cronograma!$D$8:$D$122=$C$7),32)),\"\")","v":""}]
[null,null,{"$f":"IFERROR(INDEX(Cronograma!C:C,_xlfn.AGGREGATE(15,6,ROW(Cronograma!$D$8:$D$122)/(Cronograma!$D$8:$D$122=$C$7),33)),\"\")","v":""},{"$f":"IFERROR(INDEX(Cronograma!E:E,_xlfn.AGGREGATE(15,6,ROW(Cronograma!$D$8:$D$122)/(Cronograma!$D$8:$D$122=$C$7),33)),\"\")","v":""},{"$f":"IFERROR(INDEX(Cronograma!F:F,_xlfn.AGGREGATE(15,6,ROW(Cronograma!$D$8:$D$122)/(Cronograma!$D$8:$D$122=$C$7),33)),\"\")","v":""},{"$f":"IFERROR(INDEX(Cronograma!G:G,_xlfn.AGGREGATE(15,6,ROW(Cronograma!$D$8:$D$122)/(Cronograma!$D$8:$D$122=$C$7),33)),\"\")","v":""},{"$f":"IFERROR(INDEX(Cronograma!H:H,_xlfn.AGGREGATE(15,6,ROW(Cronograma!$D$8:$D$122)/(Cronograma!$D$8:$D$122=$C$7),33)),\"\")","v":""},{"$f":"IFERROR(INDEX(Cronograma!O:O,_xlfn.AGGREGATE(15,6,ROW(Cronograma!$D$8:$D$122)/(Cronograma!$D$8:$D$122=$C$7),33)),\"\")","v":""},{"$nulls":30},{"$f":"IFERROR(INDEX(Cronograma!I:I,_xlfn.AGGREGATE(15,6,ROW(Cronograma!$D$8:$D$122)/(Cronograma!$D$8:$D$122=$C$7),33)),\"\")","v":""},{"$f":"IFERROR(INDEX(Cronograma!J:J,_xlfn.AGGREGATE(15,6,ROW(Cronograma!$D$8:$D$122)/(Cronograma!$D$8:$D$122=$C$7),33)),\"\")","v":""},{"$f":"IFERROR(INDEX(Cronograma!K:K,_xlfn.AGGREGATE(15,6,ROW(Cronograma!$D$8:$D$122)/(Cronograma!$D$8:$D$122=$C$7),33)),\"\")","v":""},{"$f":"IFERROR(INDEX(Cronograma!L:L,_xlfn.AGGREGATE(15,6,ROW(Cronograma!$D$8:$D$122)/(Cronograma!$D$8:$D$122=$C$7),33)),\"\")","v":""},{"$f":"IFERROR(INDEX(Cronograma!P:P,_xlfn.AGGREGATE(15,6,ROW(Cronograma!$D$8:$D$122)/(Cronograma!$D$8:$D$122=$C$7),33)),\"\")","v":""},{"$f":"IFERROR(INDEX(Cronograma!R:R,_xlfn.AGGREGATE(15,6,ROW(Cronograma!$D$8:$D$122)/(Cronograma!$D$8:$D$122=$C$7),33)),\"\")","v":""}]
[null,null,{"$f":"IFERROR(INDEX(Cronograma!C:C,_xlfn.AGGREGATE(15,6,ROW(Cronograma!$D$8:$D$122)/(Cronograma!$D$8:$D$122=$C$7),34)),\"\")","v":""},{"$f":"IFERROR(INDEX(Cronograma!E:E,_xlfn.AGGREGATE(15,6,ROW(Cronograma!$D$8:$D$122)/(Cronograma!$D$8:$D$122=$C$7),34)),\"\")","v":""},{"$f":"IFERROR(INDEX(Cronograma!F:F,_xlfn.AGGREGATE(15,6,ROW(Cronograma!$D$8:$D$122)/(Cronograma!$D$8:$D$122=$C$7),34)),\"\")","v":""},{"$f":"IFERROR(INDEX(Cronograma!G:G,_xlfn.AGGREGATE(15,6,ROW(Cronograma!$D$8:$D$122)/(Cronograma!$D$8:$D$122=$C$7),34)),\"\")","v":""},{"$f":"IFERROR(INDEX(Cronograma!H:H,_xlfn.AGGREGATE(15,6,ROW(Cronograma!$D$8:$D$122)/(Cronograma!$D$8:$D$122=$C$7),34)),\"\")","v":""},{"$f":"IFERROR(INDEX(Cronograma!O:O,_xlfn.AGGREGATE(15,6,ROW(Cronograma!$D$8:$D$122)/(Cronograma!$D$8:$D$122=$C$7),34)),\"\")","v":""},{"$nulls":30},{"$f":"IFERROR(INDEX(Cronograma!I:I,_xlfn.AGGREGATE(15,6,ROW(Cronograma!$D$8:$D$122)/(Cronograma!$D$8:$D$122=$C$7),34)),\"\")","v":""},{"$f":"IFERROR(INDEX(Cronograma!J:J,_xlfn.AGGREGATE(15,6,ROW(Cronograma!$D$8:$D$122)/(Cronograma!$D$8:$D$122=$C$7),34)),\"\")","v":""},{"$f":"IFERROR(INDEX(Cronograma!K:K,_xlfn.AGGREGATE(15,6,ROW(Cronograma!$D$8:$D$122)/(Cronograma!$D$8:$D$122=$C$7),34)),\"\")","v":""},{"$f":"IFERROR(INDEX(Cronograma!L:L,_xlfn.AGGREGATE(15,6,ROW(Cronograma!$D$8:$D$122)/(Cronograma!$D$8:$D$122=$C$7),34)),\"\")","v":""},{"$f":"IFERROR(INDEX(Cronograma!P:P,_xlfn.AGGREGATE(15,6,ROW(Cronograma!$D$8:$D$122)/(Cronograma!$D$8:$D$122=$C$7),34)),\"\")","v":""},{"$f":"IFERROR(INDEX(Cronograma!R:R,_xlfn.AGGREGATE(15,6,ROW(Cronograma!$D$8:$D$122)/(Cronograma!$D$8:$D$122=$C$7),34)),\"\")","v":""}]
[null,null,{"$f":"IFERROR(INDEX(Cronograma!C:C,_xlfn.AGGREGATE(15,6,ROW(Cronograma!$D$8:$D$122)/(Cronograma!$D$8:$D$122=$C$7),35)),\"\")","v":""},{"$f":"IFERROR(INDEX(Cronograma!E:E,_xlfn.AGGREGATE(15,6,ROW(Cronograma!$D$8:$D$122)/(Cronograma!$D$8:$D$122=$C$7),35)),\"\")","v":""},{"$f":"IFERROR(INDEX(Cronograma!F:F,_xlfn.AGGREGATE(15,6,ROW(Cronograma!$D$8:$D$122)/(Cronograma!$D$8:$D$122=$C$7),35)),\"\")","v":""},{"$f":"IFERROR(INDEX(Cronograma!G:G,_xlfn.AGGREGATE(15,6,ROW(Cronograma!$D$8:$D$122)/(Cronograma!$D$8:$D$122=$C$7),35)),\"\")","v":""},{"$f":"IFERROR(INDEX(Cronograma!H:H,_xlfn.AGGREGATE(15,6,ROW(Cronograma!$D$8:$D$122)/(Cronograma!$D$8:$D$122=$C$7),35)),\"\")","v":""},{"$f":"IFERROR(INDEX(Cronograma!O:O,_xlfn.AGGREGATE(15,6,ROW(Cronograma!$D$8:$D$122)/(Cronograma!$D$8:$D$122=$C$7),35)),\"\")","v":""},{"$nulls":30},{"$f":"IFERROR(INDEX(Cronograma!I:I,_xlfn.AGGREGATE(15,6,ROW(Cronograma!$D$8:$D$122)/(Cronograma!$D$8:$D$122=$C$7),35)),\"\")","v":""},{"$f":"IFERROR(INDEX(Cronograma!J:J,_xlfn.AGGREGATE(15,6,ROW(Cronograma!$D$8:$D$122)/(Cronograma!$D$8:$D$122=$C$7),35)),\"\")","v":""},{"$f":"IFERROR(INDEX(Cronograma!K:K,_xlfn.AGGREGATE(15,6,ROW(Cronograma!$D$8:$D$122)/(Cronograma!$D$8:$D$122=$C$7),35)),\"\")","v":""},{"$f":"IFERROR(INDEX(Cronograma!L:L,_xlfn.AGGREGATE(15,6,ROW(Cronograma!$D$8:$D$122)/(Cronograma!$D$8:$D$122=$C$7),35)),\"\")","v":""},{"$f":"IFERROR(INDEX(Cronograma!P:P,_xlfn.AGGREGATE(15,6,ROW(Cronograma!$D$8:$D$122)/(Cronograma!$D$8:$D$122=$C$7),35)),\"\")","v":""},{"$f":"IFERROR(INDEX(Cronograma!R:R,_xlfn.AGGREGATE(15,6,ROW(Cronograma!$D$8:$D$122)/(Cronograma!$D$8:$D$122=$C$7),35)),\"\")","v":""}]
[null,null,{"$f":"IFERROR(INDEX(Cronograma!C:C,_xlfn.AGGREGATE(15,6,ROW(Cronograma!$D$8:$D$122)/(Cronograma!$D$8:$D$122=$C$7),36)),\"\")","v":""},{"$f":"IFERROR(INDEX(Cronograma!E:E,_xlfn.AGGREGATE(15,6,ROW(Cronograma!$D$8:$D$122)/(Cronograma!$D$8:$D$122=$C$7),36)),\"\")","v":""},{"$f":"IFERROR(INDEX(Cronograma!F:F,_xlfn.AGGREGATE(15,6,ROW(Cronograma!$D$8:$D$122)/(Cronograma!$D$8:$D$122=$C$7),36)),\"\")","v":""},{"$f":"IFERROR(INDEX(Cronograma!G:G,_xlfn.AGGREGATE(15,6,ROW(Cronograma!$D$8:$D$122)/(Cronograma!$D$8:$D$122=$C$7),36)),\"\")","v":""},{"$f":"IFERROR(INDEX(Cronograma!H:H,_xlfn.AGGREGATE(15,6,ROW(Cronograma!$D$8:$D$122)/(Cronograma!$D$8:$D$122=$C$7),36)),\"\")","v":""},{"$f":"IFERROR(INDEX(Cronograma!O:O,_xlfn.AGGREGATE(15,6,ROW(Cronograma!$D$8:$D$122)/(Cronograma!$D$8:$D$122=$C$7),36)),\"\")","v":""},{"$nulls":30},{"$f":"IFERROR(INDEX(Cronograma!I:I,_xlfn.AGGREGATE(15,6,ROW(Cronograma!$D$8:$D$122)/(Cronograma!$D$8:$D$122=$C$7),36)),\"\")","v":""},{"$f":"IFERROR(INDEX(Cronograma!J:J,_xlfn.AGGREGATE(15,6,ROW(Cronograma!$D$8:$D$122)/(Cronograma!$D$8:$D$122=$C$7),36)),\"\")","v":""},{"$f":"IFERROR(INDEX(Cronograma!K:K,_xlfn.AGGREGATE(15,6,ROW(Cronograma!$D$8:$D$122)/(Cronograma!$D$8:$D$122=$C$7),36)),\"\")","v":""},{"$f":"IFERROR(INDEX(Cronograma!L:L,_xlfn.AGGREGATE(15,6,ROW(Cronograma!$D$8:$D$122)/(Cronograma!$D$8:$D$122=$C$7),36)),\"\")","v":""},{"$f":"IFERROR(INDEX(Cronograma!P:P,_xlfn.AGGREGATE(15,6,ROW(Cronograma!$D$8:$D$122)/(Cronograma!$D$8:$D$122=$C$7),36)),\"\")","v":""},{"$f":"IFERROR(INDEX(Cronograma!R:R,_xlfn.AGGREGATE(15,6,ROW(Cronograma!$D$8:$D$122)/(Cronograma!$D$8:$D$122=$C$7),36)),\"\")","v":""}]
[null,null,{"$f":"IFERROR(INDEX(Cronograma!C:C,_xlfn.AGGREGATE(15,6,ROW(Cronograma!$D$8:$D$122)/(Cronograma!$D$8:$D$122=$C$7),37)),\"\")","v":""},{"$f":"IFERROR(INDEX(Cronograma!E:E,_xlfn.AGGREGATE(15,6,ROW(Cronograma!$D$8:$D$122)/(Cronograma!$D$8:$D$122=$C$7),37)),\"\")","v":""},{"$f":"IFERROR(INDEX(Cronograma!F:F,_xlfn.AGGREGATE(15,6,ROW(Cronograma!$D$8:$D$122)/(Cronograma!$D$8:$D$122=$C$7),37)),\"\")","v":""},{"$f":"IFERROR(INDEX(Cronograma!G:G,_xlfn.AGGREGATE(15,6,ROW(Cronograma!$D$8:$D$122)/(Cronograma!$D$8:$D$122=$C$7),37)),\"\")","v":""},{"$f":"IFERROR(INDEX(Cronograma!H:H,_xlfn.AGGREGATE(15,6,ROW(Cronograma!$D$8:$D$122)/(Cronograma!$D$8:$D$122=$C$7),37)),\"\")","v":""},{"$f":"IFERROR(INDEX(Cronograma!O:O,_xlfn.AGGREGATE(15,6,ROW(Cronograma!$D$8:$D$122)/(Cronograma!$D$8:$D$122=$C$7),37)),\"\")","v":""},{"$nulls":30},{"$f":"IFERROR(INDEX(Cronograma!I:I,_xlfn.AGGREGATE(15,6,ROW(Cronograma!$D$8:$D$122)/(Cronograma!$D$8:$D$122=$C$7),37)),\"\")","v":""},{"$f":"IFERROR(INDEX(Cronograma!J:J,_xlfn.AGGREGATE(15,6,ROW(Cronograma!$D$8:$D$122)/(Cronograma!$D$8:$D$122=$C$7),37)),\"\")","v":""},{"$f":"IFERROR(INDEX(Cronograma!K:K,_xlfn.AGGREGATE(15,6,ROW(Cronograma!$D$8:$D$122)/(Cronograma!$D$8:$D$122=$C$7),37)),\"\")","v":""},{"$f":"IFERROR(INDEX(Cronograma!L:L,_xlfn.AGGREGATE(15,6,ROW(Cronograma!$D$8:$D$122)/(Cronograma!$D$8:$D$122=$C$7),37)),\"\")","v":""},{"$f":"IFERROR(INDEX(Cronograma!P:P,_xlfn.AGGREGATE(15,6,ROW(Cronograma!$D$8:$D$122)/(Cronograma!$D$8:$D$122=$C$7),37)),\"\")","v":""},{"$f":"IFERROR(INDEX(Cronograma!R:R,_xlfn.AGGREGATE(15,6,ROW(Cronograma!$D$8:$D$122)/(Cronograma!$D$8:$D$122=$C$7),37)),\"\")","v":""}]
[null,null,{"$f":"IFERROR(INDEX(Cronograma!C:C,_xlfn.AGGREGATE(15,6,ROW(Cronograma!$D$8:$D$122)/(Cronograma!$D$8:$D$122=$C$7),38)),\"\")","v":""},{"$f":"IFERROR(INDEX(Cronograma!E:E,_xlfn.AGGREGATE(15,6,ROW(Cronograma!$D$8:$D$122)/(Cronograma!$D$8:$D$122=$C$7),38)),\"\")","v":""},{"$f":"IFERROR(INDEX(Cronograma!F:F,_xlfn.AGGREGATE(15,6,ROW(Cronograma!$D$8:$D$122)/(Cronograma!$D$8:$D$122=$C$7),38)),\"\")","v":""},{"$f":"IFERROR(INDEX(Cronograma!G:G,_xlfn.AGGREGATE(15,6,ROW(Cronograma!$D$8:$D$122)/(Cronograma!$D$8:$D$122=$C$7),38)),\"\")","v":""},{"$f":"IFERROR(INDEX(Cronograma!H:H,_xlfn.AGGREGATE(15,6,ROW(Cronograma!$D$8:$D$122)/(Cronograma!$D$8:$D$122=$C$7),38)),\"\")","v":""},{"$f":"IFERROR(INDEX(Cronograma!O:O,_xlfn.AGGREGATE(15,6,ROW(Cronograma!$D$8:$D$122)/(Cronograma!$D$8:$D$122=$C$7),38)),\"\")","v":""},{"$nulls":30},{"$f":"IFERROR(INDEX(Cronograma!I:I,_xlfn.AGGREGATE(15,6,ROW(Cronograma!$D$8:$D$122)/(Cronograma!$D$8:$D$122=$C$7),38)),\"\")","v":""},{"$f":"IFERROR(INDEX(Cronograma!J:J,_xlfn.AGGREGATE(15,6,ROW(Cronograma!$D$8:$D$122)/(Cronograma!$D$8:$D$122=$C$7),38)),\"\")","v":""},{"$f":"IFERROR(INDEX(Cronograma!K:K,_xlfn.AGGREGATE(15,6,ROW(Cronograma!$D$8:$D$122)/(Cronograma!$D$8:$D$122=$C$7),38)),\"\")","v":""},{"$f":"IFERROR(INDEX(Cronograma!L:L,_xlfn.AGGREGATE(15,6,ROW(Cronograma!$D$8:$D$122)/(Cronograma!$D$8:$D$122=$C$7),38)),\"\")","v":""},{"$f":"IFERROR(INDEX(Cronograma!P:P,_xlfn.AGGREGATE(15,6,ROW(Cronograma!$D$8:$D$122)/(Cronograma!$D$8:$D$122=$C$7),38)),\"\")","v":""},{"$f":"IFERROR(INDEX(Cronograma!R:R,_xlfn.AGGREGATE(15,6,ROW(Cronograma!$D$8:$D$122)/(Cronograma!$D$8:$D$122=$C$7),38)),\"\")","v":""}]
[null,null,{"$f":"IFERROR(INDEX(Cronograma!C:C,_xlfn.AGGREGATE(15,6,ROW(Cronograma!$D$8:$D$122)/(Cronograma!$D$8:$D$122=$C$7),39)),\"\")","v":""},{"$f":"IFERROR(INDEX(Cronograma!E:E,_xlfn.AGGREGATE(15,6,ROW(Cronograma!$D$8:$D$122)/(Cronograma!$D$8:$D$122=$C$7),39)),\"\")","v":""},{"$f":"IFERROR(INDEX(Cronograma!F:F,_xlfn.AGGREGATE(15,6,ROW(Cronograma!$D$8:$D$122)/(Cronograma!$D$8:$D$122=$C$7),39)),\"\")","v":""},{"$f":"IFERROR(INDEX(Cronograma!G:G,_xlfn.AGGREGATE(15,6,ROW(Cronograma!$D$8:$D$122)/(Cronograma!$D$8:$D$122=$C$7),39)),\"\")","v":""},{"$f":"IFERROR(INDEX(Cronograma!H:H,_xlfn.AGGREGATE(15,6,ROW(Cronograma!$D$8:$D$122)/(Cronograma!$D$8:$D$122=$C$7),39)),\"\")","v":""},{"$f":"IFERROR(INDEX(Cronograma!O:O,_xlfn.AGGREGATE(15,6,ROW(Cronograma!$D$8:$D$122)/(Cronograma!$D$8:$D$122=$C$7),39)),\"\")","v":""},{"$nulls":30},{"$f":"IFERROR(INDEX(Cronograma!I:I,_xlfn.AGGREGATE(15,6,ROW(Cronograma!$D$8:$D$122)/(Cronograma!$D$8:$D$122=$C$7),39)),\"\")","v":""},{"$f":"IFERROR(INDEX(Cronograma!J:J,_xlfn.AGGREGATE(15,6,ROW(Cronograma!$D$8:$D$122)/(Cronograma!$D$8:$D$122=$C$7),39)),\"\")","v":""},{"$f":"IFERROR(INDEX(Cronograma!K:K,_xlfn.AGGREGATE(15,6,ROW(Cronograma!$D$8:$D$122)/(Cronograma!$D$8:$D$122=$C$7),39)),\"\")","v":""},{"$f":"IFERROR(INDEX(Cronograma!L:L,_xlfn.AGGREGATE(15,6,ROW(Cronograma!$D$8:$D$122)/(Cronograma!$D$8:$D$122=$C$7),39)),\"\")","v":""},{"$f":"IFERROR(INDEX(Cronograma!P:P,_xlfn.AGGREGATE(15,6,ROW(Cronograma!$D$8:$D$122)/(Cronograma!$D$8:$D$122=$C$7),39)),\"\")","v":""},{"$f":"IFERROR(INDEX(Cronograma!R:R,_xlfn.AGGREGATE(15,6,ROW(Cronograma!$D$8:$D$122)/(Cronograma!$D$8:$D$122=$C$7),39)),\"\")","v":""}]
[null,null,{"$f":"IFERROR(INDEX(Cronograma!C:C,_xlfn.AGGREGATE(15,6,ROW(Cronograma!$D$8:$D$122)/(Cronograma!$D$8:$D$122=$C$7),40)),\"\")","v":""},{"$f":"IFERROR(INDEX(Cronograma!E:E,_xlfn.AGGREGATE(15,6,ROW(Cronograma!$D$8:$D$122)/(Cronograma!$D$8:$D$122=$C$7),40)),\"\")","v":""},{"$f":"IFERROR(INDEX(Cronograma!F:F,_xlfn.AGGREGATE(15,6,ROW(Cronograma!$D$8:$D$122)/(Cronograma!$D$8:$D$122=$C$7),40)),\"\")","v":""},{"$f":"IFERROR(INDEX(Cronograma!G:G,_xlfn.AGGREGATE(15,6,ROW(Cronograma!$D$8:$D$122)/(Cronograma!$D$8:$D$122=$C$7),40)),\"\")","v":""},{"$f":"IFERROR(INDEX(Cronograma!H:H,_xlfn.AGGREGATE(15,6,ROW(Cronograma!$D$8:$D$122)/(Cronograma!$D$8:$D$122=$C$7),40)),\"\")","v":""},{"$f":"IFERROR(INDEX(Cronograma!O:O,_xlfn.AGGREGATE(15,6,ROW(Cronograma!$D$8:$D$122)/(Cronograma!$D$8:$D$122=$C$7),40)),\"\")","v":""},{"$nulls":30},{"$f":"IFERROR(INDEX(Cronograma!I:I,_xlfn.AGGREGATE(15,6,ROW(Cronograma!$D$8:$D$122)/(Cronograma!$D$8:$D$122=$C$7),40)),\"\")","v":""},{"$f":"IFERROR(INDEX(Cronograma!J:J,_xlfn.AGGREGATE(15,6,ROW(Cronograma!$D$8:$D$122)/(Cronograma!$D$8:$D$122=$C$7),40)),\"\")","v":""},{"$f":"IFERROR(INDEX(Cronograma!K:K,_xlfn.AGGREGATE(15,6,ROW(Cronograma!$D$8:$D$122)/(Cronograma!$D$8:$D$122=$C$7),40)),\"\")","v":""},{"$f":"IFERROR(INDEX(Cronograma!L:L,_xlfn.AGGREGATE(15,6,ROW(Cronograma!$D$8:$D$122)/(Cronograma!$D$8:$D$122=$C$7),40)),\"\")","v":""},{"$f":"IFERROR(INDEX(Cronograma!P:P,_xlfn.AGGREGATE(15,6,ROW(Cronograma!$D$8:$D$122)/(Cronograma!$D$8:$D$122=$C$7),40)),\"\")","v":""},{"$f":"IFERROR(INDEX(Cronograma!R:R,_xlfn.AGGREGATE(15,6,ROW(Cronograma!$D$8:$D$122)/(Cronograma!$D$8:$D$122=$C$7),40)),\"\")","v":""}]

{"sheet":"Calculos","index":11,"n_rows":17,"n_cols":21,"rows_kept":17,"hidden":true,"merged":[[1,2,1,20],[2,2,2,20],[3,2,3,20],[5,9,5,13]]}
[]
[null,null,"CÁLCULOS E INDICADORES"]
[]
[]
[]
[null,null,"INDICADORES GERAIS",{"$nulls":3},"RESUMO POR STATUS",null,null,"RESUMO FINANCEIRO POR PROJETO - PRIMEIROS 10",{"$nulls":5},"TAREFAS ATRASADAS",{"$nulls":3},"CUSTOS POR CATEGORIA"]
[null,null,"Total de Projetos",{"$f":"COUNTA(tbProjetos[Cod_Projeto])","v":67},null,null,"Status","Qtde",null,"Projeto","Receita/Contrato","Custo Previsto","Custo Real","Margem Real",null,"Projeto","Qtde Atrasadas",null,null,"Categoria","Custo Real"]
[null,null,"Projetos Ativos",{"$f":"COUNTIF(tbProjetos[Ativo],\"Sim\")","v":44},null,null,"Planejado",{"$f":"COUNTIF(tbProjetos[Status],G8)","v":14},null,{"$f":"IFERROR(INDEX(tbProjetos[Projeto],1),\"\")","v":"Migração de ERP"},{"$f":"IF(J8=\"\",\"\",SUMIFS(tbProjetos[Valor_Contratado],tbProjetos[Projeto],J8))","v":{"v":224711.09,"d":"R$ 224,711.09"}},{"$f":"IF(J8=\"\",\"\",SUMIFS(tbProjetos[Custo_Previsto],tbProjetos[Projeto],J8))","v":{"v":128620.23,"d":"R$ 128,620.23"}},{"$f":"IF(J8=\"\",\"\",SUMIFS(tbProjetos[Custo_Real],tbProjetos[Projeto],J8))","v":{"v":146904.15,"d":"R$ 146,904.15"}},{"$f":"IF(J8=\"\",\"\",K8-M8)","v":{"v":77806.94,"d":"R$ 77,806.94"}},null,{"$f":"J8","v":"Migração de ERP"},{"$f":"IF(P8=\"\",\"\",COUNTIFS(tbCronograma[Projeto],P8,tbCronograma[Atraso_Dias],\">\"&0))","v":2},null,null,"Mão de obra",{"$f":"SUMIFS(tbOrcamento[Valor_Realizado],tbOrcamento[Categoria_Custo],T8)","v":{"v":203412.58000000002,"d":"R$ 203,412.58"}}]
[null,null,"Projetos Concluídos",{"$f":"COUNTIF(tbProjetos[Status],\"Concluído\")","v":20},null,null,"Em andamento",{"$f":"COUNTIF(tbProjetos[Status],G9)","v":21},null,{"$f":"IFERROR(INDEX(tbProjetos[Projeto],2),\"\")","v":"Novo Portal Web"},{"$f":"IF(J9=\"\",\"\",SUMIFS(tbProjetos[Valor_Contratado],tbProjetos[Projeto],J9))","v":{"v":428890.44,"d":"R$ 428,890.44"}},{"$f":"IF(J9=\"\",\"\",SUMIFS(tbProjetos[Custo_Previsto],tbProjetos[Projeto],J9))","v":{"v":319116.72,"d":"R$ 319,116.72"}},{"$f":"IF(J9=\"\",\"\",SUMIFS(tbProjetos[Custo_Real],tbProjetos[Projeto],J9))","v":{"v":348127.43,"d":"R$ 348,127.43"}},{"v":80763.01000000001,"d":"R$ 80,763.01"},null,"Novo Portal Web",{"$f":"IF(P9=\"\",\"\",COUNTIFS(tbCronograma[Projeto],P9,tbCronograma[Atraso_Dias],\">\"&0))","v":2},null,null,"Software",{"$f":"SUMIFS(tbOrcamento[Valor_Realizado],tbOrcamento[Categoria_Custo],T9)","v":{"v":42700,"d":"R$ 42,700.00"}}]
[null,null,"Projetos Atrasados",{"$f":"COUNTIF(tbProjetos[Situacao_Prazo],\"Atrasado\")","v":39},null,null,"Em pausa",{"$f":"COUNTIF(tbProjetos[Status],G10)","v":9},null,{"$f":"IFERROR(INDEX(tbProjetos[Projeto],3),\"\")","v":"App Mobile Vendas"},{"$f":"IF(J10=\"\",\"\",SUMIFS(tbProjetos[Valor_Contratado],tbProjetos[Projeto],J10))","v":{"v":478073.71,"d":"R$ 478,073.71"}},{"$f":"IF(J10=\"\",\"\",SUMIFS(tbProjetos[Custo_Previsto],tbProjetos[Projeto],J10))","v":{"v":337556.09,"d":"R$ 337,556.09"}},{"$f":"IF(J10=\"\",\"\",SUMIFS(tbProjetos[Custo_Real],tbProjetos[Projeto],J10))","v":{"v":370990.61,"d":"R$ 370,990.61"}},{"v":107083.10000000003,"d":"R$ 107,083.10"},null,"App Mobile Vendas",{"$f":"IF(P10=\"\",\"\",COUNTIFS(tbCronograma[Projeto],P10,tbCronograma[Atraso_Dias],\">\"&0))","v":4},null,null,"Material",{"$f":"SUMIFS(tbOrcamento[Valor_Realizado],tbOrcamento[Categoria_Custo],T10)","v":0}]
[null,null,"Valor Contratado Total",{"$f":"SUM(tbProjetos[Valor_Contratado])","v":{"v":30024312.370000005,"d":"R$ 30,024,312.37"}},null,null,"Concluído",{"$f":"COUNTIF(tbProjetos[Status],G11)","v":20},null,{"$f":"IFERROR(INDEX(tbProjetos[Projeto],4),\"\")","v":"Automação de RH"},{"$f":"IF(J11=\"\",\"\",SUMIFS(tbProjetos[Valor_Contratado],tbProjetos[Projeto],J11))","v":{"v":810361.93,"d":"R$ 810,361.93"}},{"$f":"IF(J11=\"\",\"\",SUMIFS(tbProjetos[Custo_Previsto],tbProjetos[Projeto],J11))","v":{"v":502458.29,"d":"R$ 502,458.29"}},{"$f":"IF(J11=\"\",\"\",SUMIFS(tbProjetos[Custo_Real],tbProjetos[Projeto],J11))","v":{"v":440057.46,"d":"R$ 440,057.46"}},{"v":370304.47000000003,"d":"R$ 370,304.47"},null,"Automação de RH",{"$f":"IF(P11=\"\",\"\",COUNTIFS(tbCronograma[Projeto],P11,tbCronograma[Atraso_Dias],\">\"&0))","v":0},null,null,"Terceiros",{"$f":"SUMIFS(tbOrcamento[Valor_Realizado],tbOrcamento[Categoria_Custo],T11)","v":{"v":147514.24,"d":"R$ 147,514.24"}}]
[null,null,"Custo Previsto Total",{"$f":"SUM(tbProjetos[Custo_Previsto])","v":{"v":18743428.040000007,"d":"R$ 18,743,428.04"}},null,null,"Cancelado",{"$f":"COUNTIF(tbProjetos[Status],G12)","v":3},null,{"$f":"IFERROR(INDEX(tbProjetos[Projeto],5),\"\")","v":"BI Dashboard"},{"$f":"IF(J12=\"\",\"\",SUMIFS(tbProjetos[Valor_Contratado],tbProjetos[Projeto],J12))","v":{"v":67483.67,"d":"R$ 67,483.67"}},{"$f":"IF(J12=\"\",\"\",SUMIFS(tbProjetos[Custo_Previsto],tbProjetos[Projeto],J12))","v":{"v":37773.56,"d":"R$ 37,773.56"}},{"$f":"IF(J12=\"\",\"\",SUMIFS(tbProjetos[Custo_Real],tbProjetos[Projeto],J12))","v":{"v":37938.12,"d":"R$ 37,938.12"}},{"v":29545.549999999996,"d":"R$ 29,545.55"},null,"BI Dashboard",{"$f":"IF(P12=\"\",\"\",COUNTIFS(tbCronograma[Projeto],P12,tbCronograma[Atraso_Dias],\">\"&0))","v":0},null,null,"Transporte",{"$f":"SUMIFS(tbOrcamento[Valor_Realizado],tbOrcamento[Categoria_Custo],T12)","v":0}]
[null,null,"Custo Real Total",{"$f":"SUM(tbProjetos[Custo_Real])","v":{"v":9341466.769999998,"d":"R$ 9,341,466.77"}},{"$nulls":5},{"$f":"IFERROR(INDEX(tbProjetos[Projeto],6),\"\")","v":"Integração CRM"},{"$f":"IF(J13=\"\",\"\",SUMIFS(tbProjetos[Valor_Contratado],tbProjetos[Projeto],J13))","v":{"v":737653.06,"d":"R$ 737,653.06"}},{"$f":"IF(J13=\"\",\"\",SUMIFS(tbProjetos[Custo_Previsto],tbProjetos[Projeto],J13))","v":{"v":304299.65,"d":"R$ 304,299.65"}},{"$f":"IF(J13=\"\",\"\",SUMIFS(tbProjetos[Custo_Real],tbProjetos[Projeto],J13))","v":0},{"v":737653.06,"d":"R$ 737,653.06"},null,"Integração CRM",{"$f":"IF(P13=\"\",\"\",COUNTIFS(tbCronograma[Projeto],P13,tbCronograma[Atraso_Dias],\">\"&0))","v":3},null,null,"Administrativo",{"$f":"SUMIFS(tbOrcamento[Valor_Realizado],tbOrcamento[Categoria_Custo],T13)","v":0}]
[null,null,"Margem Prevista Total",{"$f":"SUM(tbProjetos[Margem_Prevista])","v":{"v":11280884.330000002,"d":"R$ 11,280,884.33"}},{"$nulls":5},{"$f":"IFERROR(INDEX(tbProjetos[Projeto],7),\"\")","v":"Reforma Sede"},{"$f":"IF(J14=\"\",\"\",SUMIFS(tbProjetos[Valor_Contratado],tbProjetos[Projeto],J14))","v":{"v":593267.67,"d":"R$ 593,267.67"}},{"$f":"IF(J14=\"\",\"\",SUMIFS(tbProjetos[Custo_Previsto],tbProjetos[Projeto],J14))","v":{"v":354766.37,"d":"R$ 354,766.37"}},{"$f":"IF(J14=\"\",\"\",SUMIFS(tbProjetos[Custo_Real],tbProjetos[Projeto],J14))","v":{"v":390020.48,"d":"R$ 390,020.48"}},{"v":203247.19000000006,"d":"R$ 203,247.19"},null,"Reforma Sede",{"$f":"IF(P14=\"\",\"\",COUNTIFS(tbCronograma[Projeto],P14,tbCronograma[Atraso_Dias],\">\"&0))","v":0},null,null,"Outros",{"$f":"SUMIFS(tbOrcamento[Valor_Realizado],tbOrcamento[Categoria_Custo],T14)","v":0}]
[null,null,"Margem Real Total",{"$f":"SUM(tbProjetos[Margem_Real])","v":{"v":20682845.599999998,"d":"R$ 20,682,845.60"}},{"$nulls":5},{"$f":"IFERROR(INDEX(tbProjetos[Projeto],8),\"\")","v":"Campanha Digital Q1"},{"$f":"IF(J15=\"\",\"\",SUMIFS(tbProjetos[Valor_Contratado],tbProjetos[Projeto],J15))","v":{"v":549770.27,"d":"R$ 549,770.27"}},{"$f":"IF(J15=\"\",\"\",SUMIFS(tbProjetos[Custo_Previsto],tbProjetos[Projeto],J15))","v":{"v":408734.47,"d":"R$ 408,734.47"}},{"$f":"IF(J15=\"\",\"\",SUMIFS(tbProjetos[Custo_Real],tbProjetos[Projeto],J15))","v":{"v":493741.08,"d":"R$ 493,741.08"}},{"v":56029.19,"d":"R$ 56,029.19"},null,"Campanha Digital Q1",{"$f":"IF(P15=\"\",\"\",COUNTIFS(tbCronograma[Projeto],P15,tbCronograma[Atraso_Dias],\">\"&0))","v":3}]
[null,null,"% Médio de Conclusão",{"$f":"IFERROR(AVERAGE(tbProjetos[Perc_Conclusao]),0)","v":{"v":0.5140298507462687,"d":"51%"}},{"$nulls":5},{"$f":"IFERROR(INDEX(tbProjetos[Projeto],9),\"\")","v":"Auditoria Fiscal"},{"$f":"IF(J16=\"\",\"\",SUMIFS(tbProjetos[Valor_Contratado],tbProjetos[Projeto],J16))","v":{"v":591218.46,"d":"R$ 591,218.46"}},{"$f":"IF(J16=\"\",\"\",SUMIFS(tbProjetos[Custo_Previsto],tbProjetos[Projeto],J16))","v":{"v":348618.91,"d":"R$ 348,618.91"}},{"$f":"IF(J16=\"\",\"\",SUMIFS(tbProjetos[Custo_Real],tbProjetos[Projeto],J16))","v":0},{"v":591218.46,"d":"R$ 591,218.46"},null,"Auditoria Fiscal",{"$f":"IF(P16=\"\",\"\",COUNTIFS(tbCronograma[Projeto],P16,tbCronograma[Atraso_Dias],\">\"&0))","v":2}]
[{"$nulls":9},{"$f":"IFERROR(INDEX(tbProjetos[Projeto],10),\"\")","v":"Consultoria ISO 9001"},{"$f":"IF(J17=\"\",\"\",SUMIFS(tbProjetos[Valor_Contratado],tbProjetos[Projeto],J17))","v":{"v":651890.34,"d":"R$ 651,890.34"}},{"$f":"IF(J17=\"\",\"\",SUMIFS(tbProjetos[Custo_Previsto],tbProjetos[Projeto],J17))","v":{"v":520076.03,"d":"R$ 520,076.03"}},{"$f":"IF(J17=\"\",\"\",SUMIFS(tbProjetos[Custo_Real],tbProjetos[Projeto],J17))","v":{"v":641519.93,"d":"R$ 641,519.93"}},{"v":10370.409999999916,"d":"R$ 10,370.41"},null,"Consultoria ISO 9001",{"$f":"IF(P17=\"\",\"\",COUNTIFS(tbCronograma[Projeto],P17,tbCronograma[Atraso_Dias],\">\"&0))","v":5}]