{"text_format":"3","workbook":"xlsx","n_sheets":37,"sheets":["Instruções","Dashboard","Cadastro Geral","Custos Fixos","Custos Variáveis","Tributos","Despesas Comerciais","Produtos","Serviços","Funcionários","Máquinas","Prec Markup","Prec Margem","Prec Lucro Desejado","Prec Hora Trabalhada","Prec Homem Hora","Prec Projeto","Prec Prestadores","Prec Comércio","Prec Indústria","Prec E-commerce","Prec Delivery","Prec Alimentação","Prec Artesanato","Prec Infoprodutos","Prec Assinaturas","Simulador Cenários","Comparativo Métodos","Ponto de Equilíbrio","Margem Contribuição","Lucratividade","ROI","Descontos","Parcelamentos","Simulação Tributária","Cálculos","Relatórios"],"not_rendered":{"charts":6,"images":6,"macros":1},"read":"whole","date_system":"1900"}

{"sheet":"Instruções","index":0,"n_rows":118,"n_cols":4,"rows_kept":118,"merged":[[14,2,14,5],[20,2,20,5],[34,2,34,5],[40,2,40,5],[46,2,46,5],[62,2,62,5],[79,2,79,5],[89,2,89,5],[100,2,100,5],[110,2,110,5]]}
["http://authenticator.sapphirebusinesstech.com:8080/access/v1/validate"]
["123456789",null,null,"Any use for this file other than sample using and technical analysis without authorization is stricly prohibited and protected by copyright"]
["contact@sapphirebusinesstech.com",null,null,"Qualquer uso desse arquivo sem autorização outro que uso de exemplo e análise técnica é extritamente proibida e protegida por direitos autorais."]
[{"$nulls":3},"Cualquier uso de este archivo sin autorización que no sea para fines de ejemplo o análisis técnico está estrictamente prohibido y está protegido por derechos de autor."]
[200]
[]
[{"$f":"IF(A12=\"\",0,TODAY()-A12)","v":0}]
[]
[]
[null,null,"INSTRUÇÕES"]
[]
[]
[]
[]
[null,null,"1. OBJETIVO DA PLANILHA"]
[null,null,"Sistema completo de apoio à decisão comercial para formação de preços de venda de produtos e serviços."]
[null,null,"Reúne mais de 15 métodos de precificação, simulação de cenários, comparação entre metodologias e análise de lucratividade, margem, ROI e ponto de equilíbrio."]
[null,null,"Aplicável a comércio, indústria, serviços, alimentação, e-commerce, delivery, artesanato, infoprodutos, assinaturas e projetos."]
[null,null,"100% compatível com Excel 2019 — sem VBA, sem macros e sem funções de matriz dinâmica."]
[]
[null,null,"2. ORDEM CORRETA DE UTILIZAÇÃO"]
[null,null,"Passo 1 — Cadastro Geral: registre todos os produtos e serviços que serão precificados."]
[null,null,"Passo 2 — Custos Fixos: lance aluguel, energia, salários administrativos e demais custos que não variam com as vendas. Marque quais são rateáveis."]
[null,null,"Passo 3 — Custos Variáveis: lance embalagens, matéria-prima e demais custos que variam por unidade vendida."]
[null,null,"Passo 4 — Tributos: revise as alíquotas de cada regime tributário. A coluna Carga Total é calculada automaticamente."]
[null,null,"Passo 5 — Despesas Comerciais: informe comissões, taxas de cartão, marketplace, frete, marketing e embalagem."]
[null,null,"Passo 6 — Produtos, Serviços, Funcionários e Máquinas: complete os cadastros específicos. O custo unitário, o valor-hora e o custo-hora são calculados automaticamente."]
[null,null,"Passo 7 — Cálculos: defina os PARÂMETROS GLOBAIS (regime ativo, volume mensal, markup padrão, margem desejada). Esta é a única área da aba que deve ser editada."]
[null,null,"Passo 8 — Abas de Precificação: escolha o método adequado ao seu negócio e ajuste apenas as células azuis."]
[null,null,"Passo 9 — Simulador de Cenários: monte os cenários Otimista, Pessimista e Personalizado."]
[null,null,"Passo 10 — Comparativo entre Métodos: veja o preço que cada metodologia sugere para o mesmo produto."]
[null,null,"Passo 11 — Calculadoras: valide o ponto de equilíbrio, a margem de contribuição, a lucratividade e o ROI."]
[null,null,"Passo 12 — Dashboard e Relatórios: acompanhe os indicadores e imprima os relatórios gerenciais."]
[]
[null,null,"3. COMO CADASTRAR INFORMAÇÕES"]
[null,null,"Todas as tabelas começam na célula C7 e são Tabelas do Excel (Ctrl+T) — ao digitar na primeira linha vazia abaixo da tabela, ela se expande automaticamente e as fórmulas se replicam."]
[null,null,"Campos com lista suspensa (Tipo, Categoria, Fornecedor, Unidade, Situação, Regime, Rateável) só aceitam valores da lista, evitando erros de digitação."]
[null,null,"As listas suspensas são alimentadas pela aba Cálculos, a partir da linha 87. Para incluir uma nova categoria ou fornecedor, adicione o item nessa área."]
[null,null,"Nunca apague linhas de cabeçalho nem insira colunas no meio das tabelas — isso quebra as referências das fórmulas."]
[]
[null,null,"4. COMO CRIAR CENÁRIOS"]
[null,null,"Acesse a aba Simulador de Cenários. As colunas Atual, Otimista, Pessimista e Personalizado já estão montadas."]
[null,null,"Altere apenas as premissas nas linhas 8 a 13: variação de custo, margem desejada, markup, volume de vendas e carga tributária."]
[null,null,"Os resultados (receita, custos, tributos, lucro e margem) são recalculados automaticamente nas linhas 16 a 25."]
[null,null,"Use o cenário Personalizado para testar hipóteses específicas sem alterar os demais."]
[]
[null,null,"5. COMO INTERPRETAR CADA INDICADOR"]
[null,null,"Custo Total","Soma do custo direto do item com o custo fixo rateado. É o piso absoluto do preço."]
[null,null,"Markup","Multiplicador aplicado sobre o custo. Markup 2,5x significa preço igual a 2,5 vezes o custo."]
[null,null,"Margem Bruta %","Quanto sobra do preço após o custo direto, antes de tributos e despesas comerciais."]
[null,null,"Margem Líquida %","Quanto sobra do preço após TODOS os custos, tributos e despesas. É o indicador mais importante."]
[null,null,"Margem de Contribuição","Quanto cada venda contribui para pagar os custos fixos. Preço menos todos os custos variáveis."]
[null,null,"MC %","Margem de contribuição dividida pelo preço. Acima de 35% é excelente; abaixo de 15% é crítico."]
[null,null,"Ponto de Equilíbrio","Quantidade ou faturamento necessário para o lucro ser exatamente zero."]
[null,null,"Margem de Segurança","O quanto as vendas podem cair antes de a empresa entrar em prejuízo."]
[null,null,"Alavancagem Operacional","Quanto o lucro varia para cada 1% de variação nas vendas. Quanto maior, maior o risco e o potencial."]
[null,null,"Ticket Médio","Receita total dividida pela quantidade vendida."]
[null,null,"Rentabilidade","Lucro líquido dividido pelo custo investido no item."]
[null,null,"ROI","Retorno sobre investimento: ganho líquido dividido pelo valor investido."]
[null,null,"Payback","Número de meses necessários para recuperar o investimento."]
[null,null,"LTV / CAC","Em assinaturas: quantas vezes o valor do cliente supera o custo de aquisição. Acima de 3x é saudável."]
[]
[null,null,"6. EXPLICAÇÃO DE CADA MÉTODO DE PRECIFICAÇÃO"]
[null,null,"Markup","Multiplica o custo por um fator fixo. Simples e rápido, ideal para catálogos grandes."]
[null,null,"Margem","Define o preço a partir da margem líquida desejada, já descontando tributos e despesas. Mais preciso que o markup."]
[null,null,"Lucro Desejado","Define o preço a partir de um valor de lucro em reais que se quer obter por unidade."]
[null,null,"Hora Trabalhada","Para profissionais autônomos: consultores, designers, advogados, engenheiros, arquitetos e desenvolvedores."]
[null,null,"Homem Hora","Para trabalhos em equipe: multiplica o número de profissionais pelas horas de cada um."]
[null,null,"Projeto","Para escopos fechados: soma horas, custos, despesas e uma reserva de contingência."]
[null,null,"Prestadores de Serviços","Considera visitas, deslocamento em km, tempo no local e materiais aplicados."]
[null,null,"Comércio","Parte do custo de aquisição (compra + frete + IPI) e aplica markup sobre ele."]
[null,null,"Indústria","Soma matéria-prima, mão de obra, horas-máquina, energia, depreciação e custos indiretos."]
[null,null,"E-commerce","Considera comissão de marketplace, gateway de pagamento, frete, embalagem e publicidade."]
[null,null,"Delivery","Considera embalagem, taxa do aplicativo, taxa de entrega cobrada e custo do motoboy."]
[null,null,"Alimentação","Baseado em ficha técnica: custo dos ingredientes, rendimento em porções, perdas e CMV alvo."]
[null,null,"Artesanato","Valoriza as horas do artesão, além de matéria-prima, energia e desgaste de ferramentas."]
[null,null,"Infoprodutos","Rateia o custo de produção pelo volume de vendas e considera afiliados e plataforma."]
[null,null,"Assinaturas","Baseado em churn, tempo de vida do cliente, CAC amortizado, suporte e infraestrutura."]
[]
[null,null,"7. DÚVIDAS FREQUENTES"]
[null,null,"Qual método devo usar?","Comece pelo método do seu segmento (Comércio, Indústria, Serviços etc.). Depois compare com Markup e Margem na aba Comparativo entre Métodos."]
[null,null,"Por que meu preço ficou tão alto?","Verifique as despesas comerciais e a carga tributária na aba Cálculos. Somadas, elas frequentemente passam de 35% do preço."]
[null,null,"Por que a margem líquida é menor que a margem desejada?","Na precificação por Markup a margem é consequência, não premissa. Use a aba Precificação por Margem para garantir a margem exata."]
[null,null,"Alterei um custo e nada mudou. Por quê?","Confirme se o item alterado está referenciado na matriz da aba Cálculos (linhas 25 a 39) e pressione F9 para recalcular."]
[null,null,"Como incluir mais produtos?","Digite na primeira linha vazia abaixo da tabela em Produtos. Depois amplie a matriz da aba Cálculos copiando a última linha para baixo."]
[null,null,"Posso mudar o regime tributário?","Sim. Na aba Cálculos, célula D9, escolha o regime na lista suspensa. Todos os preços se ajustam automaticamente."]
[null,null,"Qual desconto máximo posso dar?","Consulte a aba Descontos, bloco DESCONTO MÁXIMO SEM PREJUÍZO, a partir da linha 26."]
[null,null,"Vale a pena parcelar?","Veja na aba Parcelamentos quanto a margem cai em cada número de parcelas."]
[]
[null,null,"8. CONVENÇÕES UTILIZADAS"]
[null,null,"Texto em AZUL","Célula de entrada — pode e deve ser alterada pelo usuário."]
[null,null,"Texto em PRETO","Fórmula ou resultado calculado — não altere."]
[null,null,"Fundo AMARELO","Premissa-chave que merece atenção ou revisão periódica."]
[null,null,"Fundo AZUL ESCURO","Cabeçalho de tabela ou título de seção."]
[null,null,"Valores monetários","Formatados em R$ (Português do Brasil). Valores negativos aparecem entre parênteses e em vermelho."]
[null,null,"Valores zerados","Exibidos como \"-\" para facilitar a leitura."]
[null,null,"Percentuais","Formatados com duas casas decimais."]
[null,null,"Múltiplos","Formatados com a letra x (exemplo: 2,50x)."]
[null,null,"Estrutura das tabelas","Todas iniciam em C7. Colunas A e B são reservadas. A linha 4 contém os botões de navegação e a linha 6 é a divisória visual."]
[]
[null,null,"9. BOAS PRÁTICAS"]
[null,null,"Revise os custos fixos e as despesas comerciais pelo menos uma vez por mês."]
[null,null,"Atualize o volume mensal estimado na aba Cálculos sempre que a realidade das vendas mudar — ele afeta o rateio dos custos fixos."]
[null,null,"Não aceite margem líquida abaixo de 10% sem uma justificativa estratégica clara."]
[null,null,"Antes de conceder desconto, consulte o desconto máximo sem prejuízo na aba Descontos."]
[null,null,"Compare periodicamente os regimes tributários na aba Simulação Tributária — a economia potencial pode ser relevante."]
[null,null,"Sempre simule o cenário Pessimista antes de assumir compromissos de longo prazo."]
[null,null,"Mantenha os cadastros limpos: inative itens descontinuados em vez de apagá-los, preservando o histórico."]
[null,null,"Faça uma cópia do arquivo antes de reestruturar tabelas ou incluir grandes volumes de itens."]
[]
[null,null,"10. LIMITAÇÕES"]
[null,null,"A planilha não utiliza VBA nem macros — portanto os botões de navegação da linha 4 são elementos visuais, sem clique automático. Use as guias na parte inferior do Excel para navegar."]
[null,null,"Não há integração automática com sistemas de gestão, notas fiscais ou bancos: os dados são inseridos manualmente."]
[null,null,"O cálculo de tributos é simplificado e usa uma carga total por regime. Não substitui a apuração fiscal do seu contador."]
[null,null,"O rateio de custos fixos é linear (por unidade ou por hora). Rateios por absorção ou ABC exigem adaptação."]
[null,null,"A matriz da aba Cálculos está dimensionada para 15 itens (8 produtos e 7 serviços). Para ampliar, copie a última linha para baixo."]
[null,null,"As funções de matriz dinâmica (FILTRAR, ÚNICO, PROCX) não foram utilizadas para preservar a compatibilidade com o Excel 2019."]
[null,null,"Os valores presentes na planilha são exemplos didáticos. Substitua-os pelos dados reais do seu negócio antes de tomar decisões."]

{"sheet":"Dashboard","index":1,"n_rows":33,"n_cols":36,"rows_kept":33,"hidden":true,"merged":[[8,2,8,3],[8,4,8,5],[8,6,8,7],[8,8,8,9],[9,2,9,3],[9,4,9,5],[9,6,9,7],[9,8,9,9],[12,2,12,3],[12,4,12,5],[12,6,12,7],[12,8,12,9],[13,2,13,3],[13,4,13,5],[13,6,13,7],[13,8,13,9],[16,2,16,3],[16,4,16,5],[16,6,16,7],[16,8,16,9],[17,2,17,3],[17,4,17,5],[17,6,17,7],[17,8,17,9],[20,2,20,3],[20,4,20,5],[20,6,20,7],[20,8,20,9],[22,2,22,3],[22,4,22,5],[22,6,22,7],[22,8,22,9],[27,2,27,3],[27,8,27,9],[28,2,28,3],[28,8,28,9],[29,2,29,3],[29,8,29,9],[30,2,30,3],[30,8,30,9],[31,8,31,9],[32,8,32,9]]}
[]
[null,null,"DASHBOARD"]
[]
[]
[]
[]
[null,null,"INDICADORES EXECUTIVOS",{"$nulls":15},"DADOS DE APOIO DOS GRÁFICOS"]
[]
[null,null,"Receita Estimada",null,"Lucro Bruto Estimado",null,"Lucro Líquido Estimado",null,"Ticket Médio",{"$nulls":9},"Categoria","Receita",null,"Item","Margem Líquida %",null,"Item","Lucro Líquido",null,"Produto","Custo Total","Preço de Venda",null,"Top Produtos","Lucro Líquido",null,"Top Serviços","Lucro Líquido"]
[null,null,{"$f":"Cálculos!$D$47","v":{"v":429701.6,"d":"R$ 429,702"}},null,{"$f":"Cálculos!$D$49","v":{"v":292761.425,"d":"R$ 292,761"}},null,{"$f":"Cálculos!$D$50","v":{"v":77451.87352363636,"d":"R$ 77,452"}},null,{"$f":"Cálculos!$D$51","v":{"v":346.25431103948426,"d":"R$ 346.25"}},{"$nulls":9},"Vestuário",{"$f":"SUMIFS(Cálculos!$J$25:$J$39,Cálculos!$E$25:$E$39,$S10)","v":{"v":34877.4,"d":"R$ 34,877.40"}},null,{"$f":"Cálculos!C25","v":"Camiseta Premium"},{"$f":"Cálculos!P25","v":{"v":0.10133762802306569,"d":"10.13%"}},null,{"$f":"Cálculos!C25","v":"Camiseta Premium"},{"$f":"Cálculos!N25","v":{"v":11.774419000000002,"d":"R$ 11.77"}},null,{"$f":"Cálculos!C25","v":"Camiseta Premium"},{"$f":"Cálculos!H25","v":{"v":46.474999999999994,"d":"R$ 46.48"}},{"$f":"Cálculos!I25","v":{"v":116.19,"d":"R$ 116.19"}},null,{"$f":"Cálculos!C74","v":"Mochila Executiva"},{"$f":"Cálculos!D74","v":{"v":44.84444400000001,"d":"R$ 44.84"}},null,{"$f":"Cálculos!G74","v":"Desenvolvimento de Sistema"},{"$f":"Cálculos!H74","v":{"v":16291.110773181823,"d":"R$ 16,291.11"}}]
[{"$nulls":18},"Utilidades",{"$f":"SUMIFS(Cálculos!$J$25:$J$39,Cálculos!$E$25:$E$39,$S11)","v":{"v":49539.7,"d":"R$ 49,539.70"}},null,{"$f":"Cálculos!C26","v":"Caneca Cerâmica 350ml"},{"$f":"Cálculos!P26","v":{"v":0.034604637720123746,"d":"3.46%"}},null,{"$f":"Cálculos!C26","v":"Caneca Cerâmica 350ml"},{"$f":"Cálculos!N26","v":{"v":2.5742390000000057,"d":"R$ 2.57"}},null,{"$f":"Cálculos!C26","v":"Caneca Cerâmica 350ml"},{"$f":"Cálculos!H26","v":{"v":29.755,"d":"R$ 29.76"}},{"$f":"Cálculos!I26","v":{"v":74.39,"d":"R$ 74.39"}},null,{"$f":"Cálculos!C75","v":"Fone Bluetooth TWS"},{"$f":"Cálculos!D75","v":{"v":37.680188999999984,"d":"R$ 37.68"}},null,{"$f":"Cálculos!G75","v":"Projeto Arquitetônico"},{"$f":"Cálculos!H75","v":{"v":8796.201036090906,"d":"R$ 8,796.20"}}]
[{"$nulls":18},"Alimentos",{"$f":"SUMIFS(Cálculos!$J$25:$J$39,Cálculos!$E$25:$E$39,$S12)","v":{"v":10391.4,"d":"R$ 10,391.40"}},null,{"$f":"Cálculos!C27","v":"Kit Presente Gourmet"},{"$f":"Cálculos!P27","v":{"v":0.1404244991050292,"d":"14.04%"}},null,{"$f":"Cálculos!C27","v":"Kit Presente Gourmet"},{"$f":"Cálculos!N27","v":{"v":24.320119000000005,"d":"R$ 24.32"}},null,{"$f":"Cálculos!C27","v":"Kit Presente Gourmet"},{"$f":"Cálculos!H27","v":{"v":69.275,"d":"R$ 69.28"}},{"$f":"Cálculos!I27","v":{"v":173.19,"d":"R$ 173.19"}},null,{"$f":"Cálculos!C76","v":"Kit Presente Gourmet"},{"$f":"Cálculos!D76","v":{"v":24.320119000000005,"d":"R$ 24.32"}},null,{"$f":"Cálculos!G76","v":"Criação de Identidade Visual"},{"$f":"Cálculos!H76","v":{"v":3020.3602097272747,"d":"R$ 3,020.36"}}]
[null,null,"Custo Médio por Item",null,"Markup Médio Efetivo",null,"Maior Margem",null,"Menor Margem",{"$nulls":9},"Acessórios",{"$f":"SUMIFS(Cálculos!$J$25:$J$39,Cálculos!$E$25:$E$39,$S13)","v":{"v":11989.8,"d":"R$ 11,989.80"}},null,{"$f":"Cálculos!C28","v":"Mochila Executiva"},{"$f":"Cálculos!P28","v":{"v":0.1683097282690287,"d":"16.83%"}},null,{"$f":"Cálculos!C28","v":"Mochila Executiva"},{"$f":"Cálculos!N28","v":{"v":44.84444400000001,"d":"R$ 44.84"}},null,{"$f":"Cálculos!C28","v":"Mochila Executiva"},{"$f":"Cálculos!H28","v":{"v":106.57499999999999,"d":"R$ 106.58"}},{"$f":"Cálculos!I28","v":{"v":266.44,"d":"R$ 266.44"}},null,{"$f":"Cálculos!C77","v":"Garrafa Térmica 1L"},{"$f":"Cálculos!D77","v":{"v":17.411381000000006,"d":"R$ 17.41"}},null,{"$f":"Cálculos!G77","v":"Treinamento Corporativo"},{"$f":"Cálculos!H77","v":{"v":1408.0977139090908,"d":"R$ 1,408.10"}}]
[null,null,{"$f":"Cálculos!$D$52","v":{"v":3950.5432099567106,"d":"R$ 3,950.54"}},null,{"$f":"Cálculos!$D$54","v":{"v":2.4999991021836485,"d":"2.50x"}},null,{"$f":"Cálculos!$D$55","v":{"v":0.21991373831484967,"d":"21.99%"}},null,{"$f":"Cálculos!$D$56","v":{"v":0.034604637720123746,"d":"3.46%"}},{"$nulls":9},"Eletrônicos",{"$f":"SUMIFS(Cálculos!$J$25:$J$39,Cálculos!$E$25:$E$39,$S14)","v":{"v":30405.699999999997,"d":"R$ 30,405.70"}},null,{"$f":"Cálculos!C29","v":"Fone Bluetooth TWS"},{"$f":"Cálculos!P29","v":{"v":0.16110218051220654,"d":"16.11%"}},null,{"$f":"Cálculos!C29","v":"Fone Bluetooth TWS"},{"$f":"Cálculos!N29","v":{"v":37.680188999999984,"d":"R$ 37.68"}},null,{"$f":"Cálculos!C29","v":"Fone Bluetooth TWS"},{"$f":"Cálculos!H29","v":{"v":93.555,"d":"R$ 93.56"}},{"$f":"Cálculos!I29","v":{"v":233.89,"d":"R$ 233.89"}},null,{"$f":"Cálculos!C78","v":"Camiseta Premium"},{"$f":"Cálculos!D78","v":{"v":11.774419000000002,"d":"R$ 11.77"}},null,{"$f":"Cálculos!G78","v":"Consultoria Empresarial"},{"$f":"Cálculos!H78","v":{"v":1247.7081166363635,"d":"R$ 1,247.71"}}]
[{"$nulls":18},"Papelaria",{"$f":"SUMIFS(Cálculos!$J$25:$J$39,Cálculos!$E$25:$E$39,$S15)","v":{"v":10597.4,"d":"R$ 10,597.40"}},null,{"$f":"Cálculos!C30","v":"Garrafa Térmica 1L"},{"$f":"Cálculos!P30","v":{"v":0.12277964177420496,"d":"12.28%"}},null,{"$f":"Cálculos!C30","v":"Garrafa Térmica 1L"},{"$f":"Cálculos!N30","v":{"v":17.411381000000006,"d":"R$ 17.41"}},null,{"$f":"Cálculos!C30","v":"Garrafa Térmica 1L"},{"$f":"Cálculos!H30","v":{"v":56.725,"d":"R$ 56.73"}},{"$f":"Cálculos!I30","v":{"v":141.81,"d":"R$ 141.81"}},null,{"$f":"Cálculos!C79","v":"Agenda Executiva 2026"},{"$f":"Cálculos!D79","v":{"v":7.402934000000002,"d":"R$ 7.40"}},null,{"$f":"Cálculos!G79","v":"Assessoria Contábil Mensal"},{"$f":"Cálculos!H79","v":{"v":1054.3097203636364,"d":"R$ 1,054.31"}}]
[{"$nulls":18},"Consultoria",{"$f":"SUMIFS(Cálculos!$J$25:$J$39,Cálculos!$E$25:$E$39,$S16)","v":{"v":34389.18,"d":"R$ 34,389.18"}},null,{"$f":"Cálculos!C31","v":"Agenda Executiva 2026"},{"$f":"Cálculos!P31","v":{"v":0.07684174797591864,"d":"7.68%"}},null,{"$f":"Cálculos!C31","v":"Agenda Executiva 2026"},{"$f":"Cálculos!N31","v":{"v":7.402934000000002,"d":"R$ 7.40"}},null,{"$f":"Cálculos!C31","v":"Agenda Executiva 2026"},{"$f":"Cálculos!H31","v":{"v":38.537499999999994,"d":"R$ 38.54"}},{"$f":"Cálculos!I31","v":{"v":96.34,"d":"R$ 96.34"}},null,{"$f":"Cálculos!C80","v":"Boné Trucker"},{"$f":"Cálculos!D80","v":{"v":5.725986285714285,"d":"R$ 5.73"}},null,{"$f":"Cálculos!G80","v":"Manutenção Predial"},{"$f":"Cálculos!H80","v":{"v":430.27450645454553,"d":"R$ 430.27"}}]
[null,null,"Itens Cadastrados",null,"Cenários Simulados",null,"Margem Líquida Média",null,"MC Total",{"$nulls":9},"Design",{"$f":"SUMIFS(Cálculos!$J$25:$J$39,Cálculos!$E$25:$E$39,$S17)","v":{"v":27570.74,"d":"R$ 27,570.74"}},null,{"$f":"Cálculos!C32","v":"Boné Trucker"},{"$f":"Cálculos!P32","v":{"v":0.06453997166044054,"d":"6.45%"}},null,{"$f":"Cálculos!C32","v":"Boné Trucker"},{"$f":"Cálculos!N32","v":{"v":5.725986285714285,"d":"R$ 5.73"}},null,{"$f":"Cálculos!C32","v":"Boné Trucker"},{"$f":"Cálculos!H32","v":{"v":35.489285714285714,"d":"R$ 35.49"}},{"$f":"Cálculos!I32","v":{"v":88.72,"d":"R$ 88.72"}},null,{"$f":"Cálculos!C81","v":"Caneca Cerâmica 350ml"},{"$f":"Cálculos!D81","v":{"v":2.5742390000000057,"d":"R$ 2.57"}}]
[null,null,{"$f":"Cálculos!$D$43","v":15},null,{"$f":"Cálculos!$D$46","v":4},null,{"$f":"Cálculos!$D$53","v":{"v":0.1596586449881979,"d":"15.97%"}},null,{"$f":"Cálculos!$D$61","v":{"v":112391.98716,"d":"R$ 112,392"}},{"$nulls":9},"Manutenção",{"$f":"SUMIFS(Cálculos!$J$25:$J$39,Cálculos!$E$25:$E$39,$S18)","v":{"v":36316.979999999996,"d":"R$ 36,316.98"}},null,{"$f":"Cálculos!C33","v":"Consultoria Empresarial"},{"$f":"Cálculos!P33","v":{"v":0.21769198043739865,"d":"21.77%"}},null,{"$f":"Cálculos!C33","v":"Consultoria Empresarial"},{"$f":"Cálculos!N33","v":{"v":1247.7081166363635,"d":"R$ 1,247.71"}}]
[{"$nulls":18},"Tecnologia",{"$f":"SUMIFS(Cálculos!$J$25:$J$39,Cálculos!$E$25:$E$39,$S19)","v":{"v":74079.55,"d":"R$ 74,079.55"}},null,{"$f":"Cálculos!C34","v":"Criação de Identidade Visual"},{"$f":"Cálculos!P34","v":{"v":0.21909895851379213,"d":"21.91%"}},null,{"$f":"Cálculos!C34","v":"Criação de Identidade Visual"},{"$f":"Cálculos!N34","v":{"v":3020.3602097272747,"d":"R$ 3,020.36"}}]
[{"$nulls":18},"Contabilidade",{"$f":"SUMIFS(Cálculos!$J$25:$J$39,Cálculos!$E$25:$E$39,$S20)","v":{"v":43675.56,"d":"R$ 43,675.56"}},null,{"$f":"Cálculos!C35","v":"Manutenção Predial"},{"$f":"Cálculos!P35","v":{"v":0.21325950330071003,"d":"21.33%"}},null,{"$f":"Cálculos!C35","v":"Manutenção Predial"},{"$f":"Cálculos!N35","v":{"v":430.27450645454553,"d":"R$ 430.27"}}]
[null,null,"Produto Mais Lucrativo",null,{"$f":"Cálculos!$D$59","v":"Mochila Executiva"},null,"Serviço Mais Lucrativo",null,{"$f":"Cálculos!$D$60","v":"Desenvolvimento de Sistema"},{"$nulls":9},"Arquitetura",{"$f":"SUMIFS(Cálculos!$J$25:$J$39,Cálculos!$E$25:$E$39,$S21)","v":{"v":40027.27,"d":"R$ 40,027.27"}},null,{"$f":"Cálculos!C36","v":"Desenvolvimento de Sistema"},{"$f":"Cálculos!P36","v":{"v":0.21991373831484967,"d":"21.99%"}},null,{"$f":"Cálculos!C36","v":"Desenvolvimento de Sistema"},{"$f":"Cálculos!N36","v":{"v":16291.110773181823,"d":"R$ 16,291.11"}}]
[{"$nulls":18},"Treinamento",{"$f":"SUMIFS(Cálculos!$J$25:$J$39,Cálculos!$E$25:$E$39,$S22)","v":{"v":25840.92,"d":"R$ 25,840.92"}},null,{"$f":"Cálculos!C37","v":"Assessoria Contábil Mensal"},{"$f":"Cálculos!P37","v":{"v":0.21725622941692624,"d":"21.73%"}},null,{"$f":"Cálculos!C37","v":"Assessoria Contábil Mensal"},{"$f":"Cálculos!N37","v":{"v":1054.3097203636364,"d":"R$ 1,054.31"}}]
[null,null,"Item de Maior Margem",null,{"$f":"Cálculos!$D$57","v":"Desenvolvimento de Sistema"},null,"Item de Menor Margem",null,{"$f":"Cálculos!$D$58","v":"Caneca Cerâmica 350ml"},{"$nulls":12},{"$f":"Cálculos!C38","v":"Projeto Arquitetônico"},{"$f":"Cálculos!P38","v":{"v":0.21975520778936228,"d":"21.98%"}},null,{"$f":"Cálculos!C38","v":"Projeto Arquitetônico"},{"$f":"Cálculos!N38","v":{"v":8796.201036090906,"d":"R$ 8,796.20"}}]
[{"$nulls":21},{"$f":"Cálculos!C39","v":"Treinamento Corporativo"},{"$f":"Cálculos!P39","v":{"v":0.21796402200991155,"d":"21.80%"}},null,{"$f":"Cálculos!C39","v":"Treinamento Corporativo"},{"$f":"Cálculos!N39","v":{"v":1408.0977139090908,"d":"R$ 1,408.10"}}]
[]
[null,null,"FILTROS ANALÍTICOS"]
[]
[null,null,"Filtrar por Categoria",null,"Vestuário",null,"Itens no filtro:",null,{"$f":"COUNTIFS(Cálculos!$E$25:$E$39,$E$28,Cálculos!$D$25:$D$39,$E$29)","v":2}]
[null,null,"Filtrar por Tipo",null,"Produto",null,"Receita no filtro:",null,{"$f":"SUMIFS(Cálculos!$J$25:$J$39,Cálculos!$E$25:$E$39,$E$28,Cálculos!$D$25:$D$39,$E$29)","v":{"v":34877.4,"d":"R$ 34,877.40"}}]
[null,null,"Filtrar por Cenário",null,"Atual",null,"Lucro líquido no filtro:",null,{"$f":"SUMIFS(Cálculos!$N$25:$N$39,Cálculos!$E$25:$E$39,$E$28,Cálculos!$D$25:$D$39,$E$29)","v":{"v":17.500405285714287,"d":"R$ 17.50"}}]
[null,null,"Filtrar por Status",null,"Saudável",null,"Margem média no filtro:",null,{"$f":"IFERROR(AVERAGEIFS(Cálculos!$P$25:$P$39,Cálculos!$E$25:$E$39,$E$28,Cálculos!$D$25:$D$39,$E$29),0)","v":{"v":0.08293879984175312,"d":"8.29%"}}]
[{"$nulls":6},"Lucro do cenário selecionado:",null,{"$f":"IFERROR(INDEX('Simulador Cenários'!$D$23:$G$23,MATCH($E$30,'Simulador Cenários'!$D$7:$G$7,0)),0)","v":{"v":66223.02838707787,"d":"R$ 66,223.03"}}]
[{"$nulls":6},"Itens com o status filtrado:",null,{"$f":"COUNTIF(Cálculos!$T$25:$T$39,$E$31)","v":14}]

{"sheet":"Cadastro Geral","index":2,"n_rows":17,"n_cols":13,"rows_kept":17,"hidden":true}
[]
[null,null,"CADASTRO GERAL"]
[]
[]
[]
[]
[null,null,"ID","Tipo","Produto","Serviço","Categoria","Subcategoria","Fornecedor","Marca","Unidade","Situação","Observações"]
[null,null,"G-001","Produto","Camiseta Premium",null,"Vestuário","Camisetas","Têxtil Sul Ltda","BrandX","UN","Ativo","Best seller"]
[null,null,"G-002","Produto","Caneca Cerâmica 350ml",null,"Utilidades","Canecas","Cerâmica Vale","CasaBem","UN","Ativo"]
[null,null,"G-003","Produto","Kit Presente Gourmet",null,"Alimentos","Kits","Distrib. Gourmet","GourmetPlus","CX","Ativo","Sazonal"]
[null,null,"G-004","Produto","Mochila Executiva",null,"Acessórios","Mochilas","Couro & Cia","BrandX","UN","Ativo"]
[null,null,"G-005","Produto","Fone Bluetooth TWS",null,"Eletrônicos","Áudio","ImportTech","SoundGo","UN","Ativo"]
[null,null,"G-006","Serviço",null,"Consultoria Empresarial","Consultoria","Gestão","Interno",null,"H","Ativo","Pacote 10h"]
[null,null,"G-007","Serviço",null,"Criação de Identidade Visual","Design","Branding","Interno",null,"PROJ","Ativo"]
[null,null,"G-008","Serviço",null,"Manutenção Predial","Manutenção","Predial","Interno",null,"VISITA","Ativo"]
[null,null,"G-009","Serviço",null,"Desenvolvimento de Sistema","Tecnologia","Software","Interno",null,"PROJ","Ativo"]
[null,null,"G-010","Serviço",null,"Assessoria Contábil Mensal","Contabilidade","Fiscal","Interno",null,"MÊS","Ativo","Recorrente"]

{"sheet":"Custos Fixos","index":3,"n_rows":17,"n_cols":8,"rows_kept":17,"hidden":true}
[]
[null,null,"CUSTOS FIXOS"]
[]
[]
[]
[]
[null,null,"ID","Descrição","Categoria","Valor Mensal","Rateável","Centro de Custo"]
[null,null,"CF-01","Aluguel","Ocupação",{"v":4500,"d":"R$ 4,500.00"},"Sim","Administrativo"]
[null,null,"CF-02","Energia Elétrica (parte fixa)","Utilidades",{"v":850,"d":"R$ 850.00"},"Sim","Produção"]
[null,null,"CF-03","Internet e Telefonia","Utilidades",{"v":320,"d":"R$ 320.00"},"Sim","Administrativo"]
[null,null,"CF-04","Salários Administrativos","Pessoal",{"v":9800,"d":"R$ 9,800.00"},"Sim","Administrativo"]
[null,null,"CF-05","Pró-labore","Pessoal",{"v":6000,"d":"R$ 6,000.00"},"Sim","Administrativo"]
[null,null,"CF-06","Contabilidade","Serviços",{"v":890,"d":"R$ 890.00"},"Sim","Administrativo"]
[null,null,"CF-07","Software e Sistemas","Tecnologia",{"v":640,"d":"R$ 640.00"},"Sim","Administrativo"]
[null,null,"CF-08","Seguros","Seguros",{"v":280,"d":"R$ 280.00"},"Sim","Administrativo"]
[null,null,"CF-09","Manutenção Predial","Ocupação",{"v":450,"d":"R$ 450.00"},"Sim","Produção"]
[null,null,"CF-10","Marketing Fixo","Comercial",{"v":1500,"d":"R$ 1,500.00"},"Não","Comercial"]

{"sheet":"Custos Variáveis","index":4,"n_rows":15,"n_cols":9,"rows_kept":15,"hidden":true}
[]
[null,null,"CUSTOS VARIÁVEIS"]
[]
[]
[]
[]
[null,null,"ID","Descrição","Categoria","Valor Unitário","Percentual","Incide sobre","Observação"]
[null,null,"CV-01","Matéria-prima","Produção",{"v":8.5,"d":"R$ 8.50"},0,"Unidade","Média por peça"]
[null,null,"CV-02","Embalagem","Produção",{"v":1.8,"d":"R$ 1.80"},0,"Unidade"]
[null,null,"CV-03","Energia variável","Produção",{"v":0.95,"d":"R$ 0.95"},0,"Unidade"]
[null,null,"CV-04","Comissão de vendas","Comercial",0,{"v":0.05,"d":"5.00%"},"Preço de Venda"]
[null,null,"CV-05","Taxa de cartão","Financeiro",0,{"v":0.0349,"d":"3.49%"},"Preço de Venda"]
[null,null,"CV-06","Frete de entrega","Logística",{"v":12,"d":"R$ 12.00"},0,"Pedido"]
[null,null,"CV-07","Taxa marketplace","Comercial",0,{"v":0.16,"d":"16.00%"},"Preço de Venda"]
[null,null,"CV-08","Perdas e quebras","Produção",0,{"v":0.02,"d":"2.00%"},"Custo"]

{"sheet":"Tributos","index":5,"n_rows":12,"n_cols":12,"rows_kept":12,"hidden":true}
[]
[null,null,"TRIBUTOS"]
[]
[]
[]
[]
[null,null,"Regime","ICMS","IPI","PIS","COFINS","ISS","Simples","IRPJ/CSLL","Outros","Carga Total"]
[null,null,"Simples Nacional",0,0,0,0,0,{"v":0.085,"d":"8.50%"},0,0,{"$f":"SUM(D8:K8)","v":{"v":0.085,"d":"8.50%"}}]
[null,null,"Lucro Presumido",{"v":0.18,"d":"18.00%"},0,{"v":0.0065,"d":"0.65%"},{"v":0.03,"d":"3.00%"},0,0,{"v":0.0308,"d":"3.08%"},0,{"$f":"SUM(D9:K9)","v":{"v":0.2473,"d":"24.73%"}}]
[null,null,"Lucro Real",{"v":0.18,"d":"18.00%"},0,{"v":0.0165,"d":"1.65%"},{"v":0.076,"d":"7.60%"},0,0,{"v":0.034,"d":"3.40%"},0,{"$f":"SUM(D10:K10)","v":{"v":0.3065,"d":"30.65%"}}]
[null,null,"Serviços - Simples",0,0,0,0,0,{"v":0.06,"d":"6.00%"},0,0,{"$f":"SUM(D11:K11)","v":{"v":0.06,"d":"6.00%"}}]
[null,null,"Serviços - Presumido",0,0,{"v":0.0065,"d":"0.65%"},{"v":0.03,"d":"3.00%"},{"v":0.05,"d":"5.00%"},0,{"v":0.0308,"d":"3.08%"},0,{"$f":"SUM(D12:K12)","v":{"v":0.11729999999999999,"d":"11.73%"}}]

{"sheet":"Despesas Comerciais","index":6,"n_rows":14,"n_cols":9,"rows_kept":14,"hidden":true}
[]
[null,null,"DESPESAS COMERCIAIS"]
[]
[]
[]
[]
[null,null,"ID","Descrição","Tipo","Percentual","Valor Fixo","Incide sobre","Observação"]
[null,null,"DC-01","Comissão","Percentual",{"v":0.05,"d":"5.00%"},0,"Preço de Venda"]
[null,null,"DC-02","Marketplace","Percentual",{"v":0.16,"d":"16.00%"},0,"Preço de Venda","Média marketplaces"]
[null,null,"DC-03","Cartão / Gateway","Percentual",{"v":0.0349,"d":"3.49%"},0,"Preço de Venda"]
[null,null,"DC-04","Frete","Valor Fixo",0,{"v":12,"d":"R$ 12.00"},"Pedido"]
[null,null,"DC-05","Marketing","Percentual",{"v":0.04,"d":"4.00%"},0,"Preço de Venda"]
[null,null,"DC-06","Embalagem","Valor Fixo",0,{"v":1.8,"d":"R$ 1.80"},"Unidade"]
[null,null,"DC-07","Outros","Percentual",{"v":0.01,"d":"1.00%"},0,"Preço de Venda"]

{"sheet":"Produtos","index":7,"n_rows":15,"n_cols":13,"rows_kept":15,"hidden":true}
[]
[null,null,"PRODUTOS"]
[]
[]
[]
[]
[null,null,"Código","Produto","Categoria","Fornecedor","Custo Compra","IPI","Frete","Seguro","Outras Despesas","Quantidade","Custo Unitário"]
[null,null,"P-001","Camiseta Premium","Vestuário","Têxtil Sul Ltda",{"v":22,"d":"R$ 22.00"},0,{"v":180,"d":"R$ 180.00"},{"v":15,"d":"R$ 15.00"},{"v":40,"d":"R$ 40.00"},50,{"$f":"IFERROR((G8*(1+H8)*L8+I8+J8+K8)/L8,0)","v":{"v":26.7,"d":"R$ 26.70"}}]
[null,null,"P-002","Caneca Cerâmica 350ml","Utilidades","Cerâmica Vale",{"v":8.5,"d":"R$ 8.50"},0,{"v":120,"d":"R$ 120.00"},{"v":8,"d":"R$ 8.00"},{"v":20,"d":"R$ 20.00"},100,{"v":9.98,"d":"R$ 9.98"}]
[null,null,"P-003","Kit Presente Gourmet","Alimentos","Distrib. Gourmet",{"v":45,"d":"R$ 45.00"},0,{"v":90,"d":"R$ 90.00"},{"v":10,"d":"R$ 10.00"},{"v":35,"d":"R$ 35.00"},30,{"v":49.5,"d":"R$ 49.50"}]
[null,null,"P-004","Mochila Executiva","Acessórios","Couro & Cia",{"v":78,"d":"R$ 78.00"},0,{"v":150,"d":"R$ 150.00"},{"v":20,"d":"R$ 20.00"},{"v":50,"d":"R$ 50.00"},25,{"v":86.8,"d":"R$ 86.80"}]
[null,null,"P-005","Fone Bluetooth TWS","Eletrônicos","ImportTech",{"v":62,"d":"R$ 62.00"},{"v":0.065,"d":"6.50%"},{"v":220,"d":"R$ 220.00"},{"v":30,"d":"R$ 30.00"},{"v":60,"d":"R$ 60.00"},40,{"v":73.78,"d":"R$ 73.78"}]
[null,null,"P-006","Garrafa Térmica 1L","Utilidades","ImportTech",{"v":34,"d":"R$ 34.00"},0,{"v":140,"d":"R$ 140.00"},{"v":12,"d":"R$ 12.00"},{"v":25,"d":"R$ 25.00"},60,{"v":36.95,"d":"R$ 36.95"}]
[null,null,"P-007","Agenda Executiva 2026","Papelaria","Gráfica Central",{"v":17.5,"d":"R$ 17.50"},0,{"v":80,"d":"R$ 80.00"},{"v":6,"d":"R$ 6.00"},{"v":15,"d":"R$ 15.00"},80,{"v":18.7625,"d":"R$ 18.76"}]
[null,null,"P-008","Boné Trucker","Vestuário","Têxtil Sul Ltda",{"v":14,"d":"R$ 14.00"},0,{"v":95,"d":"R$ 95.00"},{"v":7,"d":"R$ 7.00"},{"v":18,"d":"R$ 18.00"},70,{"v":15.714285714285714,"d":"R$ 15.71"}]

{"sheet":"Serviços","index":8,"n_rows":14,"n_cols":11,"rows_kept":14,"hidden":true}
[]
[null,null,"SERVIÇOS"]
[]
[]
[]
[]
[null,null,"Código","Serviço","Categoria","Tempo (h)","Valor Hora","Custos Diretos","Custos Indiretos","Despesas","Custo Total"]
[null,null,"S-001","Consultoria Empresarial","Consultoria",10,{"v":180,"d":"R$ 180.00"},{"v":150,"d":"R$ 150.00"},{"v":90,"d":"R$ 90.00"},{"v":60,"d":"R$ 60.00"},{"$f":"IFERROR(F8*G8+H8+I8+J8,0)","v":{"v":2100,"d":"R$ 2,100.00"}}]
[null,null,"S-002","Criação de Identidade Visual","Design",35,{"v":120,"d":"R$ 120.00"},{"v":320,"d":"R$ 320.00"},{"v":180,"d":"R$ 180.00"},{"v":140,"d":"R$ 140.00"},{"v":4840,"d":"R$ 4,840.00"}]
[null,null,"S-003","Manutenção Predial","Manutenção",4,{"v":95,"d":"R$ 95.00"},{"v":210,"d":"R$ 210.00"},{"v":60,"d":"R$ 60.00"},{"v":80,"d":"R$ 80.00"},{"v":730,"d":"R$ 730.00"}]
[null,null,"S-004","Desenvolvimento de Sistema","Tecnologia",160,{"v":145,"d":"R$ 145.00"},{"v":1800,"d":"R$ 1,800.00"},{"v":900,"d":"R$ 900.00"},{"v":650,"d":"R$ 650.00"},{"v":26550,"d":"R$ 26,550.00"}]
[null,null,"S-005","Assessoria Contábil Mensal","Contabilidade",12,{"v":110,"d":"R$ 110.00"},{"v":180,"d":"R$ 180.00"},{"v":120,"d":"R$ 120.00"},{"v":90,"d":"R$ 90.00"},{"v":1710,"d":"R$ 1,710.00"}]
[null,null,"S-006","Projeto Arquitetônico","Arquitetura",80,{"v":160,"d":"R$ 160.00"},{"v":900,"d":"R$ 900.00"},{"v":450,"d":"R$ 450.00"},{"v":320,"d":"R$ 320.00"},{"v":14470,"d":"R$ 14,470.00"}]
[null,null,"S-007","Treinamento Corporativo","Treinamento",8,{"v":220,"d":"R$ 220.00"},{"v":400,"d":"R$ 400.00"},{"v":120,"d":"R$ 120.00"},{"v":150,"d":"R$ 150.00"},{"v":2430,"d":"R$ 2,430.00"}]

{"sheet":"Funcionários","index":9,"n_rows":14,"n_cols":8,"rows_kept":14,"hidden":true}
[]
[null,null,"FUNCIONÁRIOS"]
[]
[]
[]
[]
[null,null,"Nome","Cargo","Salário","Encargos (%)","Horas Mensais","Valor Hora"]
[null,null,"Ana Souza","Consultora Sênior",{"v":7800,"d":"R$ 7,800.00"},{"v":0.68,"d":"68.00%"},176,{"$f":"IFERROR(E8*(1+F8)/G8,0)","v":{"v":74.45454545454547,"d":"R$ 74.45"}}]
[null,null,"Bruno Lima","Designer Gráfico",{"v":5200,"d":"R$ 5,200.00"},{"v":0.68,"d":"68.00%"},176,{"v":49.63636363636363,"d":"R$ 49.64"}]
[null,null,"Carla Mendes","Desenvolvedora",{"v":9500,"d":"R$ 9,500.00"},{"v":0.68,"d":"68.00%"},176,{"v":90.68181818181819,"d":"R$ 90.68"}]
[null,null,"Diego Alves","Técnico de Manutenção",{"v":3400,"d":"R$ 3,400.00"},{"v":0.72,"d":"72.00%"},176,{"v":33.22727272727273,"d":"R$ 33.23"}]
[null,null,"Elaine Costa","Analista Contábil",{"v":4600,"d":"R$ 4,600.00"},{"v":0.68,"d":"68.00%"},176,{"v":43.909090909090914,"d":"R$ 43.91"}]
[null,null,"Fábio Rocha","Arquiteto",{"v":8200,"d":"R$ 8,200.00"},{"v":0.68,"d":"68.00%"},176,{"v":78.27272727272728,"d":"R$ 78.27"}]
[null,null,"Gabriela Dias","Auxiliar de Produção",{"v":2400,"d":"R$ 2,400.00"},{"v":0.72,"d":"72.00%"},176,{"v":23.454545454545453,"d":"R$ 23.45"}]

{"sheet":"Máquinas","index":10,"n_rows":13,"n_cols":8,"rows_kept":13,"hidden":true}
[]
[null,null,"MÁQUINAS"]
[]
[]
[]
[]
[null,null,"Máquina","Valor de Aquisição","Vida Útil (anos)","Depreciação Mensal","Horas Disponíveis/mês","Custo Hora"]
[null,null,"Impressora DTF",{"v":42000,"d":"R$ 42,000.00"},10,{"$f":"IFERROR(D8/(E8*12),0)","v":{"v":350,"d":"R$ 350.00"}},160,{"$f":"IFERROR(F8/G8,0)","v":{"v":2.1875,"d":"R$ 2.19"}}]
[null,null,"Prensa Térmica",{"v":8500,"d":"R$ 8,500.00"},8,{"v":88.54166666666667,"d":"R$ 88.54"},160,{"v":0.5533854166666667,"d":"R$ 0.55"}]
[null,null,"Torno CNC",{"v":96000,"d":"R$ 96,000.00"},12,{"v":666.6666666666666,"d":"R$ 666.67"},180,{"v":3.7037037037037033,"d":"R$ 3.70"}]
[null,null,"Compressor Industrial",{"v":14500,"d":"R$ 14,500.00"},10,{"v":120.83333333333333,"d":"R$ 120.83"},180,{"v":0.6712962962962963,"d":"R$ 0.67"}]
[null,null,"Máquina de Corte Laser",{"v":68000,"d":"R$ 68,000.00"},10,{"v":566.6666666666666,"d":"R$ 566.67"},160,{"v":3.5416666666666665,"d":"R$ 3.54"}]
[null,null,"Forno Industrial",{"v":23000,"d":"R$ 23,000.00"},8,{"v":239.58333333333334,"d":"R$ 239.58"},200,{"v":1.1979166666666667,"d":"R$ 1.20"}]

{"sheet":"Prec Markup","index":11,"n_rows":22,"n_cols":13,"rows_kept":22,"hidden":true}
[]
[null,null,"PREC MARKUP"]
[]
[]
[]
[]
[null,null,"Item","Tipo","Custo Total","Markup","Preço de Venda","Lucro Bruto","Margem Bruta %","Tributos","Desp. Comerciais","Lucro Líquido","Margem Líquida %"]
[null,null,{"$f":"Cálculos!C25","v":"Camiseta Premium"},{"$f":"Cálculos!D25","v":"Produto"},{"$f":"Cálculos!H25","v":{"v":46.474999999999994,"d":"R$ 46.48"}},{"$f":"Cálculos!$D$17","v":{"v":2.5,"d":"2.50x"}},{"$f":"ROUND(E8*F8,2)","v":{"v":116.19,"d":"R$ 116.19"}},{"$f":"G8-E8","v":{"v":69.715,"d":"R$ 69.72"}},{"$f":"IFERROR(H8/G8,0)","v":{"v":0.60000860659265,"d":"60.00%"}},{"$f":"G8*Cálculos!$D$10","v":{"v":9.87615,"d":"R$ 9.88"}},{"$f":"G8*Cálculos!$D$15+Cálculos!$D$16","v":{"v":48.064431,"d":"R$ 48.06"}},{"$f":"G8-E8-J8-K8","v":{"v":11.774419000000002,"d":"R$ 11.77"}},{"$f":"IFERROR(L8/G8,0)","v":{"v":0.10133762802306569,"d":"10.13%"}}]
[null,null,{"$f":"Cálculos!C26","v":"Caneca Cerâmica 350ml"},{"$f":"Cálculos!D26","v":"Produto"},{"$f":"Cálculos!H26","v":{"v":29.755,"d":"R$ 29.76"}},{"$f":"Cálculos!$D$17","v":{"v":2.5,"d":"2.50x"}},{"v":74.39,"d":"R$ 74.39"},{"v":44.635000000000005,"d":"R$ 44.64"},{"v":0.6000134426670252,"d":"60.00%"},{"$f":"G9*Cálculos!$D$10","v":{"v":6.323150000000001,"d":"R$ 6.32"}},{"$f":"G9*Cálculos!$D$15+Cálculos!$D$16","v":{"v":35.737611,"d":"R$ 35.74"}},{"v":2.5742390000000057,"d":"R$ 2.57"},{"v":0.034604637720123746,"d":"3.46%"}]
[null,null,{"$f":"Cálculos!C27","v":"Kit Presente Gourmet"},{"$f":"Cálculos!D27","v":"Produto"},{"$f":"Cálculos!H27","v":{"v":69.275,"d":"R$ 69.28"}},{"$f":"Cálculos!$D$17","v":{"v":2.5,"d":"2.50x"}},{"v":173.19,"d":"R$ 173.19"},{"v":103.91499999999999,"d":"R$ 103.92"},{"v":0.6000057740054275,"d":"60.00%"},{"$f":"G10*Cálculos!$D$10","v":{"v":14.721150000000002,"d":"R$ 14.72"}},{"$f":"G10*Cálculos!$D$15+Cálculos!$D$16","v":{"v":64.87373099999999,"d":"R$ 64.87"}},{"v":24.320119000000005,"d":"R$ 24.32"},{"v":0.1404244991050292,"d":"14.04%"}]
[null,null,{"$f":"Cálculos!C28","v":"Mochila Executiva"},{"$f":"Cálculos!D28","v":"Produto"},{"$f":"Cálculos!H28","v":{"v":106.57499999999999,"d":"R$ 106.58"}},{"$f":"Cálculos!$D$17","v":{"v":2.5,"d":"2.50x"}},{"v":266.44,"d":"R$ 266.44"},{"v":159.865,"d":"R$ 159.87"},{"v":0.6000037531902117,"d":"60.00%"},{"$f":"G11*Cálculos!$D$10","v":{"v":22.6474,"d":"R$ 22.65"}},{"$f":"G11*Cálculos!$D$15+Cálculos!$D$16","v":{"v":92.373156,"d":"R$ 92.37"}},{"v":44.84444400000001,"d":"R$ 44.84"},{"v":0.1683097282690287,"d":"16.83%"}]
[null,null,{"$f":"Cálculos!C29","v":"Fone Bluetooth TWS"},{"$f":"Cálculos!D29","v":"Produto"},{"$f":"Cálculos!H29","v":{"v":93.555,"d":"R$ 93.56"}},{"$f":"Cálculos!$D$17","v":{"v":2.5,"d":"2.50x"}},{"v":233.89,"d":"R$ 233.89"},{"v":140.33499999999998,"d":"R$ 140.34"},{"v":0.6000042755141305,"d":"60.00%"},{"$f":"G12*Cálculos!$D$10","v":{"v":19.88065,"d":"R$ 19.88"}},{"$f":"G12*Cálculos!$D$15+Cálculos!$D$16","v":{"v":82.77416099999999,"d":"R$ 82.77"}},{"v":37.680188999999984,"d":"R$ 37.68"},{"v":0.16110218051220654,"d":"16.11%"}]
[null,null,{"$f":"Cálculos!C30","v":"Garrafa Térmica 1L"},{"$f":"Cálculos!D30","v":"Produto"},{"$f":"Cálculos!H30","v":{"v":56.725,"d":"R$ 56.73"}},{"$f":"Cálculos!$D$17","v":{"v":2.5,"d":"2.50x"}},{"v":141.81,"d":"R$ 141.81"},{"v":85.08500000000001,"d":"R$ 85.09"},{"v":0.5999929483111206,"d":"60.00%"},{"$f":"G13*Cálculos!$D$10","v":{"v":12.05385,"d":"R$ 12.05"}},{"$f":"G13*Cálculos!$D$15+Cálculos!$D$16","v":{"v":55.619769000000005,"d":"R$ 55.62"}},{"v":17.411381000000006,"d":"R$ 17.41"},{"v":0.12277964177420496,"d":"12.28%"}]
[null,null,{"$f":"Cálculos!C31","v":"Agenda Executiva 2026"},{"$f":"Cálculos!D31","v":"Produto"},{"$f":"Cálculos!H31","v":{"v":38.537499999999994,"d":"R$ 38.54"}},{"$f":"Cálculos!$D$17","v":{"v":2.5,"d":"2.50x"}},{"v":96.34,"d":"R$ 96.34"},{"v":57.80250000000001,"d":"R$ 57.80"},{"v":0.5999844301432428,"d":"60.00%"},{"$f":"G14*Cálculos!$D$10","v":{"v":8.1889,"d":"R$ 8.19"}},{"$f":"G14*Cálculos!$D$15+Cálculos!$D$16","v":{"v":42.210666,"d":"R$ 42.21"}},{"v":7.402934000000002,"d":"R$ 7.40"},{"v":0.07684174797591864,"d":"7.68%"}]
[null,null,{"$f":"Cálculos!C32","v":"Boné Trucker"},{"$f":"Cálculos!D32","v":"Produto"},{"$f":"Cálculos!H32","v":{"v":35.489285714285714,"d":"R$ 35.49"}},{"$f":"Cálculos!$D$17","v":{"v":2.5,"d":"2.50x"}},{"v":88.72,"d":"R$ 88.72"},{"v":53.230714285714285,"d":"R$ 53.23"},{"v":0.5999855081798274,"d":"60.00%"},{"$f":"G15*Cálculos!$D$10","v":{"v":7.541200000000001,"d":"R$ 7.54"}},{"$f":"G15*Cálculos!$D$15+Cálculos!$D$16","v":{"v":39.963528,"d":"R$ 39.96"}},{"v":5.725986285714285,"d":"R$ 5.73"},{"v":0.06453997166044054,"d":"6.45%"}]
[null,null,{"$f":"Cálculos!C33","v":"Consultoria Empresarial"},{"$f":"Cálculos!D33","v":"Serviço"},{"$f":"Cálculos!H33","v":{"v":2292.6136363636365,"d":"R$ 2,292.61"}},{"$f":"Cálculos!$D$17","v":{"v":2.5,"d":"2.50x"}},{"v":5731.53,"d":"R$ 5,731.53"},{"v":3438.9163636363633,"d":"R$ 3,438.92"},{"v":0.5999997144979374,"d":"60.00%"},{"$f":"G16*Cálculos!$D$10","v":{"v":487.18005,"d":"R$ 487.18"}},{"$f":"G16*Cálculos!$D$15+Cálculos!$D$16","v":{"v":1704.0281969999999,"d":"R$ 1,704.03"}},{"v":1247.7081166363635,"d":"R$ 1,247.71"},{"v":0.21769198043739865,"d":"21.77%"}]
[null,null,{"$f":"Cálculos!C34","v":"Criação de Identidade Visual"},{"$f":"Cálculos!D34","v":"Serviço"},{"$f":"Cálculos!H34","v":{"v":5514.147727272727,"d":"R$ 5,514.15"}},{"$f":"Cálculos!$D$17","v":{"v":2.5,"d":"2.50x"}},{"v":13785.37,"d":"R$ 13,785.37"},{"v":8271.222272727275,"d":"R$ 8,271.22"},{"v":0.6000000197838197,"d":"60.00%"},{"$f":"G17*Cálculos!$D$10","v":{"v":1171.75645,"d":"R$ 1,171.76"}},{"$f":"G17*Cálculos!$D$15+Cálculos!$D$16","v":{"v":4079.105613,"d":"R$ 4,079.11"}},{"v":3020.3602097272747,"d":"R$ 3,020.36"},{"v":0.21909895851379213,"d":"21.91%"}]
[null,null,{"$f":"Cálculos!C35","v":"Manutenção Predial"},{"$f":"Cálculos!D35","v":"Serviço"},{"$f":"Cálculos!H35","v":{"v":807.0454545454545,"d":"R$ 807.05"}},{"$f":"Cálculos!$D$17","v":{"v":2.5,"d":"2.50x"}},{"v":2017.61,"d":"R$ 2,017.61"},{"v":1210.5645454545454,"d":"R$ 1,210.56"},{"v":0.5999992790750172,"d":"60.00%"},{"$f":"G18*Cálculos!$D$10","v":{"v":171.49685,"d":"R$ 171.50"}},{"$f":"G18*Cálculos!$D$15+Cálculos!$D$16","v":{"v":608.7931889999999,"d":"R$ 608.79"}},{"v":430.27450645454553,"d":"R$ 430.27"},{"v":0.21325950330071003,"d":"21.33%"}]
[null,null,{"$f":"Cálculos!C36","v":"Desenvolvimento de Sistema"},{"$f":"Cálculos!D36","v":"Serviço"},{"$f":"Cálculos!H36","v":{"v":29631.818181818184,"d":"R$ 29,631.82"}},{"$f":"Cálculos!$D$17","v":{"v":2.5,"d":"2.50x"}},{"v":74079.55,"d":"R$ 74,079.55"},{"v":44447.73181818182,"d":"R$ 44,447.73"},{"v":0.6000000245436401,"d":"60.00%"},{"$f":"G19*Cálculos!$D$10","v":{"v":6296.761750000001,"d":"R$ 6,296.76"}},{"$f":"G19*Cálculos!$D$15+Cálculos!$D$16","v":{"v":21859.859295,"d":"R$ 21,859.86"}},{"v":16291.110773181823,"d":"R$ 16,291.11"},{"v":0.21991373831484967,"d":"21.99%"}]
[null,null,{"$f":"Cálculos!C37","v":"Assessoria Contábil Mensal"},{"$f":"Cálculos!D37","v":"Serviço"},{"$f":"Cálculos!H37","v":{"v":1941.1363636363637,"d":"R$ 1,941.14"}},{"$f":"Cálculos!$D$17","v":{"v":2.5,"d":"2.50x"}},{"v":4852.84,"d":"R$ 4,852.84"},{"v":2911.703636363636,"d":"R$ 2,911.70"},{"v":0.5999999250673083,"d":"60.00%"},{"$f":"G20*Cálculos!$D$10","v":{"v":412.49140000000006,"d":"R$ 412.49"}},{"$f":"G20*Cálculos!$D$15+Cálculos!$D$16","v":{"v":1444.9025159999999,"d":"R$ 1,444.90"}},{"v":1054.3097203636364,"d":"R$ 1,054.31"},{"v":0.21725622941692624,"d":"21.73%"}]
[null,null,{"$f":"Cálculos!C38","v":"Projeto Arquitetônico"},{"$f":"Cálculos!D38","v":"Serviço"},{"$f":"Cálculos!H38","v":{"v":16010.909090909092,"d":"R$ 16,010.91"}},{"$f":"Cálculos!$D$17","v":{"v":2.5,"d":"2.50x"}},{"v":40027.27,"d":"R$ 40,027.27"},{"v":24016.360909090905,"d":"R$ 24,016.36"},{"v":0.5999999727458531,"d":"60.00%"},{"$f":"G21*Cálculos!$D$10","v":{"v":3402.31795,"d":"R$ 3,402.32"}},{"$f":"G21*Cálculos!$D$15+Cálculos!$D$16","v":{"v":11817.841922999998,"d":"R$ 11,817.84"}},{"v":8796.201036090906,"d":"R$ 8,796.20"},{"v":0.21975520778936228,"d":"21.98%"}]
[null,null,{"$f":"Cálculos!C39","v":"Treinamento Corporativo"},{"$f":"Cálculos!D39","v":"Serviço"},{"$f":"Cálculos!H39","v":{"v":2584.090909090909,"d":"R$ 2,584.09"}},{"$f":"Cálculos!$D$17","v":{"v":2.5,"d":"2.50x"}},{"v":6460.23,"d":"R$ 6,460.23"},{"v":3876.1390909090906,"d":"R$ 3,876.14"},{"v":0.600000168865364,"d":"60.00%"},{"$f":"G22*Cálculos!$D$10","v":{"v":549.11955,"d":"R$ 549.12"}},{"$f":"G22*Cálculos!$D$15+Cálculos!$D$16","v":{"v":1918.921827,"d":"R$ 1,918.92"}},{"v":1408.0977139090908,"d":"R$ 1,408.10"},{"v":0.21796402200991155,"d":"21.80%"}]

{"sheet":"Prec Margem","index":12,"n_rows":22,"n_cols":13,"rows_kept":22,"hidden":true}
[]
[null,null,"PREC MARGEM"]
[]
[]
[]
[]
[null,null,"Item","Tipo","Custo Total","Margem Desejada %","Preço de Venda","Lucro Bruto","Tributos","Desp. Comerciais","Lucro Líquido","Margem Líquida Real %","Markup Implícito"]
[null,null,{"$f":"Cálculos!C25","v":"Camiseta Premium"},{"$f":"Cálculos!D25","v":"Produto"},{"$f":"Cálculos!H25","v":{"v":46.474999999999994,"d":"R$ 46.48"}},{"$f":"Cálculos!$D$18","v":{"v":0.25,"d":"25.00%"}},{"$f":"IFERROR(ROUND((E8+Cálculos!$D$16)/(1-F8-Cálculos!$D$10-Cálculos!$D$15),2),0)","v":{"v":162.86,"d":"R$ 162.86"}},{"$f":"G8-E8","v":{"v":116.38500000000002,"d":"R$ 116.39"}},{"$f":"G8*Cálculos!$D$10","v":{"v":13.843100000000002,"d":"R$ 13.84"}},{"$f":"G8*Cálculos!$D$15+Cálculos!$D$16","v":{"v":61.827414000000005,"d":"R$ 61.83"}},{"$f":"G8-E8-I8-J8","v":{"v":40.71448600000001,"d":"R$ 40.71"}},{"$f":"IFERROR(K8/G8,0)","v":{"v":0.24999684391501906,"d":"25.00%"}},{"$f":"IFERROR(G8/E8,0)","v":{"v":3.5042495965572895,"d":"3.50x"}}]
[null,null,{"$f":"Cálculos!C26","v":"Caneca Cerâmica 350ml"},{"$f":"Cálculos!D26","v":"Produto"},{"$f":"Cálculos!H26","v":{"v":29.755,"d":"R$ 29.76"}},{"$f":"Cálculos!$D$18","v":{"v":0.25,"d":"25.00%"}},{"$f":"IFERROR(ROUND((E9+Cálculos!$D$16)/(1-F9-Cálculos!$D$10-Cálculos!$D$15),2),0)","v":{"v":117.68,"d":"R$ 117.68"}},{"v":87.92500000000001,"d":"R$ 87.93"},{"$f":"G9*Cálculos!$D$10","v":{"v":10.0028,"d":"R$ 10.00"}},{"$f":"G9*Cálculos!$D$15+Cálculos!$D$16","v":{"v":48.503832,"d":"R$ 48.50"}},{"v":29.418368,"d":"R$ 29.42"},{"v":0.24998613188307273,"d":"25.00%"},{"v":3.9549655520080664,"d":"3.95x"}]
[null,null,{"$f":"Cálculos!C27","v":"Kit Presente Gourmet"},{"$f":"Cálculos!D27","v":"Produto"},{"$f":"Cálculos!H27","v":{"v":69.275,"d":"R$ 69.28"}},{"$f":"Cálculos!$D$18","v":{"v":0.25,"d":"25.00%"}},{"$f":"IFERROR(ROUND((E10+Cálculos!$D$16)/(1-F10-Cálculos!$D$10-Cálculos!$D$15),2),0)","v":{"v":224.47,"d":"R$ 224.47"}},{"v":155.195,"d":"R$ 155.20"},{"$f":"G10*Cálculos!$D$10","v":{"v":19.07995,"d":"R$ 19.08"}},{"$f":"G10*Cálculos!$D$15+Cálculos!$D$16","v":{"v":79.996203,"d":"R$ 80.00"}},{"v":56.118847,"d":"R$ 56.12"},{"v":0.2500060008018889,"d":"25.00%"},{"v":3.240274269216889,"d":"3.24x"}]
[null,null,{"$f":"Cálculos!C28","v":"Mochila Executiva"},{"$f":"Cálculos!D28","v":"Produto"},{"$f":"Cálculos!H28","v":{"v":106.57499999999999,"d":"R$ 106.58"}},{"$f":"Cálculos!$D$18","v":{"v":0.25,"d":"25.00%"}},{"$f":"IFERROR(ROUND((E11+Cálculos!$D$16)/(1-F11-Cálculos!$D$10-Cálculos!$D$15),2),0)","v":{"v":325.25,"d":"R$ 325.25"}},{"v":218.675,"d":"R$ 218.68"},{"$f":"G11*Cálculos!$D$10","v":{"v":27.646250000000002,"d":"R$ 27.65"}},{"$f":"G11*Cálculos!$D$15+Cálculos!$D$16","v":{"v":109.716225,"d":"R$ 109.72"}},{"v":81.31252500000001,"d":"R$ 81.31"},{"v":0.2500000768639508,"d":"25.00%"},{"v":3.051841426225663,"d":"3.05x"}]
[null,null,{"$f":"Cálculos!C29","v":"Fone Bluetooth TWS"},{"$f":"Cálculos!D29","v":"Produto"},{"$f":"Cálculos!H29","v":{"v":93.555,"d":"R$ 93.56"}},{"$f":"Cálculos!$D$18","v":{"v":0.25,"d":"25.00%"}},{"$f":"IFERROR(ROUND((E12+Cálculos!$D$16)/(1-F12-Cálculos!$D$10-Cálculos!$D$15),2),0)","v":{"v":290.07,"d":"R$ 290.07"}},{"v":196.515,"d":"R$ 196.52"},{"$f":"G12*Cálculos!$D$10","v":{"v":24.65595,"d":"R$ 24.66"}},{"$f":"G12*Cálculos!$D$15+Cálculos!$D$16","v":{"v":99.34164299999999,"d":"R$ 99.34"}},{"v":72.517407,"d":"R$ 72.52"},{"v":0.24999967938773401,"d":"25.00%"},{"v":3.1005291005291,"d":"3.10x"}]
[null,null,{"$f":"Cálculos!C30","v":"Garrafa Térmica 1L"},{"$f":"Cálculos!D30","v":"Produto"},{"$f":"Cálculos!H30","v":{"v":56.725,"d":"R$ 56.73"}},{"$f":"Cálculos!$D$18","v":{"v":0.25,"d":"25.00%"}},{"$f":"IFERROR(ROUND((E13+Cálculos!$D$16)/(1-F13-Cálculos!$D$10-Cálculos!$D$15),2),0)","v":{"v":190.56,"d":"R$ 190.56"}},{"v":133.835,"d":"R$ 133.84"},{"$f":"G13*Cálculos!$D$10","v":{"v":16.1976,"d":"R$ 16.20"}},{"$f":"G13*Cálculos!$D$15+Cálculos!$D$16","v":{"v":69.996144,"d":"R$ 70.00"}},{"v":47.64125600000001,"d":"R$ 47.64"},{"v":0.2500065910999161,"d":"25.00%"},{"v":3.35936535918907,"d":"3.36x"}]
[null,null,{"$f":"Cálculos!C31","v":"Agenda Executiva 2026"},{"$f":"Cálculos!D31","v":"Produto"},{"$f":"Cálculos!H31","v":{"v":38.537499999999994,"d":"R$ 38.54"}},{"$f":"Cálculos!$D$18","v":{"v":0.25,"d":"25.00%"}},{"$f":"IFERROR(ROUND((E14+Cálculos!$D$16)/(1-F14-Cálculos!$D$10-Cálculos!$D$15),2),0)","v":{"v":141.41,"d":"R$ 141.41"}},{"v":102.8725,"d":"R$ 102.87"},{"$f":"G14*Cálculos!$D$10","v":{"v":12.01985,"d":"R$ 12.02"}},{"$f":"G14*Cálculos!$D$15+Cálculos!$D$16","v":{"v":55.501808999999994,"d":"R$ 55.50"}},{"v":35.350841,"d":"R$ 35.35"},{"v":0.2499882681564246,"d":"25.00%"},{"v":3.6694129095037304,"d":"3.67x"}]
[null,null,{"$f":"Cálculos!C32","v":"Boné Trucker"},{"$f":"Cálculos!D32","v":"Produto"},{"$f":"Cálculos!H32","v":{"v":35.489285714285714,"d":"R$ 35.49"}},{"$f":"Cálculos!$D$18","v":{"v":0.25,"d":"25.00%"}},{"$f":"IFERROR(ROUND((E15+Cálculos!$D$16)/(1-F15-Cálculos!$D$10-Cálculos!$D$15),2),0)","v":{"v":133.18,"d":"R$ 133.18"}},{"v":97.6907142857143,"d":"R$ 97.69"},{"$f":"G15*Cálculos!$D$10","v":{"v":11.320300000000001,"d":"R$ 11.32"}},{"$f":"G15*Cálculos!$D$15+Cálculos!$D$16","v":{"v":53.074782,"d":"R$ 53.07"}},{"v":33.29563228571429,"d":"R$ 33.30"},{"v":0.25000474760260016,"d":"25.00%"},{"v":3.75268189594445,"d":"3.75x"}]
[null,null,{"$f":"Cálculos!C33","v":"Consultoria Empresarial"},{"$f":"Cálculos!D33","v":"Serviço"},{"$f":"Cálculos!H33","v":{"v":2292.6136363636365,"d":"R$ 2,292.61"}},{"$f":"Cálculos!$D$18","v":{"v":0.25,"d":"25.00%"}},{"$f":"IFERROR(ROUND((E16+Cálculos!$D$16)/(1-F16-Cálculos!$D$10-Cálculos!$D$15),2),0)","v":{"v":6231.87,"d":"R$ 6,231.87"}},{"v":3939.2563636363634,"d":"R$ 3,939.26"},{"$f":"G16*Cálculos!$D$10","v":{"v":529.7089500000001,"d":"R$ 529.71"}},{"$f":"G16*Cálculos!$D$15+Cálculos!$D$16","v":{"v":1851.5784629999998,"d":"R$ 1,851.58"}},{"v":1557.9689506363634,"d":"R$ 1,557.97"},{"v":0.25000023277705785,"d":"25.00%"},{"v":2.7182382156133826,"d":"2.72x"}]
[null,null,{"$f":"Cálculos!C34","v":"Criação de Identidade Visual"},{"$f":"Cálculos!D34","v":"Serviço"},{"$f":"Cálculos!H34","v":{"v":5514.147727272727,"d":"R$ 5,514.15"}},{"$f":"Cálculos!$D$18","v":{"v":0.25,"d":"25.00%"}},{"$f":"IFERROR(ROUND((E17+Cálculos!$D$16)/(1-F17-Cálculos!$D$10-Cálculos!$D$15),2),0)","v":{"v":14936.36,"d":"R$ 14,936.36"}},{"v":9422.212272727273,"d":"R$ 9,422.21"},{"$f":"G17*Cálculos!$D$10","v":{"v":1269.5906000000002,"d":"R$ 1,269.59"}},{"$f":"G17*Cálculos!$D$15+Cálculos!$D$16","v":{"v":4418.532564,"d":"R$ 4,418.53"}},{"v":3734.089108727272,"d":"R$ 3,734.09"},{"v":0.2499999403286525,"d":"25.00%"},{"v":2.7087341033910706,"d":"2.71x"}]
[null,null,{"$f":"Cálculos!C35","v":"Manutenção Predial"},{"$f":"Cálculos!D35","v":"Serviço"},{"$f":"Cálculos!H35","v":{"v":807.0454545454545,"d":"R$ 807.05"}},{"$f":"Cálculos!$D$18","v":{"v":0.25,"d":"25.00%"}},{"$f":"IFERROR(ROUND((E18+Cálculos!$D$16)/(1-F18-Cálculos!$D$10-Cálculos!$D$15),2),0)","v":{"v":2217.9,"d":"R$ 2,217.90"}},{"v":1410.8545454545456,"d":"R$ 1,410.85"},{"$f":"G18*Cálculos!$D$10","v":{"v":188.52150000000003,"d":"R$ 188.52"}},{"$f":"G18*Cálculos!$D$15+Cálculos!$D$16","v":{"v":667.85871,"d":"R$ 667.86"}},{"v":554.4743354545456,"d":"R$ 554.47"},{"v":0.24999970037176858,"d":"25.00%"},{"v":2.74817234581808,"d":"2.75x"}]
[null,null,{"$f":"Cálculos!C36","v":"Desenvolvimento de Sistema"},{"$f":"Cálculos!D36","v":"Serviço"},{"$f":"Cálculos!H36","v":{"v":29631.818181818184,"d":"R$ 29,631.82"}},{"$f":"Cálculos!$D$18","v":{"v":0.25,"d":"25.00%"}},{"$f":"IFERROR(ROUND((E19+Cálculos!$D$16)/(1-F19-Cálculos!$D$10-Cálculos!$D$15),2),0)","v":{"v":80101.64,"d":"R$ 80,101.64"}},{"v":50469.821818181816,"d":"R$ 50,469.82"},{"$f":"G19*Cálculos!$D$10","v":{"v":6808.6394,"d":"R$ 6,808.64"}},{"$f":"G19*Cálculos!$D$15+Cálculos!$D$16","v":{"v":23635.773635999998,"d":"R$ 23,635.77"}},{"v":20025.408782181818,"d":"R$ 20,025.41"},{"v":0.24999998479658866,"d":"25.00%"},{"v":2.703230679552078,"d":"2.70x"}]
[null,null,{"$f":"Cálculos!C37","v":"Assessoria Contábil Mensal"},{"$f":"Cálculos!D37","v":"Serviço"},{"$f":"Cálculos!H37","v":{"v":1941.1363636363637,"d":"R$ 1,941.14"}},{"$f":"Cálculos!$D$18","v":{"v":0.25,"d":"25.00%"}},{"$f":"IFERROR(ROUND((E20+Cálculos!$D$16)/(1-F20-Cálculos!$D$10-Cálculos!$D$15),2),0)","v":{"v":5282.18,"d":"R$ 5,282.18"}},{"v":3341.0436363636363,"d":"R$ 3,341.04"},{"$f":"G20*Cálculos!$D$10","v":{"v":448.98530000000005,"d":"R$ 448.99"}},{"$f":"G20*Cálculos!$D$15+Cálculos!$D$16","v":{"v":1571.514882,"d":"R$ 1,571.51"}},{"v":1320.543454363636,"d":"R$ 1,320.54"},{"v":0.249999707386654,"d":"25.00%"},{"v":2.7211792530148693,"d":"2.72x"}]
[null,null,{"$f":"Cálculos!C38","v":"Projeto Arquitetônico"},{"$f":"Cálculos!D38","v":"Serviço"},{"$f":"Cálculos!H38","v":{"v":16010.909090909092,"d":"R$ 16,010.91"}},{"$f":"Cálculos!$D$18","v":{"v":0.25,"d":"25.00%"}},{"$f":"IFERROR(ROUND((E21+Cálculos!$D$16)/(1-F21-Cálculos!$D$10-Cálculos!$D$15),2),0)","v":{"v":43298.32,"d":"R$ 43,298.32"}},{"v":27287.410909090908,"d":"R$ 27,287.41"},{"$f":"G21*Cálculos!$D$10","v":{"v":3680.3572000000004,"d":"R$ 3,680.36"}},{"$f":"G21*Cálculos!$D$15+Cálculos!$D$16","v":{"v":12782.474568,"d":"R$ 12,782.47"}},{"v":10824.579141090906,"d":"R$ 10,824.58"},{"v":0.2499999801629926,"d":"25.00%"},{"v":2.704301158301158,"d":"2.70x"}]
[null,null,{"$f":"Cálculos!C39","v":"Treinamento Corporativo"},{"$f":"Cálculos!D39","v":"Serviço"},{"$f":"Cálculos!H39","v":{"v":2584.090909090909,"d":"R$ 2,584.09"}},{"$f":"Cálculos!$D$18","v":{"v":0.25,"d":"25.00%"}},{"$f":"IFERROR(ROUND((E22+Cálculos!$D$16)/(1-F22-Cálculos!$D$10-Cálculos!$D$15),2),0)","v":{"v":7019.43,"d":"R$ 7,019.43"}},{"v":4435.339090909091,"d":"R$ 4,435.34"},{"$f":"G22*Cálculos!$D$10","v":{"v":596.65155,"d":"R$ 596.65"}},{"$f":"G22*Cálculos!$D$15+Cálculos!$D$16","v":{"v":2083.8299070000003,"d":"R$ 2,083.83"}},{"v":1754.857633909091,"d":"R$ 1,754.86"},{"v":0.25000001907691805,"d":"25.00%"},{"v":2.7164021108179424,"d":"2.72x"}]

{"sheet":"Prec Lucro Desejado","index":13,"n_rows":22,"n_cols":12,"rows_kept":22,"hidden":true}
[]
[null,null,"PREC LUCRO DESEJADO"]
[]
[]
[]
[]
[null,null,"Item","Tipo","Custo Total","Lucro Desejado R$","Preço de Venda","Tributos","Desp. Comerciais","Lucro Líquido Real","Margem Líquida %","Markup Implícito"]
[null,null,{"$f":"Cálculos!C25","v":"Camiseta Premium"},{"$f":"Cálculos!D25","v":"Produto"},{"$f":"Cálculos!H25","v":{"v":46.474999999999994,"d":"R$ 46.48"}},{"$f":"ROUND(E8*Cálculos!$D$18,2)","v":{"v":11.62,"d":"R$ 11.62"}},{"$f":"IFERROR(ROUND((E8+F8+Cálculos!$D$16)/(1-Cálculos!$D$10-Cálculos!$D$15),2),0)","v":{"v":115.94,"d":"R$ 115.94"}},{"$f":"G8*Cálculos!$D$10","v":{"v":9.8549,"d":"R$ 9.85"}},{"$f":"G8*Cálculos!$D$15+Cálculos!$D$16","v":{"v":47.990706,"d":"R$ 47.99"}},{"$f":"G8-E8-H8-I8","v":{"v":11.619394,"d":"R$ 11.62"}},{"$f":"IFERROR(J8/G8,0)","v":{"v":0.10021902708297395,"d":"10.02%"}},{"$f":"IFERROR(G8/E8,0)","v":{"v":2.494674556213018,"d":"2.49x"}}]
[null,null,{"$f":"Cálculos!C26","v":"Caneca Cerâmica 350ml"},{"$f":"Cálculos!D26","v":"Produto"},{"$f":"Cálculos!H26","v":{"v":29.755,"d":"R$ 29.76"}},{"$f":"ROUND(E9*Cálculos!$D$18,2)","v":{"v":7.44,"d":"R$ 7.44"}},{"$f":"IFERROR(ROUND((E9+F9+Cálculos!$D$16)/(1-Cálculos!$D$10-Cálculos!$D$15),2),0)","v":{"v":82.24,"d":"R$ 82.24"}},{"$f":"G9*Cálculos!$D$10","v":{"v":6.9904,"d":"R$ 6.99"}},{"$f":"G9*Cálculos!$D$15+Cálculos!$D$16","v":{"v":38.052576,"d":"R$ 38.05"}},{"v":7.442023999999996,"d":"R$ 7.44"},{"v":0.09049153696498051,"d":"9.05%"},{"v":2.763905226012435,"d":"2.76x"}]
[null,null,{"$f":"Cálculos!C27","v":"Kit Presente Gourmet"},{"$f":"Cálculos!D27","v":"Produto"},{"$f":"Cálculos!H27","v":{"v":69.275,"d":"R$ 69.28"}},{"$f":"ROUND(E10*Cálculos!$D$18,2)","v":{"v":17.32,"d":"R$ 17.32"}},{"$f":"IFERROR(ROUND((E10+F10+Cálculos!$D$16)/(1-Cálculos!$D$10-Cálculos!$D$15),2),0)","v":{"v":161.9,"d":"R$ 161.90"}},{"$f":"G10*Cálculos!$D$10","v":{"v":13.761500000000002,"d":"R$ 13.76"}},{"$f":"G10*Cálculos!$D$15+Cálculos!$D$16","v":{"v":61.544309999999996,"d":"R$ 61.54"}},{"v":17.319190000000006,"d":"R$ 17.32"},{"v":0.10697461395923413,"d":"10.70%"},{"v":2.337062432334897,"d":"2.34x"}]
[null,null,{"$f":"Cálculos!C28","v":"Mochila Executiva"},{"$f":"Cálculos!D28","v":"Produto"},{"$f":"Cálculos!H28","v":{"v":106.57499999999999,"d":"R$ 106.58"}},{"$f":"ROUND(E11*Cálculos!$D$18,2)","v":{"v":26.64,"d":"R$ 26.64"}},{"$f":"IFERROR(ROUND((E11+F11+Cálculos!$D$16)/(1-Cálculos!$D$10-Cálculos!$D$15),2),0)","v":{"v":237.08,"d":"R$ 237.08"}},{"$f":"G11*Cálculos!$D$10","v":{"v":20.1518,"d":"R$ 20.15"}},{"$f":"G11*Cálculos!$D$15+Cálculos!$D$16","v":{"v":83.714892,"d":"R$ 83.71"}},{"v":26.63830800000001,"d":"R$ 26.64"},{"v":0.11235999662561164,"d":"11.24%"},{"v":2.224536711236219,"d":"2.22x"}]
[null,null,{"$f":"Cálculos!C29","v":"Fone Bluetooth TWS"},{"$f":"Cálculos!D29","v":"Produto"},{"$f":"Cálculos!H29","v":{"v":93.555,"d":"R$ 93.56"}},{"$f":"ROUND(E12*Cálculos!$D$18,2)","v":{"v":23.39,"d":"R$ 23.39"}},{"$f":"IFERROR(ROUND((E12+F12+Cálculos!$D$16)/(1-Cálculos!$D$10-Cálculos!$D$15),2),0)","v":{"v":210.85,"d":"R$ 210.85"}},{"$f":"G12*Cálculos!$D$10","v":{"v":17.922250000000002,"d":"R$ 17.92"}},{"$f":"G12*Cálculos!$D$15+Cálculos!$D$16","v":{"v":75.979665,"d":"R$ 75.98"}},{"v":23.393084999999985,"d":"R$ 23.39"},{"v":0.11094657339340756,"d":"11.09%"},{"v":2.253754475976698,"d":"2.25x"}]
[null,null,{"$f":"Cálculos!C30","v":"Garrafa Térmica 1L"},{"$f":"Cálculos!D30","v":"Produto"},{"$f":"Cálculos!H30","v":{"v":56.725,"d":"R$ 56.73"}},{"$f":"ROUND(E13*Cálculos!$D$18,2)","v":{"v":14.18,"d":"R$ 14.18"}},{"$f":"IFERROR(ROUND((E13+F13+Cálculos!$D$16)/(1-Cálculos!$D$10-Cálculos!$D$15),2),0)","v":{"v":136.6,"d":"R$ 136.60"}},{"$f":"G13*Cálculos!$D$10","v":{"v":11.611,"d":"R$ 11.61"}},{"$f":"G13*Cálculos!$D$15+Cálculos!$D$16","v":{"v":54.08333999999999,"d":"R$ 54.08"}},{"v":14.180660000000003,"d":"R$ 14.18"},{"v":0.1038115666178624,"d":"10.38%"},{"v":2.408109299250771,"d":"2.41x"}]
[null,null,{"$f":"Cálculos!C31","v":"Agenda Executiva 2026"},{"$f":"Cálculos!D31","v":"Produto"},{"$f":"Cálculos!H31","v":{"v":38.537499999999994,"d":"R$ 38.54"}},{"$f":"ROUND(E14*Cálculos!$D$18,2)","v":{"v":9.63,"d":"R$ 9.63"}},{"$f":"IFERROR(ROUND((E14+F14+Cálculos!$D$16)/(1-Cálculos!$D$10-Cálculos!$D$15),2),0)","v":{"v":99.93,"d":"R$ 99.93"}},{"$f":"G14*Cálculos!$D$10","v":{"v":8.494050000000001,"d":"R$ 8.49"}},{"$f":"G14*Cálculos!$D$15+Cálculos!$D$16","v":{"v":43.269357,"d":"R$ 43.27"}},{"v":9.629093000000012,"d":"R$ 9.63"},{"v":0.09635838086660674,"d":"9.64%"},{"v":2.5930587090496275,"d":"2.59x"}]
[null,null,{"$f":"Cálculos!C32","v":"Boné Trucker"},{"$f":"Cálculos!D32","v":"Produto"},{"$f":"Cálculos!H32","v":{"v":35.489285714285714,"d":"R$ 35.49"}},{"$f":"ROUND(E15*Cálculos!$D$18,2)","v":{"v":8.87,"d":"R$ 8.87"}},{"$f":"IFERROR(ROUND((E15+F15+Cálculos!$D$16)/(1-Cálculos!$D$10-Cálculos!$D$15),2),0)","v":{"v":93.79,"d":"R$ 93.79"}},{"$f":"G15*Cálculos!$D$10","v":{"v":7.972150000000001,"d":"R$ 7.97"}},{"$f":"G15*Cálculos!$D$15+Cálculos!$D$16","v":{"v":41.458671,"d":"R$ 41.46"}},{"v":8.86989328571429,"d":"R$ 8.87"},{"v":0.09457184439401098,"d":"9.46%"},{"v":2.642769447519372,"d":"2.64x"}]
[null,null,{"$f":"Cálculos!C33","v":"Consultoria Empresarial"},{"$f":"Cálculos!D33","v":"Serviço"},{"$f":"Cálculos!H33","v":{"v":2292.6136363636365,"d":"R$ 2,292.61"}},{"$f":"ROUND(E16*Cálculos!$D$18,2)","v":{"v":573.15,"d":"R$ 573.15"}},{"$f":"IFERROR(ROUND((E16+F16+Cálculos!$D$16)/(1-Cálculos!$D$10-Cálculos!$D$15),2),0)","v":{"v":4643.71,"d":"R$ 4,643.71"}},{"$f":"G16*Cálculos!$D$10","v":{"v":394.71535000000006,"d":"R$ 394.72"}},{"$f":"G16*Cálculos!$D$15+Cálculos!$D$16","v":{"v":1383.230079,"d":"R$ 1,383.23"}},{"v":573.1509346363637,"d":"R$ 573.15"},{"v":0.12342522135024876,"d":"12.34%"},{"v":2.0255091945477073,"d":"2.03x"}]
[null,null,{"$f":"Cálculos!C34","v":"Criação de Identidade Visual"},{"$f":"Cálculos!D34","v":"Serviço"},{"$f":"Cálculos!H34","v":{"v":5514.147727272727,"d":"R$ 5,514.15"}},{"$f":"ROUND(E17*Cálculos!$D$18,2)","v":{"v":1378.54,"d":"R$ 1,378.54"}},{"$f":"IFERROR(ROUND((E17+F17+Cálculos!$D$16)/(1-Cálculos!$D$10-Cálculos!$D$15),2),0)","v":{"v":11137.7,"d":"R$ 11,137.70"}},{"$f":"G17*Cálculos!$D$10","v":{"v":946.7045000000002,"d":"R$ 946.70"}},{"$f":"G17*Cálculos!$D$15+Cálculos!$D$16","v":{"v":3298.3077300000004,"d":"R$ 3,298.31"}},{"v":1378.5400427272734,"d":"R$ 1,378.54"},{"v":0.12377241645288285,"d":"12.38%"},{"v":2.019840699028326,"d":"2.02x"}]
[null,null,{"$f":"Cálculos!C35","v":"Manutenção Predial"},{"$f":"Cálculos!D35","v":"Serviço"},{"$f":"Cálculos!H35","v":{"v":807.0454545454545,"d":"R$ 807.05"}},{"$f":"ROUND(E18*Cálculos!$D$18,2)","v":{"v":201.76,"d":"R$ 201.76"}},{"$f":"IFERROR(ROUND((E18+F18+Cálculos!$D$16)/(1-Cálculos!$D$10-Cálculos!$D$15),2),0)","v":{"v":1649.1,"d":"R$ 1,649.10"}},{"$f":"G18*Cálculos!$D$10","v":{"v":140.1735,"d":"R$ 140.17"}},{"$f":"G18*Cálculos!$D$15+Cálculos!$D$16","v":{"v":500.11958999999996,"d":"R$ 500.12"}},{"v":201.76145545454546,"d":"R$ 201.76"},{"v":0.12234640437483807,"d":"12.23%"},{"v":2.043379329766263,"d":"2.04x"}]
[null,null,{"$f":"Cálculos!C36","v":"Desenvolvimento de Sistema"},{"$f":"Cálculos!D36","v":"Serviço"},{"$f":"Cálculos!H36","v":{"v":29631.818181818184,"d":"R$ 29,631.82"}},{"$f":"ROUND(E19*Cálculos!$D$18,2)","v":{"v":7407.95,"d":"R$ 7,407.95"}},{"$f":"IFERROR(ROUND((E19+F19+Cálculos!$D$16)/(1-Cálculos!$D$10-Cálculos!$D$15),2),0)","v":{"v":59754.18,"d":"R$ 59,754.18"}},{"$f":"G19*Cálculos!$D$10","v":{"v":5079.1053,"d":"R$ 5,079.11"}},{"$f":"G19*Cálculos!$D$15+Cálculos!$D$16","v":{"v":17635.307682,"d":"R$ 17,635.31"}},{"v":7407.9488361818185,"d":"R$ 7,407.95"},{"v":0.12397373432589684,"d":"12.40%"},{"v":2.0165546249424757,"d":"2.02x"}]
[null,null,{"$f":"Cálculos!C37","v":"Assessoria Contábil Mensal"},{"$f":"Cálculos!D37","v":"Serviço"},{"$f":"Cálculos!H37","v":{"v":1941.1363636363637,"d":"R$ 1,941.14"}},{"$f":"ROUND(E20*Cálculos!$D$18,2)","v":{"v":485.28,"d":"R$ 485.28"}},{"$f":"IFERROR(ROUND((E20+F20+Cálculos!$D$16)/(1-Cálculos!$D$10-Cálculos!$D$15),2),0)","v":{"v":3935.2,"d":"R$ 3,935.20"}},{"$f":"G20*Cálculos!$D$10","v":{"v":334.492,"d":"R$ 334.49"}},{"$f":"G20*Cálculos!$D$15+Cálculos!$D$16","v":{"v":1174.29048,"d":"R$ 1,174.29"}},{"v":485.2811563636362,"d":"R$ 485.28"},{"v":0.12331804136095656,"d":"12.33%"},{"v":2.0272661280880455,"d":"2.03x"}]
[null,null,{"$f":"Cálculos!C38","v":"Projeto Arquitetônico"},{"$f":"Cálculos!D38","v":"Serviço"},{"$f":"Cálculos!H38","v":{"v":16010.909090909092,"d":"R$ 16,010.91"}},{"$f":"ROUND(E21*Cálculos!$D$18,2)","v":{"v":4002.73,"d":"R$ 4,002.73"}},{"$f":"IFERROR(ROUND((E21+F21+Cálculos!$D$16)/(1-Cálculos!$D$10-Cálculos!$D$15),2),0)","v":{"v":32297.11,"d":"R$ 32,297.11"}},{"$f":"G21*Cálculos!$D$10","v":{"v":2745.25435,"d":"R$ 2,745.25"}},{"$f":"G21*Cálculos!$D$15+Cálculos!$D$16","v":{"v":9538.217739,"d":"R$ 9,538.22"}},{"v":4002.7288200909097,"d":"R$ 4,002.73"},{"v":0.12393458176570317,"d":"12.39%"},{"v":2.0171940154440153,"d":"2.02x"}]
[null,null,{"$f":"Cálculos!C39","v":"Treinamento Corporativo"},{"$f":"Cálculos!D39","v":"Serviço"},{"$f":"Cálculos!H39","v":{"v":2584.090909090909,"d":"R$ 2,584.09"}},{"$f":"ROUND(E22*Cálculos!$D$18,2)","v":{"v":646.02,"d":"R$ 646.02"}},{"$f":"IFERROR(ROUND((E22+F22+Cálculos!$D$16)/(1-Cálculos!$D$10-Cálculos!$D$15),2),0)","v":{"v":5231.27,"d":"R$ 5,231.27"}},{"$f":"G22*Cálculos!$D$10","v":{"v":444.6579500000001,"d":"R$ 444.66"}},{"$f":"G22*Cálculos!$D$15+Cálculos!$D$16","v":{"v":1556.5015230000001,"d":"R$ 1,556.50"}},{"v":646.019617909091,"d":"R$ 646.02"},{"v":0.12349192794657722,"d":"12.35%"},{"v":2.024414072119613,"d":"2.02x"}]

{"sheet":"Prec Hora Trabalhada","index":14,"n_rows":14,"n_cols":15,"rows_kept":14,"hidden":true}
[]
[null,null,"PREC HORA TRABALHADA"]
[]
[]
[]
[]
[null,null,"Serviço","Profissional","Horas","Valor Hora Base","Custo Mão de Obra","Custos Diretos","Custo Fixo Hora","Custo Total","Lucro Desejado %","Tributos","Preço Final","Preço por Hora","Margem Líquida %"]
[null,null,{"$f":"Serviços!D8","v":"Consultoria Empresarial"},{"$f":"Funcionários!C8","v":"Ana Souza"},{"$f":"Serviços!F8","v":{"v":10,"d":"10.00"}},{"$f":"Funcionários!H8","v":{"v":74.45454545454547,"d":"R$ 74.45"}},{"$f":"E8*F8","v":{"v":744.5454545454547,"d":"R$ 744.55"}},{"$f":"Serviços!H8+Serviços!I8","v":{"v":240,"d":"R$ 240.00"}},{"$f":"IFERROR(Cálculos!$D$12/Cálculos!$D$19*E8/COUNTA(Serviços!$D$8:$D$14),0)","v":{"v":192.6136363636364,"d":"R$ 192.61"}},{"$f":"G8+H8+I8","v":{"v":1177.1590909090912,"d":"R$ 1,177.16"}},{"$f":"Cálculos!$D$18","v":{"v":0.25,"d":"25.00%"}},{"$f":"M8*Cálculos!$D$10","v":{"v":150.4636,"d":"R$ 150.46"}},{"$f":"IFERROR(ROUND(J8/(1-K8-Cálculos!$D$10),2),0)","v":{"v":1770.16,"d":"R$ 1,770.16"}},{"$f":"IFERROR(M8/E8,0)","v":{"v":177.01600000000002,"d":"R$ 177.02"}},{"$f":"IFERROR((M8-J8-L8)/M8,0)","v":{"v":0.24999847984979257,"d":"25.00%"}}]
[null,null,{"$f":"Serviços!D9","v":"Criação de Identidade Visual"},{"$f":"Funcionários!C9","v":"Bruno Lima"},{"$f":"Serviços!F9","v":{"v":35,"d":"35.00"}},{"$f":"Funcionários!H9","v":{"v":49.63636363636363,"d":"R$ 49.64"}},{"v":1737.2727272727273,"d":"R$ 1,737.27"},{"$f":"Serviços!H9+Serviços!I9","v":{"v":500,"d":"R$ 500.00"}},{"$f":"IFERROR(Cálculos!$D$12/Cálculos!$D$19*E9/COUNTA(Serviços!$D$8:$D$14),0)","v":{"v":674.1477272727273,"d":"R$ 674.15"}},{"v":2911.420454545454,"d":"R$ 2,911.42"},{"$f":"Cálculos!$D$18","v":{"v":0.25,"d":"25.00%"}},{"$f":"M9*Cálculos!$D$10","v":{"v":372.1368,"d":"R$ 372.14"}},{"$f":"IFERROR(ROUND(J9/(1-K9-Cálculos!$D$10),2),0)","v":{"v":4378.08,"d":"R$ 4,378.08"}},{"v":125.088,"d":"R$ 125.09"},{"v":0.2500006270909956,"d":"25.00%"}]
[null,null,{"$f":"Serviços!D10","v":"Manutenção Predial"},{"$f":"Funcionários!C10","v":"Carla Mendes"},{"$f":"Serviços!F10","v":{"v":4,"d":"4.00"}},{"$f":"Funcionários!H10","v":{"v":90.68181818181819,"d":"R$ 90.68"}},{"v":362.72727272727275,"d":"R$ 362.73"},{"$f":"Serviços!H10+Serviços!I10","v":{"v":270,"d":"R$ 270.00"}},{"$f":"IFERROR(Cálculos!$D$12/Cálculos!$D$19*E10/COUNTA(Serviços!$D$8:$D$14),0)","v":{"v":77.04545454545455,"d":"R$ 77.05"}},{"v":709.7727272727273,"d":"R$ 709.77"},{"$f":"Cálculos!$D$18","v":{"v":0.25,"d":"25.00%"}},{"$f":"M10*Cálculos!$D$10","v":{"v":90.72305,"d":"R$ 90.72"}},{"$f":"IFERROR(ROUND(J10/(1-K10-Cálculos!$D$10),2),0)","v":{"v":1067.33,"d":"R$ 1,067.33"}},{"v":266.8325,"d":"R$ 266.83"},{"v":0.2500016140530789,"d":"25.00%"}]
[null,null,{"$f":"Serviços!D11","v":"Desenvolvimento de Sistema"},{"$f":"Funcionários!C11","v":"Diego Alves"},{"$f":"Serviços!F11","v":{"v":160,"d":"160.00"}},{"$f":"Funcionários!H11","v":{"v":33.22727272727273,"d":"R$ 33.23"}},{"v":5316.363636363636,"d":"R$ 5,316.36"},{"$f":"Serviços!H11+Serviços!I11","v":{"v":2700,"d":"R$ 2,700.00"}},{"$f":"IFERROR(Cálculos!$D$12/Cálculos!$D$19*E11/COUNTA(Serviços!$D$8:$D$14),0)","v":{"v":3081.8181818181824,"d":"R$ 3,081.82"}},{"v":11098.181818181818,"d":"R$ 11,098.18"},{"$f":"Cálculos!$D$18","v":{"v":0.25,"d":"25.00%"}},{"$f":"M11*Cálculos!$D$10","v":{"v":1418.565,"d":"R$ 1,418.57"}},{"$f":"IFERROR(ROUND(J11/(1-K11-Cálculos!$D$10),2),0)","v":{"v":16689,"d":"R$ 16,689.00"}},{"v":104.30625,"d":"R$ 104.31"},{"v":0.25000019065361506,"d":"25.00%"}]
[null,null,{"$f":"Serviços!D12","v":"Assessoria Contábil Mensal"},{"$f":"Funcionários!C12","v":"Elaine Costa"},{"$f":"Serviços!F12","v":{"v":12,"d":"12.00"}},{"$f":"Funcionários!H12","v":{"v":43.909090909090914,"d":"R$ 43.91"}},{"v":526.909090909091,"d":"R$ 526.91"},{"$f":"Serviços!H12+Serviços!I12","v":{"v":300,"d":"R$ 300.00"}},{"$f":"IFERROR(Cálculos!$D$12/Cálculos!$D$19*E12/COUNTA(Serviços!$D$8:$D$14),0)","v":{"v":231.13636363636365,"d":"R$ 231.14"}},{"v":1058.0454545454547,"d":"R$ 1,058.05"},{"$f":"Cálculos!$D$18","v":{"v":0.25,"d":"25.00%"}},{"$f":"M12*Cálculos!$D$10","v":{"v":135.23925,"d":"R$ 135.24"}},{"$f":"IFERROR(ROUND(J12/(1-K12-Cálculos!$D$10),2),0)","v":{"v":1591.05,"d":"R$ 1,591.05"}},{"v":132.5875,"d":"R$ 132.59"},{"v":0.25000175698723814,"d":"25.00%"}]
[null,null,{"$f":"Serviços!D13","v":"Projeto Arquitetônico"},{"$f":"Funcionários!C13","v":"Fábio Rocha"},{"$f":"Serviços!F13","v":{"v":80,"d":"80.00"}},{"$f":"Funcionários!H13","v":{"v":78.27272727272728,"d":"R$ 78.27"}},{"v":6261.818181818182,"d":"R$ 6,261.82"},{"$f":"Serviços!H13+Serviços!I13","v":{"v":1350,"d":"R$ 1,350.00"}},{"$f":"IFERROR(Cálculos!$D$12/Cálculos!$D$19*E13/COUNTA(Serviços!$D$8:$D$14),0)","v":{"v":1540.9090909090912,"d":"R$ 1,540.91"}},{"v":9152.727272727274,"d":"R$ 9,152.73"},{"$f":"Cálculos!$D$18","v":{"v":0.25,"d":"25.00%"}},{"$f":"M13*Cálculos!$D$10","v":{"v":1169.8975,"d":"R$ 1,169.90"}},{"$f":"IFERROR(ROUND(J13/(1-K13-Cálculos!$D$10),2),0)","v":{"v":13763.5,"d":"R$ 13,763.50"}},{"v":172.04375,"d":"R$ 172.04"},{"v":0.25000001651271303,"d":"25.00%"}]
[null,null,{"$f":"Serviços!D14","v":"Treinamento Corporativo"},{"$f":"Funcionários!C14","v":"Gabriela Dias"},{"$f":"Serviços!F14","v":{"v":8,"d":"8.00"}},{"$f":"Funcionários!H14","v":{"v":23.454545454545453,"d":"R$ 23.45"}},{"v":187.63636363636363,"d":"R$ 187.64"},{"$f":"Serviços!H14+Serviços!I14","v":{"v":520,"d":"R$ 520.00"}},{"$f":"IFERROR(Cálculos!$D$12/Cálculos!$D$19*E14/COUNTA(Serviços!$D$8:$D$14),0)","v":{"v":154.0909090909091,"d":"R$ 154.09"}},{"v":861.7272727272727,"d":"R$ 861.73"},{"$f":"Cálculos!$D$18","v":{"v":0.25,"d":"25.00%"}},{"$f":"M14*Cálculos!$D$10","v":{"v":110.14555,"d":"R$ 110.15"}},{"$f":"IFERROR(ROUND(J14/(1-K14-Cálculos!$D$10),2),0)","v":{"v":1295.83,"d":"R$ 1,295.83"}},{"v":161.97875,"d":"R$ 161.98"},{"v":0.2499997509493739,"d":"25.00%"}]

{"sheet":"Prec Homem Hora","index":15,"n_rows":14,"n_cols":14,"rows_kept":14,"hidden":true}
[]
[null,null,"PREC HOMEM HORA"]
[]
[]
[]
[]
[null,null,"Projeto/Serviço","Nº Funcionários","Horas por Pessoa","Total Homem-Hora","Custo Médio Hora Equipe","Custo Mão de Obra","Custos Indiretos","Custo Total","Lucro Desejado %","Tributos","Preço Final","Preço por Homem-Hora"]
[null,null,{"$f":"Serviços!D8","v":"Consultoria Empresarial"},2,{"v":10,"d":"10.00"},{"$f":"D8*E8","v":{"v":20,"d":"20.00"}},{"$f":"IFERROR(AVERAGE(Funcionários!$H$8:$H$14),0)","v":{"v":56.23376623376624,"d":"R$ 56.23"}},{"$f":"F8*G8","v":{"v":1124.6753246753249,"d":"R$ 1,124.68"}},{"$f":"IFERROR(Cálculos!$D$12/Cálculos!$D$19*F8/COUNTA(Serviços!$D$8:$D$14),0)","v":{"v":385.2272727272728,"d":"R$ 385.23"}},{"$f":"H8+I8","v":{"v":1509.9025974025976,"d":"R$ 1,509.90"}},{"$f":"Cálculos!$D$18","v":{"v":0.25,"d":"25.00%"}},{"$f":"M8*Cálculos!$D$10","v":{"v":192.99505000000002,"d":"R$ 193.00"}},{"$f":"IFERROR(ROUND(J8/(1-K8-Cálculos!$D$10),2),0)","v":{"v":2270.53,"d":"R$ 2,270.53"}},{"$f":"IFERROR(M8/F8,0)","v":{"v":113.52650000000001,"d":"R$ 113.53"}}]
[null,null,{"$f":"Serviços!D9","v":"Criação de Identidade Visual"},3,{"v":35,"d":"35.00"},{"v":105,"d":"105.00"},{"$f":"IFERROR(AVERAGE(Funcionários!$H$8:$H$14),0)","v":{"v":56.23376623376624,"d":"R$ 56.23"}},{"v":5904.545454545455,"d":"R$ 5,904.55"},{"$f":"IFERROR(Cálculos!$D$12/Cálculos!$D$19*F9/COUNTA(Serviços!$D$8:$D$14),0)","v":{"v":2022.443181818182,"d":"R$ 2,022.44"}},{"v":7926.988636363637,"d":"R$ 7,926.99"},{"$f":"Cálculos!$D$18","v":{"v":0.25,"d":"25.00%"}},{"$f":"M9*Cálculos!$D$10","v":{"v":1013.2238000000001,"d":"R$ 1,013.22"}},{"$f":"IFERROR(ROUND(J9/(1-K9-Cálculos!$D$10),2),0)","v":{"v":11920.28,"d":"R$ 11,920.28"}},{"v":113.5264761904762,"d":"R$ 113.53"}]
[null,null,{"$f":"Serviços!D10","v":"Manutenção Predial"},2,{"v":4,"d":"4.00"},{"v":8,"d":"8.00"},{"$f":"IFERROR(AVERAGE(Funcionários!$H$8:$H$14),0)","v":{"v":56.23376623376624,"d":"R$ 56.23"}},{"v":449.8701298701299,"d":"R$ 449.87"},{"$f":"IFERROR(Cálculos!$D$12/Cálculos!$D$19*F10/COUNTA(Serviços!$D$8:$D$14),0)","v":{"v":154.0909090909091,"d":"R$ 154.09"}},{"v":603.961038961039,"d":"R$ 603.96"},{"$f":"Cálculos!$D$18","v":{"v":0.25,"d":"25.00%"}},{"$f":"M10*Cálculos!$D$10","v":{"v":77.19785,"d":"R$ 77.20"}},{"$f":"IFERROR(ROUND(J10/(1-K10-Cálculos!$D$10),2),0)","v":{"v":908.21,"d":"R$ 908.21"}},{"v":113.52625,"d":"R$ 113.53"}]
[null,null,{"$f":"Serviços!D11","v":"Desenvolvimento de Sistema"},4,{"v":160,"d":"160.00"},{"v":640,"d":"640.00"},{"$f":"IFERROR(AVERAGE(Funcionários!$H$8:$H$14),0)","v":{"v":56.23376623376624,"d":"R$ 56.23"}},{"v":35989.610389610396,"d":"R$ 35,989.61"},{"$f":"IFERROR(Cálculos!$D$12/Cálculos!$D$19*F11/COUNTA(Serviços!$D$8:$D$14),0)","v":{"v":12327.27272727273,"d":"R$ 12,327.27"}},{"v":48316.883116883124,"d":"R$ 48,316.88"},{"$f":"Cálculos!$D$18","v":{"v":0.25,"d":"25.00%"}},{"$f":"M11*Cálculos!$D$10","v":{"v":6175.84245,"d":"R$ 6,175.84"}},{"$f":"IFERROR(ROUND(J11/(1-K11-Cálculos!$D$10),2),0)","v":{"v":72656.97,"d":"R$ 72,656.97"}},{"v":113.526515625,"d":"R$ 113.53"}]
[null,null,{"$f":"Serviços!D12","v":"Assessoria Contábil Mensal"},1,{"v":12,"d":"12.00"},{"v":12,"d":"12.00"},{"$f":"IFERROR(AVERAGE(Funcionários!$H$8:$H$14),0)","v":{"v":56.23376623376624,"d":"R$ 56.23"}},{"v":674.8051948051949,"d":"R$ 674.81"},{"$f":"IFERROR(Cálculos!$D$12/Cálculos!$D$19*F12/COUNTA(Serviços!$D$8:$D$14),0)","v":{"v":231.13636363636365,"d":"R$ 231.14"}},{"v":905.9415584415585,"d":"R$ 905.94"},{"$f":"Cálculos!$D$18","v":{"v":0.25,"d":"25.00%"}},{"$f":"M12*Cálculos!$D$10","v":{"v":115.7972,"d":"R$ 115.80"}},{"$f":"IFERROR(ROUND(J12/(1-K12-Cálculos!$D$10),2),0)","v":{"v":1362.32,"d":"R$ 1,362.32"}},{"v":113.52666666666666,"d":"R$ 113.53"}]
[null,null,{"$f":"Serviços!D13","v":"Projeto Arquitetônico"},3,{"v":80,"d":"80.00"},{"v":240,"d":"240.00"},{"$f":"IFERROR(AVERAGE(Funcionários!$H$8:$H$14),0)","v":{"v":56.23376623376624,"d":"R$ 56.23"}},{"v":13496.103896103898,"d":"R$ 13,496.10"},{"$f":"IFERROR(Cálculos!$D$12/Cálculos!$D$19*F13/COUNTA(Serviços!$D$8:$D$14),0)","v":{"v":4622.727272727273,"d":"R$ 4,622.73"}},{"v":18118.83116883117,"d":"R$ 18,118.83"},{"$f":"Cálculos!$D$18","v":{"v":0.25,"d":"25.00%"}},{"$f":"M13*Cálculos!$D$10","v":{"v":2315.9406000000004,"d":"R$ 2,315.94"}},{"$f":"IFERROR(ROUND(J13/(1-K13-Cálculos!$D$10),2),0)","v":{"v":27246.36,"d":"R$ 27,246.36"}},{"v":113.5265,"d":"R$ 113.53"}]
[null,null,{"$f":"Serviços!D14","v":"Treinamento Corporativo"},2,{"v":8,"d":"8.00"},{"v":16,"d":"16.00"},{"$f":"IFERROR(AVERAGE(Funcionários!$H$8:$H$14),0)","v":{"v":56.23376623376624,"d":"R$ 56.23"}},{"v":899.7402597402598,"d":"R$ 899.74"},{"$f":"IFERROR(Cálculos!$D$12/Cálculos!$D$19*F14/COUNTA(Serviços!$D$8:$D$14),0)","v":{"v":308.1818181818182,"d":"R$ 308.18"}},{"v":1207.922077922078,"d":"R$ 1,207.92"},{"$f":"Cálculos!$D$18","v":{"v":0.25,"d":"25.00%"}},{"$f":"M14*Cálculos!$D$10","v":{"v":154.3957,"d":"R$ 154.40"}},{"$f":"IFERROR(ROUND(J14/(1-K14-Cálculos!$D$10),2),0)","v":{"v":1816.42,"d":"R$ 1,816.42"}},{"v":113.52625,"d":"R$ 113.53"}]

{"sheet":"Prec Projeto","index":16,"n_rows":14,"n_cols":15,"rows_kept":14,"hidden":true}
[]
[null,null,"PREC PROJETO"]
[]
[]
[]
[]
[null,null,"Projeto","Escopo / Entregável","Horas Estimadas","Custo Hora Equipe","Custo Mão de Obra","Custos Diretos","Despesas","Reserva de Contingência %","Valor Reserva","Custo Total","Lucro Desejado %","Tributos","Preço Final"]
[null,null,{"$f":"Serviços!D8","v":"Consultoria Empresarial"},"Diagnóstico + plano de ação",{"$f":"Serviços!F8","v":{"v":10,"d":"10.00"}},{"$f":"IFERROR(AVERAGE(Funcionários!$H$8:$H$14),0)","v":{"v":56.23376623376624,"d":"R$ 56.23"}},{"$f":"E8*F8","v":{"v":562.3376623376624,"d":"R$ 562.34"}},{"$f":"Serviços!H8","v":{"v":150,"d":"R$ 150.00"}},{"$f":"Serviços!J8","v":{"v":60,"d":"R$ 60.00"}},{"v":0.1,"d":"10.00%"},{"$f":"(G8+H8+I8)*J8","v":{"v":77.23376623376625,"d":"R$ 77.23"}},{"$f":"G8+H8+I8+K8","v":{"v":849.5714285714287,"d":"R$ 849.57"}},{"$f":"Cálculos!$D$18","v":{"v":0.25,"d":"25.00%"}},{"$f":"O8*Cálculos!$D$10","v":{"v":108.59175,"d":"R$ 108.59"}},{"$f":"IFERROR(ROUND(L8/(1-M8-Cálculos!$D$10),2),0)","v":{"v":1277.55,"d":"R$ 1,277.55"}}]
[null,null,{"$f":"Serviços!D9","v":"Criação de Identidade Visual"},"Marca completa + manual",{"$f":"Serviços!F9","v":{"v":35,"d":"35.00"}},{"$f":"IFERROR(AVERAGE(Funcionários!$H$8:$H$14),0)","v":{"v":56.23376623376624,"d":"R$ 56.23"}},{"v":1968.1818181818185,"d":"R$ 1,968.18"},{"$f":"Serviços!H9","v":{"v":320,"d":"R$ 320.00"}},{"$f":"Serviços!J9","v":{"v":140,"d":"R$ 140.00"}},{"v":0.12,"d":"12.00%"},{"v":291.38181818181823,"d":"R$ 291.38"},{"v":2719.5636363636368,"d":"R$ 2,719.56"},{"$f":"Cálculos!$D$18","v":{"v":0.25,"d":"25.00%"}},{"$f":"O9*Cálculos!$D$10","v":{"v":347.61345000000006,"d":"R$ 347.61"}},{"$f":"IFERROR(ROUND(L9/(1-M9-Cálculos!$D$10),2),0)","v":{"v":4089.57,"d":"R$ 4,089.57"}}]
[null,null,{"$f":"Serviços!D10","v":"Manutenção Predial"},"Vistoria e reparos",{"$f":"Serviços!F10","v":{"v":4,"d":"4.00"}},{"$f":"IFERROR(AVERAGE(Funcionários!$H$8:$H$14),0)","v":{"v":56.23376623376624,"d":"R$ 56.23"}},{"v":224.93506493506496,"d":"R$ 224.94"},{"$f":"Serviços!H10","v":{"v":210,"d":"R$ 210.00"}},{"$f":"Serviços!J10","v":{"v":80,"d":"R$ 80.00"}},{"v":0.08,"d":"8.00%"},{"v":41.1948051948052,"d":"R$ 41.19"},{"v":556.1298701298701,"d":"R$ 556.13"},{"$f":"Cálculos!$D$18","v":{"v":0.25,"d":"25.00%"}},{"$f":"O10*Cálculos!$D$10","v":{"v":71.08465,"d":"R$ 71.08"}},{"$f":"IFERROR(ROUND(L10/(1-M10-Cálculos!$D$10),2),0)","v":{"v":836.29,"d":"R$ 836.29"}}]
[null,null,{"$f":"Serviços!D11","v":"Desenvolvimento de Sistema"},"Sistema web completo",{"$f":"Serviços!F11","v":{"v":160,"d":"160.00"}},{"$f":"IFERROR(AVERAGE(Funcionários!$H$8:$H$14),0)","v":{"v":56.23376623376624,"d":"R$ 56.23"}},{"v":8997.402597402599,"d":"R$ 8,997.40"},{"$f":"Serviços!H11","v":{"v":1800,"d":"R$ 1,800.00"}},{"$f":"Serviços!J11","v":{"v":650,"d":"R$ 650.00"}},{"v":0.15,"d":"15.00%"},{"v":1717.1103896103898,"d":"R$ 1,717.11"},{"v":13164.51298701299,"d":"R$ 13,164.51"},{"$f":"Cálculos!$D$18","v":{"v":0.25,"d":"25.00%"}},{"$f":"O11*Cálculos!$D$10","v":{"v":1682.6821,"d":"R$ 1,682.68"}},{"$f":"IFERROR(ROUND(L11/(1-M11-Cálculos!$D$10),2),0)","v":{"v":19796.26,"d":"R$ 19,796.26"}}]
[null,null,{"$f":"Serviços!D12","v":"Assessoria Contábil Mensal"},"Rotina fiscal mensal",{"$f":"Serviços!F12","v":{"v":12,"d":"12.00"}},{"$f":"IFERROR(AVERAGE(Funcionários!$H$8:$H$14),0)","v":{"v":56.23376623376624,"d":"R$ 56.23"}},{"v":674.8051948051949,"d":"R$ 674.81"},{"$f":"Serviços!H12","v":{"v":180,"d":"R$ 180.00"}},{"$f":"Serviços!J12","v":{"v":90,"d":"R$ 90.00"}},{"v":0.05,"d":"5.00%"},{"v":47.240259740259745,"d":"R$ 47.24"},{"v":992.0454545454546,"d":"R$ 992.05"},{"$f":"Cálculos!$D$18","v":{"v":0.25,"d":"25.00%"}},{"$f":"O12*Cálculos!$D$10","v":{"v":126.80300000000001,"d":"R$ 126.80"}},{"$f":"IFERROR(ROUND(L12/(1-M12-Cálculos!$D$10),2),0)","v":{"v":1491.8,"d":"R$ 1,491.80"}}]
[null,null,{"$f":"Serviços!D13","v":"Projeto Arquitetônico"},"Projeto executivo + ART",{"$f":"Serviços!F13","v":{"v":80,"d":"80.00"}},{"$f":"IFERROR(AVERAGE(Funcionários!$H$8:$H$14),0)","v":{"v":56.23376623376624,"d":"R$ 56.23"}},{"v":4498.7012987012995,"d":"R$ 4,498.70"},{"$f":"Serviços!H13","v":{"v":900,"d":"R$ 900.00"}},{"$f":"Serviços!J13","v":{"v":320,"d":"R$ 320.00"}},{"v":0.12,"d":"12.00%"},{"v":686.2441558441559,"d":"R$ 686.24"},{"v":6404.9454545454555,"d":"R$ 6,404.95"},{"$f":"Cálculos!$D$18","v":{"v":0.25,"d":"25.00%"}},{"$f":"O13*Cálculos!$D$10","v":{"v":818.6775,"d":"R$ 818.68"}},{"$f":"IFERROR(ROUND(L13/(1-M13-Cálculos!$D$10),2),0)","v":{"v":9631.5,"d":"R$ 9,631.50"}}]
[null,null,{"$f":"Serviços!D14","v":"Treinamento Corporativo"},"Programa de 2 dias",{"$f":"Serviços!F14","v":{"v":8,"d":"8.00"}},{"$f":"IFERROR(AVERAGE(Funcionários!$H$8:$H$14),0)","v":{"v":56.23376623376624,"d":"R$ 56.23"}},{"v":449.8701298701299,"d":"R$ 449.87"},{"$f":"Serviços!H14","v":{"v":400,"d":"R$ 400.00"}},{"$f":"Serviços!J14","v":{"v":150,"d":"R$ 150.00"}},{"v":0.08,"d":"8.00%"},{"v":79.98961038961039,"d":"R$ 79.99"},{"v":1079.8597402597402,"d":"R$ 1,079.86"},{"$f":"Cálculos!$D$18","v":{"v":0.25,"d":"25.00%"}},{"$f":"O14*Cálculos!$D$10","v":{"v":138.02725,"d":"R$ 138.03"}},{"$f":"IFERROR(ROUND(L14/(1-M14-Cálculos!$D$10),2),0)","v":{"v":1623.85,"d":"R$ 1,623.85"}}]

{"sheet":"Prec Prestadores","index":17,"n_rows":14,"n_cols":16,"rows_kept":14,"hidden":true}
[]
[null,null,"PREC PRESTADORES"]
[]
[]
[]
[]
[null,null,"Serviço","Nº Visitas","Km por Visita","Custo por Km","Custo Deslocamento","Tempo por Visita (h)","Valor Hora","Custo Mão de Obra","Materiais","Custos Indiretos","Custo Total","Lucro Desejado %","Tributos","Preço Final"]
[null,null,{"$f":"Serviços!D8","v":"Consultoria Empresarial"},2,{"v":25,"d":"25.00"},{"v":1.2,"d":"R$ 1.20"},{"$f":"D8*E8*F8","v":{"v":60,"d":"R$ 60.00"}},{"v":5,"d":"5.00"},{"$f":"IFERROR(AVERAGE(Funcionários!$H$8:$H$14),0)","v":{"v":56.23376623376624,"d":"R$ 56.23"}},{"$f":"D8*H8*I8","v":{"v":562.3376623376624,"d":"R$ 562.34"}},{"v":80,"d":"R$ 80.00"},{"$f":"Serviços!I8","v":{"v":90,"d":"R$ 90.00"}},{"$f":"G8+J8+K8+L8","v":{"v":792.3376623376624,"d":"R$ 792.34"}},{"$f":"Cálculos!$D$18","v":{"v":0.25,"d":"25.00%"}},{"$f":"P8*Cálculos!$D$10","v":{"v":101.27665,"d":"R$ 101.28"}},{"$f":"IFERROR(ROUND(M8/(1-N8-Cálculos!$D$10),2),0)","v":{"v":1191.49,"d":"R$ 1,191.49"}}]
[null,null,{"$f":"Serviços!D9","v":"Criação de Identidade Visual"},4,{"v":15,"d":"15.00"},{"v":1.2,"d":"R$ 1.20"},{"v":72,"d":"R$ 72.00"},{"v":8,"d":"8.00"},{"$f":"IFERROR(AVERAGE(Funcionários!$H$8:$H$14),0)","v":{"v":56.23376623376624,"d":"R$ 56.23"}},{"v":1799.4805194805197,"d":"R$ 1,799.48"},{"v":150,"d":"R$ 150.00"},{"$f":"Serviços!I9","v":{"v":180,"d":"R$ 180.00"}},{"v":2201.4805194805194,"d":"R$ 2,201.48"},{"$f":"Cálculos!$D$18","v":{"v":0.25,"d":"25.00%"}},{"$f":"P9*Cálculos!$D$10","v":{"v":281.39250000000004,"d":"R$ 281.39"}},{"$f":"IFERROR(ROUND(M9/(1-N9-Cálculos!$D$10),2),0)","v":{"v":3310.5,"d":"R$ 3,310.50"}}]
[null,null,{"$f":"Serviços!D10","v":"Manutenção Predial"},3,{"v":40,"d":"40.00"},{"v":1.2,"d":"R$ 1.20"},{"v":144,"d":"R$ 144.00"},{"v":4,"d":"4.00"},{"$f":"IFERROR(AVERAGE(Funcionários!$H$8:$H$14),0)","v":{"v":56.23376623376624,"d":"R$ 56.23"}},{"v":674.8051948051949,"d":"R$ 674.81"},{"v":320,"d":"R$ 320.00"},{"$f":"Serviços!I10","v":{"v":60,"d":"R$ 60.00"}},{"v":1198.8051948051948,"d":"R$ 1,198.81"},{"$f":"Cálculos!$D$18","v":{"v":0.25,"d":"25.00%"}},{"$f":"P10*Cálculos!$D$10","v":{"v":153.23035000000002,"d":"R$ 153.23"}},{"$f":"IFERROR(ROUND(M10/(1-N10-Cálculos!$D$10),2),0)","v":{"v":1802.71,"d":"R$ 1,802.71"}}]
[null,null,{"$f":"Serviços!D11","v":"Desenvolvimento de Sistema"},8,{"v":10,"d":"10.00"},{"v":1.2,"d":"R$ 1.20"},{"v":96,"d":"R$ 96.00"},{"v":20,"d":"20.00"},{"$f":"IFERROR(AVERAGE(Funcionários!$H$8:$H$14),0)","v":{"v":56.23376623376624,"d":"R$ 56.23"}},{"v":8997.402597402599,"d":"R$ 8,997.40"},{"v":200,"d":"R$ 200.00"},{"$f":"Serviços!I11","v":{"v":900,"d":"R$ 900.00"}},{"v":10193.402597402599,"d":"R$ 10,193.40"},{"$f":"Cálculos!$D$18","v":{"v":0.25,"d":"25.00%"}},{"$f":"P11*Cálculos!$D$10","v":{"v":1302.9157,"d":"R$ 1,302.92"}},{"$f":"IFERROR(ROUND(M11/(1-N11-Cálculos!$D$10),2),0)","v":{"v":15328.42,"d":"R$ 15,328.42"}}]
[null,null,{"$f":"Serviços!D12","v":"Assessoria Contábil Mensal"},1,{"v":8,"d":"8.00"},{"v":1.2,"d":"R$ 1.20"},{"v":9.6,"d":"R$ 9.60"},{"v":12,"d":"12.00"},{"$f":"IFERROR(AVERAGE(Funcionários!$H$8:$H$14),0)","v":{"v":56.23376623376624,"d":"R$ 56.23"}},{"v":674.8051948051949,"d":"R$ 674.81"},{"v":40,"d":"R$ 40.00"},{"$f":"Serviços!I12","v":{"v":120,"d":"R$ 120.00"}},{"v":844.4051948051949,"d":"R$ 844.41"},{"$f":"Cálculos!$D$18","v":{"v":0.25,"d":"25.00%"}},{"$f":"P12*Cálculos!$D$10","v":{"v":107.93130000000001,"d":"R$ 107.93"}},{"$f":"IFERROR(ROUND(M12/(1-N12-Cálculos!$D$10),2),0)","v":{"v":1269.78,"d":"R$ 1,269.78"}}]
[null,null,{"$f":"Serviços!D13","v":"Projeto Arquitetônico"},5,{"v":60,"d":"60.00"},{"v":1.2,"d":"R$ 1.20"},{"v":360,"d":"R$ 360.00"},{"v":16,"d":"16.00"},{"$f":"IFERROR(AVERAGE(Funcionários!$H$8:$H$14),0)","v":{"v":56.23376623376624,"d":"R$ 56.23"}},{"v":4498.7012987012995,"d":"R$ 4,498.70"},{"v":280,"d":"R$ 280.00"},{"$f":"Serviços!I13","v":{"v":450,"d":"R$ 450.00"}},{"v":5588.7012987012995,"d":"R$ 5,588.70"},{"$f":"Cálculos!$D$18","v":{"v":0.25,"d":"25.00%"}},{"$f":"P13*Cálculos!$D$10","v":{"v":714.3451,"d":"R$ 714.35"}},{"$f":"IFERROR(ROUND(M13/(1-N13-Cálculos!$D$10),2),0)","v":{"v":8404.06,"d":"R$ 8,404.06"}}]
[null,null,{"$f":"Serviços!D14","v":"Treinamento Corporativo"},2,{"v":30,"d":"30.00"},{"v":1.2,"d":"R$ 1.20"},{"v":72,"d":"R$ 72.00"},{"v":8,"d":"8.00"},{"$f":"IFERROR(AVERAGE(Funcionários!$H$8:$H$14),0)","v":{"v":56.23376623376624,"d":"R$ 56.23"}},{"v":899.7402597402598,"d":"R$ 899.74"},{"v":180,"d":"R$ 180.00"},{"$f":"Serviços!I14","v":{"v":120,"d":"R$ 120.00"}},{"v":1271.7402597402597,"d":"R$ 1,271.74"},{"$f":"Cálculos!$D$18","v":{"v":0.25,"d":"25.00%"}},{"$f":"P14*Cálculos!$D$10","v":{"v":162.55315000000002,"d":"R$ 162.55"}},{"$f":"IFERROR(ROUND(M14/(1-N14-Cálculos!$D$10),2),0)","v":{"v":1912.39,"d":"R$ 1,912.39"}}]

{"sheet":"Prec Comércio","index":18,"n_rows":15,"n_cols":13,"rows_kept":15,"hidden":true}
[]
[null,null,"PREC COMÉRCIO"]
[]
[]
[]
[]
[null,null,"Produto","Custo de Compra","Frete de Entrada","IPI","Custo de Aquisição","Impostos s/ Venda %","Despesas Comerciais %","Markup","Preço de Venda","Lucro Líquido","Margem Líquida %"]
[null,null,{"$f":"Produtos!D8","v":"Camiseta Premium"},{"$f":"Produtos!G8","v":{"v":22,"d":"R$ 22.00"}},{"$f":"IFERROR(Produtos!I8/Produtos!L8,0)","v":{"v":3.6,"d":"R$ 3.60"}},{"$f":"Produtos!G8*Produtos!H8","v":0},{"$f":"D8+E8+F8","v":{"v":25.6,"d":"R$ 25.60"}},{"$f":"Cálculos!$D$10","v":{"v":0.085,"d":"8.50%"}},{"$f":"Cálculos!$D$15","v":{"v":0.2949,"d":"29.49%"}},{"$f":"Cálculos!$D$17","v":{"v":2.5,"d":"2.50x"}},{"$f":"ROUND(G8*J8,2)","v":{"v":64,"d":"R$ 64.00"}},{"$f":"K8-G8-K8*H8-K8*I8","v":{"v":14.086400000000001,"d":"R$ 14.09"}},{"$f":"IFERROR(L8/K8,0)","v":{"v":0.22010000000000002,"d":"22.01%"}}]
[null,null,{"$f":"Produtos!D9","v":"Caneca Cerâmica 350ml"},{"$f":"Produtos!G9","v":{"v":8.5,"d":"R$ 8.50"}},{"$f":"IFERROR(Produtos!I9/Produtos!L9,0)","v":{"v":1.2,"d":"R$ 1.20"}},{"$f":"Produtos!G9*Produtos!H9","v":0},{"v":9.7,"d":"R$ 9.70"},{"$f":"Cálculos!$D$10","v":{"v":0.085,"d":"8.50%"}},{"$f":"Cálculos!$D$15","v":{"v":0.2949,"d":"29.49%"}},{"$f":"Cálculos!$D$17","v":{"v":2.5,"d":"2.50x"}},{"v":24.25,"d":"R$ 24.25"},{"v":5.337425,"d":"R$ 5.34"},{"v":0.2201,"d":"22.01%"}]
[null,null,{"$f":"Produtos!D10","v":"Kit Presente Gourmet"},{"$f":"Produtos!G10","v":{"v":45,"d":"R$ 45.00"}},{"$f":"IFERROR(Produtos!I10/Produtos!L10,0)","v":{"v":3,"d":"R$ 3.00"}},{"$f":"Produtos!G10*Produtos!H10","v":0},{"v":48,"d":"R$ 48.00"},{"$f":"Cálculos!$D$10","v":{"v":0.085,"d":"8.50%"}},{"$f":"Cálculos!$D$15","v":{"v":0.2949,"d":"29.49%"}},{"$f":"Cálculos!$D$17","v":{"v":2.5,"d":"2.50x"}},{"v":120,"d":"R$ 120.00"},{"v":26.412,"d":"R$ 26.41"},{"v":0.2201,"d":"22.01%"}]
[null,null,{"$f":"Produtos!D11","v":"Mochila Executiva"},{"$f":"Produtos!G11","v":{"v":78,"d":"R$ 78.00"}},{"$f":"IFERROR(Produtos!I11/Produtos!L11,0)","v":{"v":6,"d":"R$ 6.00"}},{"$f":"Produtos!G11*Produtos!H11","v":0},{"v":84,"d":"R$ 84.00"},{"$f":"Cálculos!$D$10","v":{"v":0.085,"d":"8.50%"}},{"$f":"Cálculos!$D$15","v":{"v":0.2949,"d":"29.49%"}},{"$f":"Cálculos!$D$17","v":{"v":2.5,"d":"2.50x"}},{"v":210,"d":"R$ 210.00"},{"v":46.221000000000004,"d":"R$ 46.22"},{"v":0.22010000000000002,"d":"22.01%"}]
[null,null,{"$f":"Produtos!D12","v":"Fone Bluetooth TWS"},{"$f":"Produtos!G12","v":{"v":62,"d":"R$ 62.00"}},{"$f":"IFERROR(Produtos!I12/Produtos!L12,0)","v":{"v":5.5,"d":"R$ 5.50"}},{"$f":"Produtos!G12*Produtos!H12","v":{"v":4.03,"d":"R$ 4.03"}},{"v":71.53,"d":"R$ 71.53"},{"$f":"Cálculos!$D$10","v":{"v":0.085,"d":"8.50%"}},{"$f":"Cálculos!$D$15","v":{"v":0.2949,"d":"29.49%"}},{"$f":"Cálculos!$D$17","v":{"v":2.5,"d":"2.50x"}},{"v":178.83,"d":"R$ 178.83"},{"v":39.362483000000005,"d":"R$ 39.36"},{"v":0.22011118380584915,"d":"22.01%"}]
[null,null,{"$f":"Produtos!D13","v":"Garrafa Térmica 1L"},{"$f":"Produtos!G13","v":{"v":34,"d":"R$ 34.00"}},{"$f":"IFERROR(Produtos!I13/Produtos!L13,0)","v":{"v":2.3333333333333335,"d":"R$ 2.33"}},{"$f":"Produtos!G13*Produtos!H13","v":0},{"v":36.333333333333336,"d":"R$ 36.33"},{"$f":"Cálculos!$D$10","v":{"v":0.085,"d":"8.50%"}},{"$f":"Cálculos!$D$15","v":{"v":0.2949,"d":"29.49%"}},{"$f":"Cálculos!$D$17","v":{"v":2.5,"d":"2.50x"}},{"v":90.83,"d":"R$ 90.83"},{"v":19.99034966666666,"d":"R$ 19.99"},{"v":0.2200853205622224,"d":"22.01%"}]
[null,null,{"$f":"Produtos!D14","v":"Agenda Executiva 2026"},{"$f":"Produtos!G14","v":{"v":17.5,"d":"R$ 17.50"}},{"$f":"IFERROR(Produtos!I14/Produtos!L14,0)","v":{"v":1,"d":"R$ 1.00"}},{"$f":"Produtos!G14*Produtos!H14","v":0},{"v":18.5,"d":"R$ 18.50"},{"$f":"Cálculos!$D$10","v":{"v":0.085,"d":"8.50%"}},{"$f":"Cálculos!$D$15","v":{"v":0.2949,"d":"29.49%"}},{"$f":"Cálculos!$D$17","v":{"v":2.5,"d":"2.50x"}},{"v":46.25,"d":"R$ 46.25"},{"v":10.179625000000001,"d":"R$ 10.18"},{"v":0.22010000000000005,"d":"22.01%"}]
[null,null,{"$f":"Produtos!D15","v":"Boné Trucker"},{"$f":"Produtos!G15","v":{"v":14,"d":"R$ 14.00"}},{"$f":"IFERROR(Produtos!I15/Produtos!L15,0)","v":{"v":1.3571428571428572,"d":"R$ 1.36"}},{"$f":"Produtos!G15*Produtos!H15","v":0},{"v":15.357142857142858,"d":"R$ 15.36"},{"$f":"Cálculos!$D$10","v":{"v":0.085,"d":"8.50%"}},{"$f":"Cálculos!$D$15","v":{"v":0.2949,"d":"29.49%"}},{"$f":"Cálculos!$D$17","v":{"v":2.5,"d":"2.50x"}},{"v":38.39,"d":"R$ 38.39"},{"v":8.448496142857143,"d":"R$ 8.45"},{"v":0.2200702303427232,"d":"22.01%"}]

{"sheet":"Prec Indústria","index":19,"n_rows":15,"n_cols":16,"rows_kept":15,"hidden":true}
[]
[null,null,"PREC INDÚSTRIA"]
[]
[]
[]
[]
[null,null,"Produto","Matéria-Prima","Mão de Obra Direta","Horas Máquina","Custo Hora Máquina","Custo Máquina","Energia","Depreciação","Custos Indiretos","Custo de Produção","Margem Desejada %","Impostos %","Preço de Venda","Margem Líquida %"]
[null,null,{"$f":"Produtos!D8","v":"Camiseta Premium"},{"$f":"Produtos!G8","v":{"v":22,"d":"R$ 22.00"}},{"$f":"IFERROR(AVERAGE(Funcionários!$H$8:$H$14)*F8,0)","v":{"v":28.11688311688312,"d":"R$ 28.12"}},{"v":0.5,"d":"0.50"},{"$f":"IFERROR(AVERAGE(Máquinas!$H$8:$H$13),0)","v":{"v":1.975911458333333,"d":"R$ 1.98"}},{"$f":"F8*G8","v":{"v":0.9879557291666665,"d":"R$ 0.99"}},{"v":0.85,"d":"R$ 0.85"},{"$f":"IFERROR(SUM(Máquinas!$F$8:$F$13)/Cálculos!$D$11,0)","v":{"v":1.6935763888888886,"d":"R$ 1.69"}},{"$f":"Cálculos!$D$14","v":{"v":19.775,"d":"R$ 19.78"}},{"$f":"D8+E8+H8+I8+J8+K8","v":{"v":73.42341523493866,"d":"R$ 73.42"}},{"$f":"Cálculos!$D$18","v":{"v":0.25,"d":"25.00%"}},{"$f":"Cálculos!$D$10","v":{"v":0.085,"d":"8.50%"}},{"$f":"IFERROR(ROUND(L8/(1-M8-N8-Cálculos!$D$15),2),0)","v":{"v":198.39,"d":"R$ 198.39"}},{"$f":"IFERROR((O8-L8-O8*N8-O8*Cálculos!$D$15)/O8,0)","v":{"v":0.25000364819326243,"d":"25.00%"}}]
[null,null,{"$f":"Produtos!D9","v":"Caneca Cerâmica 350ml"},{"$f":"Produtos!G9","v":{"v":8.5,"d":"R$ 8.50"}},{"$f":"IFERROR(AVERAGE(Funcionários!$H$8:$H$14)*F9,0)","v":{"v":16.870129870129873,"d":"R$ 16.87"}},{"v":0.3,"d":"0.30"},{"$f":"IFERROR(AVERAGE(Máquinas!$H$8:$H$13),0)","v":{"v":1.975911458333333,"d":"R$ 1.98"}},{"v":0.5927734374999999,"d":"R$ 0.59"},{"v":0.6,"d":"R$ 0.60"},{"$f":"IFERROR(SUM(Máquinas!$F$8:$F$13)/Cálculos!$D$11,0)","v":{"v":1.6935763888888886,"d":"R$ 1.69"}},{"$f":"Cálculos!$D$14","v":{"v":19.775,"d":"R$ 19.78"}},{"v":48.03147969651876,"d":"R$ 48.03"},{"$f":"Cálculos!$D$18","v":{"v":0.25,"d":"25.00%"}},{"$f":"Cálculos!$D$10","v":{"v":0.085,"d":"8.50%"}},{"$f":"IFERROR(ROUND(L9/(1-M9-N9-Cálculos!$D$15),2),0)","v":{"v":129.78,"d":"R$ 129.78"}},{"$f":"IFERROR((O9-L9-O9*N9-O9*Cálculos!$D$15)/O9,0)","v":{"v":0.2500007574624845,"d":"25.00%"}}]
[null,null,{"$f":"Produtos!D10","v":"Kit Presente Gourmet"},{"$f":"Produtos!G10","v":{"v":45,"d":"R$ 45.00"}},{"$f":"IFERROR(AVERAGE(Funcionários!$H$8:$H$14)*F10,0)","v":{"v":44.987012987012996,"d":"R$ 44.99"}},{"v":0.8,"d":"0.80"},{"$f":"IFERROR(AVERAGE(Máquinas!$H$8:$H$13),0)","v":{"v":1.975911458333333,"d":"R$ 1.98"}},{"v":1.5807291666666665,"d":"R$ 1.58"},{"v":1.2,"d":"R$ 1.20"},{"$f":"IFERROR(SUM(Máquinas!$F$8:$F$13)/Cálculos!$D$11,0)","v":{"v":1.6935763888888886,"d":"R$ 1.69"}},{"$f":"Cálculos!$D$14","v":{"v":19.775,"d":"R$ 19.78"}},{"v":114.23631854256857,"d":"R$ 114.24"},{"$f":"Cálculos!$D$18","v":{"v":0.25,"d":"25.00%"}},{"$f":"Cálculos!$D$10","v":{"v":0.085,"d":"8.50%"}},{"$f":"IFERROR(ROUND(L10/(1-M10-N10-Cálculos!$D$15),2),0)","v":{"v":308.66,"d":"R$ 308.66"}},{"$f":"IFERROR((O10-L10-O10*N10-O10*Cálculos!$D$15)/O10,0)","v":{"v":0.24999594199906514,"d":"25.00%"}}]
[null,null,{"$f":"Produtos!D11","v":"Mochila Executiva"},{"$f":"Produtos!G11","v":{"v":78,"d":"R$ 78.00"}},{"$f":"IFERROR(AVERAGE(Funcionários!$H$8:$H$14)*F11,0)","v":{"v":67.48051948051949,"d":"R$ 67.48"}},{"v":1.2,"d":"1.20"},{"$f":"IFERROR(AVERAGE(Máquinas!$H$8:$H$13),0)","v":{"v":1.975911458333333,"d":"R$ 1.98"}},{"v":2.3710937499999996,"d":"R$ 2.37"},{"v":1.5,"d":"R$ 1.50"},{"$f":"IFERROR(SUM(Máquinas!$F$8:$F$13)/Cálculos!$D$11,0)","v":{"v":1.6935763888888886,"d":"R$ 1.69"}},{"$f":"Cálculos!$D$14","v":{"v":19.775,"d":"R$ 19.78"}},{"v":170.82018961940838,"d":"R$ 170.82"},{"$f":"Cálculos!$D$18","v":{"v":0.25,"d":"25.00%"}},{"$f":"Cálculos!$D$10","v":{"v":0.085,"d":"8.50%"}},{"$f":"IFERROR(ROUND(L11/(1-M11-N11-Cálculos!$D$15),2),0)","v":{"v":461.55,"d":"R$ 461.55"}},{"$f":"IFERROR((O11-L11-O11*N11-O11*Cálculos!$D$15)/O11,0)","v":{"v":0.24999884168690634,"d":"25.00%"}}]
[null,null,{"$f":"Produtos!D12","v":"Fone Bluetooth TWS"},{"$f":"Produtos!G12","v":{"v":62,"d":"R$ 62.00"}},{"$f":"IFERROR(AVERAGE(Funcionários!$H$8:$H$14)*F12,0)","v":{"v":33.740259740259745,"d":"R$ 33.74"}},{"v":0.6,"d":"0.60"},{"$f":"IFERROR(AVERAGE(Máquinas!$H$8:$H$13),0)","v":{"v":1.975911458333333,"d":"R$ 1.98"}},{"v":1.1855468749999998,"d":"R$ 1.19"},{"v":0.95,"d":"R$ 0.95"},{"$f":"IFERROR(SUM(Máquinas!$F$8:$F$13)/Cálculos!$D$11,0)","v":{"v":1.6935763888888886,"d":"R$ 1.69"}},{"$f":"Cálculos!$D$14","v":{"v":19.775,"d":"R$ 19.78"}},{"v":119.34438300414863,"d":"R$ 119.34"},{"$f":"Cálculos!$D$18","v":{"v":0.25,"d":"25.00%"}},{"$f":"Cálculos!$D$10","v":{"v":0.085,"d":"8.50%"}},{"$f":"IFERROR(ROUND(L12/(1-M12-N12-Cálculos!$D$15),2),0)","v":{"v":322.47,"d":"R$ 322.47"}},{"$f":"IFERROR((O12-L12-O12*N12-O12*Cálculos!$D$15)/O12,0)","v":{"v":0.2500054702634396,"d":"25.00%"}}]
[null,null,{"$f":"Produtos!D13","v":"Garrafa Térmica 1L"},{"$f":"Produtos!G13","v":{"v":34,"d":"R$ 34.00"}},{"$f":"IFERROR(AVERAGE(Funcionários!$H$8:$H$14)*F13,0)","v":{"v":22.493506493506498,"d":"R$ 22.49"}},{"v":0.4,"d":"0.40"},{"$f":"IFERROR(AVERAGE(Máquinas!$H$8:$H$13),0)","v":{"v":1.975911458333333,"d":"R$ 1.98"}},{"v":0.7903645833333333,"d":"R$ 0.79"},{"v":0.7,"d":"R$ 0.70"},{"$f":"IFERROR(SUM(Máquinas!$F$8:$F$13)/Cálculos!$D$11,0)","v":{"v":1.6935763888888886,"d":"R$ 1.69"}},{"$f":"Cálculos!$D$14","v":{"v":19.775,"d":"R$ 19.78"}},{"v":79.45244746572872,"d":"R$ 79.45"},{"$f":"Cálculos!$D$18","v":{"v":0.25,"d":"25.00%"}},{"$f":"Cálculos!$D$10","v":{"v":0.085,"d":"8.50%"}},{"$f":"IFERROR(ROUND(L13/(1-M13-N13-Cálculos!$D$15),2),0)","v":{"v":214.68,"d":"R$ 214.68"}},{"$f":"IFERROR((O13-L13-O13*N13-O13*Cálculos!$D$15)/O13,0)","v":{"v":0.25000289050806457,"d":"25.00%"}}]
[null,null,{"$f":"Produtos!D14","v":"Agenda Executiva 2026"},{"$f":"Produtos!G14","v":{"v":17.5,"d":"R$ 17.50"}},{"$f":"IFERROR(AVERAGE(Funcionários!$H$8:$H$14)*F14,0)","v":{"v":14.05844155844156,"d":"R$ 14.06"}},0.25,{"$f":"IFERROR(AVERAGE(Máquinas!$H$8:$H$13),0)","v":{"v":1.975911458333333,"d":"R$ 1.98"}},{"v":0.49397786458333326,"d":"R$ 0.49"},{"v":0.4,"d":"R$ 0.40"},{"$f":"IFERROR(SUM(Máquinas!$F$8:$F$13)/Cálculos!$D$11,0)","v":{"v":1.6935763888888886,"d":"R$ 1.69"}},{"$f":"Cálculos!$D$14","v":{"v":19.775,"d":"R$ 19.78"}},{"v":53.92099581191378,"d":"R$ 53.92"},{"$f":"Cálculos!$D$18","v":{"v":0.25,"d":"25.00%"}},{"$f":"Cálculos!$D$10","v":{"v":0.085,"d":"8.50%"}},{"$f":"IFERROR(ROUND(L14/(1-M14-N14-Cálculos!$D$15),2),0)","v":{"v":145.69,"d":"R$ 145.69"}},{"$f":"IFERROR((O14-L14-O14*N14-O14*Cálculos!$D$15)/O14,0)","v":{"v":0.24999226568801036,"d":"25.00%"}}]
[null,null,{"$f":"Produtos!D15","v":"Boné Trucker"},{"$f":"Produtos!G15","v":{"v":14,"d":"R$ 14.00"}},{"$f":"IFERROR(AVERAGE(Funcionários!$H$8:$H$14)*F15,0)","v":{"v":19.681818181818183,"d":"R$ 19.68"}},0.35,{"$f":"IFERROR(AVERAGE(Máquinas!$H$8:$H$13),0)","v":{"v":1.975911458333333,"d":"R$ 1.98"}},{"v":0.6915690104166665,"d":"R$ 0.69"},{"v":0.55,"d":"R$ 0.55"},{"$f":"IFERROR(SUM(Máquinas!$F$8:$F$13)/Cálculos!$D$11,0)","v":{"v":1.6935763888888886,"d":"R$ 1.69"}},{"$f":"Cálculos!$D$14","v":{"v":19.775,"d":"R$ 19.78"}},{"v":56.39196358112373,"d":"R$ 56.39"},{"$f":"Cálculos!$D$18","v":{"v":0.25,"d":"25.00%"}},{"$f":"Cálculos!$D$10","v":{"v":0.085,"d":"8.50%"}},{"$f":"IFERROR(ROUND(L15/(1-M15-N15-Cálculos!$D$15),2),0)","v":{"v":152.37,"d":"R$ 152.37"}},{"$f":"IFERROR((O15-L15-O15*N15-O15*Cálculos!$D$15)/O15,0)","v":{"v":0.2500011381431795,"d":"25.00%"}}]

{"sheet":"Prec E-commerce","index":20,"n_rows":15,"n_cols":16,"rows_kept":15,"hidden":true}
[]
[null,null,"PREC E-COMMERCE"]
[]
[]
[]
[]
[null,null,"Produto","Custo do Produto","Comissão Marketplace %","Gateway de Pagamento %","Frete","Embalagem","Publicidade %","Impostos %","Total % s/ Preço","Custos Fixos por Un.","Lucro Desejado %","Preço de Venda","Lucro Líquido","Margem Líquida %"]
[null,null,{"$f":"Produtos!D8","v":"Camiseta Premium"},{"$f":"Produtos!M8","v":{"v":26.7,"d":"R$ 26.70"}},{"$f":"IFERROR(INDEX('Despesas Comerciais'!$F$8:$F$14,MATCH(\"Marketplace\",'Despesas Comerciais'!$D$8:$D$14,0)),0)","v":{"v":0.16,"d":"16.00%"}},{"$f":"IFERROR(INDEX('Despesas Comerciais'!$F$8:$F$14,MATCH(\"Cartão / Gateway\",'Despesas Comerciais'!$D$8:$D$14,0)),0)","v":{"v":0.0349,"d":"3.49%"}},{"$f":"IFERROR(INDEX('Despesas Comerciais'!$G$8:$G$14,MATCH(\"Frete\",'Despesas Comerciais'!$D$8:$D$14,0)),0)","v":{"v":12,"d":"R$ 12.00"}},{"$f":"IFERROR(INDEX('Despesas Comerciais'!$G$8:$G$14,MATCH(\"Embalagem\",'Despesas Comerciais'!$D$8:$D$14,0)),0)","v":{"v":1.8,"d":"R$ 1.80"}},{"$f":"IFERROR(INDEX('Despesas Comerciais'!$F$8:$F$14,MATCH(\"Marketing\",'Despesas Comerciais'!$D$8:$D$14,0)),0)","v":{"v":0.04,"d":"4.00%"}},{"$f":"Cálculos!$D$10","v":{"v":0.085,"d":"8.50%"}},{"$f":"E8+F8+I8+J8","v":{"v":0.3199,"d":"31.99%"}},{"$f":"Cálculos!$D$14","v":{"v":19.775,"d":"R$ 19.78"}},{"$f":"Cálculos!$D$18","v":{"v":0.25,"d":"25.00%"}},{"$f":"IFERROR(ROUND((D8+G8+H8+L8)/(1-K8-M8),2),0)","v":{"v":140.14,"d":"R$ 140.14"}},{"$f":"N8-D8-G8-H8-L8-N8*K8","v":{"v":35.034213999999984,"d":"R$ 35.03"}},{"$f":"IFERROR(O8/N8,0)","v":{"v":0.24999439132296267,"d":"25.00%"}}]
[null,null,{"$f":"Produtos!D9","v":"Caneca Cerâmica 350ml"},{"$f":"Produtos!M9","v":{"v":9.98,"d":"R$ 9.98"}},{"$f":"IFERROR(INDEX('Despesas Comerciais'!$F$8:$F$14,MATCH(\"Marketplace\",'Despesas Comerciais'!$D$8:$D$14,0)),0)","v":{"v":0.16,"d":"16.00%"}},{"$f":"IFERROR(INDEX('Despesas Comerciais'!$F$8:$F$14,MATCH(\"Cartão / Gateway\",'Despesas Comerciais'!$D$8:$D$14,0)),0)","v":{"v":0.0349,"d":"3.49%"}},{"$f":"IFERROR(INDEX('Despesas Comerciais'!$G$8:$G$14,MATCH(\"Frete\",'Despesas Comerciais'!$D$8:$D$14,0)),0)","v":{"v":12,"d":"R$ 12.00"}},{"$f":"IFERROR(INDEX('Despesas Comerciais'!$G$8:$G$14,MATCH(\"Embalagem\",'Despesas Comerciais'!$D$8:$D$14,0)),0)","v":{"v":1.8,"d":"R$ 1.80"}},{"$f":"IFERROR(INDEX('Despesas Comerciais'!$F$8:$F$14,MATCH(\"Marketing\",'Despesas Comerciais'!$D$8:$D$14,0)),0)","v":{"v":0.04,"d":"4.00%"}},{"$f":"Cálculos!$D$10","v":{"v":0.085,"d":"8.50%"}},{"v":0.3199,"d":"31.99%"},{"$f":"Cálculos!$D$14","v":{"v":19.775,"d":"R$ 19.78"}},{"$f":"Cálculos!$D$18","v":{"v":0.25,"d":"25.00%"}},{"v":101.27,"d":"R$ 101.27"},{"v":25.318726999999996,"d":"R$ 25.32"},{"v":0.2500121161252098,"d":"25.00%"}]
[null,null,{"$f":"Produtos!D10","v":"Kit Presente Gourmet"},{"$f":"Produtos!M10","v":{"v":49.5,"d":"R$ 49.50"}},{"$f":"IFERROR(INDEX('Despesas Comerciais'!$F$8:$F$14,MATCH(\"Marketplace\",'Despesas Comerciais'!$D$8:$D$14,0)),0)","v":{"v":0.16,"d":"16.00%"}},{"$f":"IFERROR(INDEX('Despesas Comerciais'!$F$8:$F$14,MATCH(\"Cartão / Gateway\",'Despesas Comerciais'!$D$8:$D$14,0)),0)","v":{"v":0.0349,"d":"3.49%"}},{"$f":"IFERROR(INDEX('Despesas Comerciais'!$G$8:$G$14,MATCH(\"Frete\",'Despesas Comerciais'!$D$8:$D$14,0)),0)","v":{"v":12,"d":"R$ 12.00"}},{"$f":"IFERROR(INDEX('Despesas Comerciais'!$G$8:$G$14,MATCH(\"Embalagem\",'Despesas Comerciais'!$D$8:$D$14,0)),0)","v":{"v":1.8,"d":"R$ 1.80"}},{"$f":"IFERROR(INDEX('Despesas Comerciais'!$F$8:$F$14,MATCH(\"Marketing\",'Despesas Comerciais'!$D$8:$D$14,0)),0)","v":{"v":0.04,"d":"4.00%"}},{"$f":"Cálculos!$D$10","v":{"v":0.085,"d":"8.50%"}},{"v":0.3199,"d":"31.99%"},{"$f":"Cálculos!$D$14","v":{"v":19.775,"d":"R$ 19.78"}},{"$f":"Cálculos!$D$18","v":{"v":0.25,"d":"25.00%"}},{"v":193.15,"d":"R$ 193.15"},{"v":48.28631499999998,"d":"R$ 48.29"},{"v":0.24999386487186115,"d":"25.00%"}]
[null,null,{"$f":"Produtos!D11","v":"Mochila Executiva"},{"$f":"Produtos!M11","v":{"v":86.8,"d":"R$ 86.80"}},{"$f":"IFERROR(INDEX('Despesas Comerciais'!$F$8:$F$14,MATCH(\"Marketplace\",'Despesas Comerciais'!$D$8:$D$14,0)),0)","v":{"v":0.16,"d":"16.00%"}},{"$f":"IFERROR(INDEX('Despesas Comerciais'!$F$8:$F$14,MATCH(\"Cartão / Gateway\",'Despesas Comerciais'!$D$8:$D$14,0)),0)","v":{"v":0.0349,"d":"3.49%"}},{"$f":"IFERROR(INDEX('Despesas Comerciais'!$G$8:$G$14,MATCH(\"Frete\",'Despesas Comerciais'!$D$8:$D$14,0)),0)","v":{"v":12,"d":"R$ 12.00"}},{"$f":"IFERROR(INDEX('Despesas Comerciais'!$G$8:$G$14,MATCH(\"Embalagem\",'Despesas Comerciais'!$D$8:$D$14,0)),0)","v":{"v":1.8,"d":"R$ 1.80"}},{"$f":"IFERROR(INDEX('Despesas Comerciais'!$F$8:$F$14,MATCH(\"Marketing\",'Despesas Comerciais'!$D$8:$D$14,0)),0)","v":{"v":0.04,"d":"4.00%"}},{"$f":"Cálculos!$D$10","v":{"v":0.085,"d":"8.50%"}},{"v":0.3199,"d":"31.99%"},{"$f":"Cálculos!$D$14","v":{"v":19.775,"d":"R$ 19.78"}},{"$f":"Cálculos!$D$18","v":{"v":0.25,"d":"25.00%"}},{"v":279.88,"d":"R$ 279.88"},{"v":69.97138799999996,"d":"R$ 69.97"},{"v":0.2500049592682577,"d":"25.00%"}]
[null,null,{"$f":"Produtos!D12","v":"Fone Bluetooth TWS"},{"$f":"Produtos!M12","v":{"v":73.78,"d":"R$ 73.78"}},{"$f":"IFERROR(INDEX('Despesas Comerciais'!$F$8:$F$14,MATCH(\"Marketplace\",'Despesas Comerciais'!$D$8:$D$14,0)),0)","v":{"v":0.16,"d":"16.00%"}},{"$f":"IFERROR(INDEX('Despesas Comerciais'!$F$8:$F$14,MATCH(\"Cartão / Gateway\",'Despesas Comerciais'!$D$8:$D$14,0)),0)","v":{"v":0.0349,"d":"3.49%"}},{"$f":"IFERROR(INDEX('Despesas Comerciais'!$G$8:$G$14,MATCH(\"Frete\",'Despesas Comerciais'!$D$8:$D$14,0)),0)","v":{"v":12,"d":"R$ 12.00"}},{"$f":"IFERROR(INDEX('Despesas Comerciais'!$G$8:$G$14,MATCH(\"Embalagem\",'Despesas Comerciais'!$D$8:$D$14,0)),0)","v":{"v":1.8,"d":"R$ 1.80"}},{"$f":"IFERROR(INDEX('Despesas Comerciais'!$F$8:$F$14,MATCH(\"Marketing\",'Despesas Comerciais'!$D$8:$D$14,0)),0)","v":{"v":0.04,"d":"4.00%"}},{"$f":"Cálculos!$D$10","v":{"v":0.085,"d":"8.50%"}},{"v":0.3199,"d":"31.99%"},{"$f":"Cálculos!$D$14","v":{"v":19.775,"d":"R$ 19.78"}},{"$f":"Cálculos!$D$18","v":{"v":0.25,"d":"25.00%"}},{"v":249.6,"d":"R$ 249.60"},{"v":62.39795999999997,"d":"R$ 62.40"},{"v":0.2499918269230768,"d":"25.00%"}]
[null,null,{"$f":"Produtos!D13","v":"Garrafa Térmica 1L"},{"$f":"Produtos!M13","v":{"v":36.95,"d":"R$ 36.95"}},{"$f":"IFERROR(INDEX('Despesas Comerciais'!$F$8:$F$14,MATCH(\"Marketplace\",'Despesas Comerciais'!$D$8:$D$14,0)),0)","v":{"v":0.16,"d":"16.00%"}},{"$f":"IFERROR(INDEX('Despesas Comerciais'!$F$8:$F$14,MATCH(\"Cartão / Gateway\",'Despesas Comerciais'!$D$8:$D$14,0)),0)","v":{"v":0.0349,"d":"3.49%"}},{"$f":"IFERROR(INDEX('Despesas Comerciais'!$G$8:$G$14,MATCH(\"Frete\",'Despesas Comerciais'!$D$8:$D$14,0)),0)","v":{"v":12,"d":"R$ 12.00"}},{"$f":"IFERROR(INDEX('Despesas Comerciais'!$G$8:$G$14,MATCH(\"Embalagem\",'Despesas Comerciais'!$D$8:$D$14,0)),0)","v":{"v":1.8,"d":"R$ 1.80"}},{"$f":"IFERROR(INDEX('Despesas Comerciais'!$F$8:$F$14,MATCH(\"Marketing\",'Despesas Comerciais'!$D$8:$D$14,0)),0)","v":{"v":0.04,"d":"4.00%"}},{"$f":"Cálculos!$D$10","v":{"v":0.085,"d":"8.50%"}},{"v":0.3199,"d":"31.99%"},{"$f":"Cálculos!$D$14","v":{"v":19.775,"d":"R$ 19.78"}},{"$f":"Cálculos!$D$18","v":{"v":0.25,"d":"25.00%"}},{"v":163.97,"d":"R$ 163.97"},{"v":40.99099699999999,"d":"R$ 40.99"},{"v":0.24999083368908942,"d":"25.00%"}]
[null,null,{"$f":"Produtos!D14","v":"Agenda Executiva 2026"},{"$f":"Produtos!M14","v":{"v":18.7625,"d":"R$ 18.76"}},{"$f":"IFERROR(INDEX('Despesas Comerciais'!$F$8:$F$14,MATCH(\"Marketplace\",'Despesas Comerciais'!$D$8:$D$14,0)),0)","v":{"v":0.16,"d":"16.00%"}},{"$f":"IFERROR(INDEX('Despesas Comerciais'!$F$8:$F$14,MATCH(\"Cartão / Gateway\",'Despesas Comerciais'!$D$8:$D$14,0)),0)","v":{"v":0.0349,"d":"3.49%"}},{"$f":"IFERROR(INDEX('Despesas Comerciais'!$G$8:$G$14,MATCH(\"Frete\",'Despesas Comerciais'!$D$8:$D$14,0)),0)","v":{"v":12,"d":"R$ 12.00"}},{"$f":"IFERROR(INDEX('Despesas Comerciais'!$G$8:$G$14,MATCH(\"Embalagem\",'Despesas Comerciais'!$D$8:$D$14,0)),0)","v":{"v":1.8,"d":"R$ 1.80"}},{"$f":"IFERROR(INDEX('Despesas Comerciais'!$F$8:$F$14,MATCH(\"Marketing\",'Despesas Comerciais'!$D$8:$D$14,0)),0)","v":{"v":0.04,"d":"4.00%"}},{"$f":"Cálculos!$D$10","v":{"v":0.085,"d":"8.50%"}},{"v":0.3199,"d":"31.99%"},{"$f":"Cálculos!$D$14","v":{"v":19.775,"d":"R$ 19.78"}},{"$f":"Cálculos!$D$18","v":{"v":0.25,"d":"25.00%"}},{"v":121.69,"d":"R$ 121.69"},{"v":30.42386899999999,"d":"R$ 30.42"},{"v":0.2500112498972799,"d":"25.00%"}]
[null,null,{"$f":"Produtos!D15","v":"Boné Trucker"},{"$f":"Produtos!M15","v":{"v":15.714285714285714,"d":"R$ 15.71"}},{"$f":"IFERROR(INDEX('Despesas Comerciais'!$F$8:$F$14,MATCH(\"Marketplace\",'Despesas Comerciais'!$D$8:$D$14,0)),0)","v":{"v":0.16,"d":"16.00%"}},{"$f":"IFERROR(INDEX('Despesas Comerciais'!$F$8:$F$14,MATCH(\"Cartão / Gateway\",'Despesas Comerciais'!$D$8:$D$14,0)),0)","v":{"v":0.0349,"d":"3.49%"}},{"$f":"IFERROR(INDEX('Despesas Comerciais'!$G$8:$G$14,MATCH(\"Frete\",'Despesas Comerciais'!$D$8:$D$14,0)),0)","v":{"v":12,"d":"R$ 12.00"}},{"$f":"IFERROR(INDEX('Despesas Comerciais'!$G$8:$G$14,MATCH(\"Embalagem\",'Despesas Comerciais'!$D$8:$D$14,0)),0)","v":{"v":1.8,"d":"R$ 1.80"}},{"$f":"IFERROR(INDEX('Despesas Comerciais'!$F$8:$F$14,MATCH(\"Marketing\",'Despesas Comerciais'!$D$8:$D$14,0)),0)","v":{"v":0.04,"d":"4.00%"}},{"$f":"Cálculos!$D$10","v":{"v":0.085,"d":"8.50%"}},{"v":0.3199,"d":"31.99%"},{"$f":"Cálculos!$D$14","v":{"v":19.775,"d":"R$ 19.78"}},{"$f":"Cálculos!$D$18","v":{"v":0.25,"d":"25.00%"}},{"v":114.6,"d":"R$ 114.60"},{"v":28.650174285714286,"d":"R$ 28.65"},{"v":0.2500015208177512,"d":"25.00%"}]

{"sheet":"Prec Delivery","index":21,"n_rows":15,"n_cols":15,"rows_kept":15,"hidden":true}
[]
[null,null,"PREC DELIVERY"]
[]
[]
[]
[]
[null,null,"Produto","Custo do Produto (CMV)","Embalagem","Taxa do Aplicativo %","Taxa de Entrega Cobrada","Custo Motoboy","Impostos %","Custos Fixos por Un.","Custo Total","Lucro Desejado %","Preço de Venda","Lucro Líquido","Margem Líquida %"]
[null,null,{"$f":"Produtos!D8","v":"Camiseta Premium"},{"$f":"Produtos!M8","v":{"v":26.7,"d":"R$ 26.70"}},{"$f":"IFERROR(INDEX('Despesas Comerciais'!$G$8:$G$14,MATCH(\"Embalagem\",'Despesas Comerciais'!$D$8:$D$14,0)),0)","v":{"v":1.8,"d":"R$ 1.80"}},{"v":0.27,"d":"27.00%"},{"v":6.99,"d":"R$ 6.99"},{"v":8.5,"d":"R$ 8.50"},{"$f":"Cálculos!$D$10","v":{"v":0.085,"d":"8.50%"}},{"$f":"Cálculos!$D$14","v":{"v":19.775,"d":"R$ 19.78"}},{"$f":"D8+E8+H8+J8-G8","v":{"v":49.785,"d":"R$ 49.79"}},{"$f":"Cálculos!$D$18","v":{"v":0.25,"d":"25.00%"}},{"$f":"IFERROR(ROUND(K8/(1-F8-I8-L8),2),0)","v":{"v":126.04,"d":"R$ 126.04"}},{"$f":"M8-K8-M8*F8-M8*I8","v":{"v":31.510800000000003,"d":"R$ 31.51"}},{"$f":"IFERROR(N8/M8,0)","v":{"v":0.25000634719136783,"d":"25.00%"}}]
[null,null,{"$f":"Produtos!D9","v":"Caneca Cerâmica 350ml"},{"$f":"Produtos!M9","v":{"v":9.98,"d":"R$ 9.98"}},{"$f":"IFERROR(INDEX('Despesas Comerciais'!$G$8:$G$14,MATCH(\"Embalagem\",'Despesas Comerciais'!$D$8:$D$14,0)),0)","v":{"v":1.8,"d":"R$ 1.80"}},{"v":0.27,"d":"27.00%"},{"v":6.99,"d":"R$ 6.99"},{"v":8.5,"d":"R$ 8.50"},{"$f":"Cálculos!$D$10","v":{"v":0.085,"d":"8.50%"}},{"$f":"Cálculos!$D$14","v":{"v":19.775,"d":"R$ 19.78"}},{"v":33.065,"d":"R$ 33.07"},{"$f":"Cálculos!$D$18","v":{"v":0.25,"d":"25.00%"}},{"v":83.71,"d":"R$ 83.71"},{"v":20.927949999999996,"d":"R$ 20.93"},{"v":0.2500053757018277,"d":"25.00%"}]
[null,null,{"$f":"Produtos!D10","v":"Kit Presente Gourmet"},{"$f":"Produtos!M10","v":{"v":49.5,"d":"R$ 49.50"}},{"$f":"IFERROR(INDEX('Despesas Comerciais'!$G$8:$G$14,MATCH(\"Embalagem\",'Despesas Comerciais'!$D$8:$D$14,0)),0)","v":{"v":1.8,"d":"R$ 1.80"}},{"v":0.27,"d":"27.00%"},{"v":6.99,"d":"R$ 6.99"},{"v":8.5,"d":"R$ 8.50"},{"$f":"Cálculos!$D$10","v":{"v":0.085,"d":"8.50%"}},{"$f":"Cálculos!$D$14","v":{"v":19.775,"d":"R$ 19.78"}},{"v":72.585,"d":"R$ 72.59"},{"$f":"Cálculos!$D$18","v":{"v":0.25,"d":"25.00%"}},{"v":183.76,"d":"R$ 183.76"},{"v":45.9402,"d":"R$ 45.94"},{"v":0.25000108837614277,"d":"25.00%"}]
[null,null,{"$f":"Produtos!D11","v":"Mochila Executiva"},{"$f":"Produtos!M11","v":{"v":86.8,"d":"R$ 86.80"}},{"$f":"IFERROR(INDEX('Despesas Comerciais'!$G$8:$G$14,MATCH(\"Embalagem\",'Despesas Comerciais'!$D$8:$D$14,0)),0)","v":{"v":1.8,"d":"R$ 1.80"}},{"v":0.27,"d":"27.00%"},{"v":6.99,"d":"R$ 6.99"},{"v":8.5,"d":"R$ 8.50"},{"$f":"Cálculos!$D$10","v":{"v":0.085,"d":"8.50%"}},{"$f":"Cálculos!$D$14","v":{"v":19.775,"d":"R$ 19.78"}},{"v":109.885,"d":"R$ 109.89"},{"$f":"Cálculos!$D$18","v":{"v":0.25,"d":"25.00%"}},{"v":278.19,"d":"R$ 278.19"},{"v":69.54755,"d":"R$ 69.55"},{"v":0.2500001797332758,"d":"25.00%"}]
[null,null,{"$f":"Produtos!D12","v":"Fone Bluetooth TWS"},{"$f":"Produtos!M12","v":{"v":73.78,"d":"R$ 73.78"}},{"$f":"IFERROR(INDEX('Despesas Comerciais'!$G$8:$G$14,MATCH(\"Embalagem\",'Despesas Comerciais'!$D$8:$D$14,0)),0)","v":{"v":1.8,"d":"R$ 1.80"}},{"v":0.27,"d":"27.00%"},{"v":6.99,"d":"R$ 6.99"},{"v":8.5,"d":"R$ 8.50"},{"$f":"Cálculos!$D$10","v":{"v":0.085,"d":"8.50%"}},{"$f":"Cálculos!$D$14","v":{"v":19.775,"d":"R$ 19.78"}},{"v":96.865,"d":"R$ 96.87"},{"$f":"Cálculos!$D$18","v":{"v":0.25,"d":"25.00%"}},{"v":245.23,"d":"R$ 245.23"},{"v":61.308350000000004,"d":"R$ 61.31"},{"v":0.25000346613383356,"d":"25.00%"}]
[null,null,{"$f":"Produtos!D13","v":"Garrafa Térmica 1L"},{"$f":"Produtos!M13","v":{"v":36.95,"d":"R$ 36.95"}},{"$f":"IFERROR(INDEX('Despesas Comerciais'!$G$8:$G$14,MATCH(\"Embalagem\",'Despesas Comerciais'!$D$8:$D$14,0)),0)","v":{"v":1.8,"d":"R$ 1.80"}},{"v":0.27,"d":"27.00%"},{"v":6.99,"d":"R$ 6.99"},{"v":8.5,"d":"R$ 8.50"},{"$f":"Cálculos!$D$10","v":{"v":0.085,"d":"8.50%"}},{"$f":"Cálculos!$D$14","v":{"v":19.775,"d":"R$ 19.78"}},{"v":60.035000000000004,"d":"R$ 60.04"},{"$f":"Cálculos!$D$18","v":{"v":0.25,"d":"25.00%"}},{"v":151.99,"d":"R$ 151.99"},{"v":37.99855000000001,"d":"R$ 38.00"},{"v":0.25000690834923356,"d":"25.00%"}]
[null,null,{"$f":"Produtos!D14","v":"Agenda Executiva 2026"},{"$f":"Produtos!M14","v":{"v":18.7625,"d":"R$ 18.76"}},{"$f":"IFERROR(INDEX('Despesas Comerciais'!$G$8:$G$14,MATCH(\"Embalagem\",'Despesas Comerciais'!$D$8:$D$14,0)),0)","v":{"v":1.8,"d":"R$ 1.80"}},{"v":0.27,"d":"27.00%"},{"v":6.99,"d":"R$ 6.99"},{"v":8.5,"d":"R$ 8.50"},{"$f":"Cálculos!$D$10","v":{"v":0.085,"d":"8.50%"}},{"$f":"Cálculos!$D$14","v":{"v":19.775,"d":"R$ 19.78"}},{"v":41.8475,"d":"R$ 41.85"},{"$f":"Cálculos!$D$18","v":{"v":0.25,"d":"25.00%"}},{"v":105.94,"d":"R$ 105.94"},{"v":26.483800000000002,"d":"R$ 26.48"},{"v":0.24998867283367945,"d":"25.00%"}]
[null,null,{"$f":"Produtos!D15","v":"Boné Trucker"},{"$f":"Produtos!M15","v":{"v":15.714285714285714,"d":"R$ 15.71"}},{"$f":"IFERROR(INDEX('Despesas Comerciais'!$G$8:$G$14,MATCH(\"Embalagem\",'Despesas Comerciais'!$D$8:$D$14,0)),0)","v":{"v":1.8,"d":"R$ 1.80"}},{"v":0.27,"d":"27.00%"},{"v":6.99,"d":"R$ 6.99"},{"v":8.5,"d":"R$ 8.50"},{"$f":"Cálculos!$D$10","v":{"v":0.085,"d":"8.50%"}},{"$f":"Cálculos!$D$14","v":{"v":19.775,"d":"R$ 19.78"}},{"v":38.79928571428571,"d":"R$ 38.80"},{"$f":"Cálculos!$D$18","v":{"v":0.25,"d":"25.00%"}},{"v":98.23,"d":"R$ 98.23"},{"v":24.559064285714292,"d":"R$ 24.56"},{"v":0.25001592472477135,"d":"25.00%"}]

{"sheet":"Prec Alimentação","index":22,"n_rows":15,"n_cols":16,"rows_kept":15,"hidden":true}
[]
[null,null,"PREC ALIMENTAÇÃO"]
[]
[]
[]
[]
[null,null,"Prato / Item","Ficha Técnica (ingredientes)","Custo Ingredientes","Rendimento (porções)","CMV por Porção","Perdas %","CMV Ajustado","Mão de Obra","Despesas Operacionais","Custo Total","CMV Alvo %","Preço de Venda","Lucro Líquido","Margem Líquida %"]
[null,null,"Feijoada Completa","Feijão, carnes, linguiça, farofa, arroz, couve",{"v":68,"d":"R$ 68.00"},6,{"$f":"IFERROR(E8/F8,0)","v":{"v":11.333333333333334,"d":"R$ 11.33"}},{"v":0.05,"d":"5.00%"},{"$f":"G8*(1+H8)","v":{"v":11.9,"d":"R$ 11.90"}},{"v":4.5,"d":"R$ 4.50"},{"$f":"Cálculos!$D$14*0.3","v":{"v":5.932499999999999,"d":"R$ 5.93"}},{"$f":"I8+J8+K8","v":{"v":22.332499999999996,"d":"R$ 22.33"}},{"v":0.3,"d":"30.00%"},{"$f":"IFERROR(ROUND(L8/(1-M8-Cálculos!$D$10-Cálculos!$D$15),2),0)","v":{"v":69.77,"d":"R$ 69.77"}},{"$f":"N8-L8-N8*Cálculos!$D$10-N8*Cálculos!$D$15","v":{"v":20.931877,"d":"R$ 20.93"}},{"$f":"IFERROR(O8/N8,0)","v":{"v":0.300012569872438,"d":"30.00%"}}]
[null,null,"Risoto de Camarão","Arroz arbóreo, camarão, creme, queijo",{"v":92,"d":"R$ 92.00"},4,{"v":23,"d":"R$ 23.00"},{"v":0.08,"d":"8.00%"},{"v":24.840000000000003,"d":"R$ 24.84"},{"v":7.2,"d":"R$ 7.20"},{"$f":"Cálculos!$D$14*0.3","v":{"v":5.932499999999999,"d":"R$ 5.93"}},{"v":37.972500000000004,"d":"R$ 37.97"},{"v":0.32,"d":"32.00%"},{"$f":"IFERROR(ROUND(L9/(1-M9-Cálculos!$D$10-Cálculos!$D$15),2),0)","v":{"v":126.53,"d":"R$ 126.53"}},{"$f":"N9-L9-N9*Cálculos!$D$10-N9*Cálculos!$D$15","v":{"v":40.48875300000001,"d":"R$ 40.49"}},{"v":0.31999330593535136,"d":"32.00%"}]
[null,null,"Salada Caesar","Alface, frango, croutons, parmesão, molho",{"v":34,"d":"R$ 34.00"},5,{"v":6.8,"d":"R$ 6.80"},{"v":0.12,"d":"12.00%"},{"v":7.6160000000000005,"d":"R$ 7.62"},{"v":3.1,"d":"R$ 3.10"},{"$f":"Cálculos!$D$14*0.3","v":{"v":5.932499999999999,"d":"R$ 5.93"}},{"v":16.6485,"d":"R$ 16.65"},{"v":0.28,"d":"28.00%"},{"$f":"IFERROR(ROUND(L10/(1-M10-Cálculos!$D$10-Cálculos!$D$15),2),0)","v":{"v":48.95,"d":"R$ 48.95"}},{"$f":"N10-L10-N10*Cálculos!$D$10-N10*Cálculos!$D$15","v":{"v":13.705395000000003,"d":"R$ 13.71"}},{"v":0.27998764044943825,"d":"28.00%"}]
[null,null,"Hambúrguer Artesanal","Pão, blend 180g, queijo, bacon, molho",{"v":28,"d":"R$ 28.00"},3,{"v":9.333333333333334,"d":"R$ 9.33"},{"v":0.04,"d":"4.00%"},{"v":9.706666666666667,"d":"R$ 9.71"},{"v":5.4,"d":"R$ 5.40"},{"$f":"Cálculos!$D$14*0.3","v":{"v":5.932499999999999,"d":"R$ 5.93"}},{"v":21.039166666666667,"d":"R$ 21.04"},{"v":0.3,"d":"30.00%"},{"$f":"IFERROR(ROUND(L11/(1-M11-Cálculos!$D$10-Cálculos!$D$15),2),0)","v":{"v":65.73,"d":"R$ 65.73"}},{"$f":"N11-L11-N11*Cálculos!$D$10-N11*Cálculos!$D$15","v":{"v":19.720006333333338,"d":"R$ 19.72"}},{"v":0.30001531010700344,"d":"30.00%"}]
[null,null,"Lasanha Bolonhesa","Massa, carne moída, molho, queijo, presunto",{"v":76,"d":"R$ 76.00"},8,{"v":9.5,"d":"R$ 9.50"},{"v":0.05,"d":"5.00%"},{"v":9.975,"d":"R$ 9.98"},{"v":4.8,"d":"R$ 4.80"},{"$f":"Cálculos!$D$14*0.3","v":{"v":5.932499999999999,"d":"R$ 5.93"}},{"v":20.707499999999996,"d":"R$ 20.71"},{"v":0.3,"d":"30.00%"},{"$f":"IFERROR(ROUND(L12/(1-M12-Cálculos!$D$10-Cálculos!$D$15),2),0)","v":{"v":64.69,"d":"R$ 64.69"}},{"$f":"N12-L12-N12*Cálculos!$D$10-N12*Cálculos!$D$15","v":{"v":19.406769000000004,"d":"R$ 19.41"}},{"v":0.2999964291235122,"d":"30.00%"}]
[null,null,"Filé ao Molho Madeira","Filé mignon, cogumelos, creme, batata",{"v":54,"d":"R$ 54.00"},3,{"v":18,"d":"R$ 18.00"},{"v":0.06,"d":"6.00%"},{"v":19.080000000000002,"d":"R$ 19.08"},{"v":8.9,"d":"R$ 8.90"},{"$f":"Cálculos!$D$14*0.3","v":{"v":5.932499999999999,"d":"R$ 5.93"}},{"v":33.9125,"d":"R$ 33.91"},{"v":0.33,"d":"33.00%"},{"$f":"IFERROR(ROUND(L13/(1-M13-Cálculos!$D$10-Cálculos!$D$15),2),0)","v":{"v":116.9,"d":"R$ 116.90"}},{"$f":"N13-L13-N13*Cálculos!$D$10-N13*Cálculos!$D$15","v":{"v":38.577190000000016,"d":"R$ 38.58"}},{"v":0.33000162532078714,"d":"33.00%"}]
[null,null,"Açaí 500ml","Açaí, granola, banana, leite condensado",{"v":18.5,"d":"R$ 18.50"},2,{"v":9.25,"d":"R$ 9.25"},{"v":0.1,"d":"10.00%"},{"v":10.175,"d":"R$ 10.18"},{"v":2.2,"d":"R$ 2.20"},{"$f":"Cálculos!$D$14*0.3","v":{"v":5.932499999999999,"d":"R$ 5.93"}},{"v":18.307499999999997,"d":"R$ 18.31"},{"v":0.25,"d":"25.00%"},{"$f":"IFERROR(ROUND(L14/(1-M14-Cálculos!$D$10-Cálculos!$D$15),2),0)","v":{"v":49.47,"d":"R$ 49.47"}},{"$f":"N14-L14-N14*Cálculos!$D$10-N14*Cálculos!$D$15","v":{"v":12.368847000000002,"d":"R$ 12.37"}},{"v":0.2500272286234082,"d":"25.00%"}]
[null,null,"Marmita Executiva","Arroz, feijão, proteína, salada, guarnição",{"v":22,"d":"R$ 22.00"},2,{"v":11,"d":"R$ 11.00"},{"v":0.05,"d":"5.00%"},{"v":11.55,"d":"R$ 11.55"},{"v":3.6,"d":"R$ 3.60"},{"$f":"Cálculos!$D$14*0.3","v":{"v":5.932499999999999,"d":"R$ 5.93"}},{"v":21.0825,"d":"R$ 21.08"},{"v":0.28,"d":"28.00%"},{"$f":"IFERROR(ROUND(L15/(1-M15-Cálculos!$D$10-Cálculos!$D$15),2),0)","v":{"v":61.99,"d":"R$ 61.99"}},{"$f":"N15-L15-N15*Cálculos!$D$10-N15*Cálculos!$D$15","v":{"v":17.357498999999994,"d":"R$ 17.36"}},{"v":0.2800048233586061,"d":"28.00%"}]

{"sheet":"Prec Artesanato","index":23,"n_rows":15,"n_cols":15,"rows_kept":15,"hidden":true}
[]
[null,null,"PREC ARTESANATO"]
[]
[]
[]
[]
[null,null,"Peça","Matéria-Prima","Horas de Trabalho","Valor Hora Artesão","Custo Mão de Obra","Energia","Desgaste de Ferramentas","Custo Total","Lucro Desejado %","Impostos %","Preço de Venda","Preço Sugerido Atacado","Margem Líquida %"]
[null,null,{"$f":"Produtos!D8","v":"Camiseta Premium"},{"$f":"Produtos!G8","v":{"v":22,"d":"R$ 22.00"}},{"v":1.5,"d":"1.50"},{"v":45,"d":"R$ 45.00"},{"$f":"E8*F8","v":{"v":67.5,"d":"R$ 67.50"}},{"v":1.2,"d":"R$ 1.20"},{"v":2.5,"d":"R$ 2.50"},{"$f":"D8+G8+H8+I8","v":{"v":93.2,"d":"R$ 93.20"}},{"$f":"Cálculos!$D$18","v":{"v":0.25,"d":"25.00%"}},{"$f":"Cálculos!$D$10","v":{"v":0.085,"d":"8.50%"}},{"$f":"IFERROR(ROUND(J8/(1-K8-L8),2),0)","v":{"v":140.15,"d":"R$ 140.15"}},{"$f":"ROUND(M8*0.7,2)","v":{"v":98.11,"d":"R$ 98.11"}},{"$f":"IFERROR((M8-J8-M8*L8)/M8,0)","v":{"v":0.24999821619693186,"d":"25.00%"}}]
[null,null,{"$f":"Produtos!D9","v":"Caneca Cerâmica 350ml"},{"$f":"Produtos!G9","v":{"v":8.5,"d":"R$ 8.50"}},{"v":0.8,"d":"0.80"},{"v":45,"d":"R$ 45.00"},{"v":36,"d":"R$ 36.00"},{"v":0.8,"d":"R$ 0.80"},{"v":1.2,"d":"R$ 1.20"},{"v":46.5,"d":"R$ 46.50"},{"$f":"Cálculos!$D$18","v":{"v":0.25,"d":"25.00%"}},{"$f":"Cálculos!$D$10","v":{"v":0.085,"d":"8.50%"}},{"v":69.92,"d":"R$ 69.92"},{"v":48.94,"d":"R$ 48.94"},{"v":0.24995423340961098,"d":"25.00%"}]
[null,null,{"$f":"Produtos!D10","v":"Kit Presente Gourmet"},{"$f":"Produtos!G10","v":{"v":45,"d":"R$ 45.00"}},{"v":2,"d":"2.00"},{"v":45,"d":"R$ 45.00"},{"v":90,"d":"R$ 90.00"},{"v":1.6,"d":"R$ 1.60"},{"v":3,"d":"R$ 3.00"},{"v":139.6,"d":"R$ 139.60"},{"$f":"Cálculos!$D$18","v":{"v":0.25,"d":"25.00%"}},{"$f":"Cálculos!$D$10","v":{"v":0.085,"d":"8.50%"}},{"v":209.92,"d":"R$ 209.92"},{"v":146.94,"d":"R$ 146.94"},{"v":0.249984756097561,"d":"25.00%"}]
[null,null,{"$f":"Produtos!D11","v":"Mochila Executiva"},{"$f":"Produtos!G11","v":{"v":78,"d":"R$ 78.00"}},{"v":3.5,"d":"3.50"},{"v":45,"d":"R$ 45.00"},{"v":157.5,"d":"R$ 157.50"},{"v":2.4,"d":"R$ 2.40"},{"v":4.5,"d":"R$ 4.50"},{"v":242.4,"d":"R$ 242.40"},{"$f":"Cálculos!$D$18","v":{"v":0.25,"d":"25.00%"}},{"$f":"Cálculos!$D$10","v":{"v":0.085,"d":"8.50%"}},{"v":364.51,"d":"R$ 364.51"},{"v":255.16,"d":"R$ 255.16"},{"v":0.249997668102384,"d":"25.00%"}]
[null,null,{"$f":"Produtos!D12","v":"Fone Bluetooth TWS"},{"$f":"Produtos!G12","v":{"v":62,"d":"R$ 62.00"}},{"v":1.2,"d":"1.20"},{"v":45,"d":"R$ 45.00"},{"v":54,"d":"R$ 54.00"},{"v":1,"d":"R$ 1.00"},{"v":1.8,"d":"R$ 1.80"},{"v":118.8,"d":"R$ 118.80"},{"$f":"Cálculos!$D$18","v":{"v":0.25,"d":"25.00%"}},{"$f":"Cálculos!$D$10","v":{"v":0.085,"d":"8.50%"}},{"v":178.65,"d":"R$ 178.65"},{"v":125.06,"d":"R$ 125.06"},{"v":0.2500125944584383,"d":"25.00%"}]
[null,null,{"$f":"Produtos!D13","v":"Garrafa Térmica 1L"},{"$f":"Produtos!G13","v":{"v":34,"d":"R$ 34.00"}},{"v":1,"d":"1.00"},{"v":45,"d":"R$ 45.00"},{"v":45,"d":"R$ 45.00"},{"v":0.9,"d":"R$ 0.90"},{"v":1.5,"d":"R$ 1.50"},{"v":81.4,"d":"R$ 81.40"},{"$f":"Cálculos!$D$18","v":{"v":0.25,"d":"25.00%"}},{"$f":"Cálculos!$D$10","v":{"v":0.085,"d":"8.50%"}},{"v":122.41,"d":"R$ 122.41"},{"v":85.69,"d":"R$ 85.69"},{"v":0.25002164855812425,"d":"25.00%"}]
[null,null,{"$f":"Produtos!D14","v":"Agenda Executiva 2026"},{"$f":"Produtos!G14","v":{"v":17.5,"d":"R$ 17.50"}},{"v":0.6,"d":"0.60"},{"v":45,"d":"R$ 45.00"},{"v":27,"d":"R$ 27.00"},{"v":0.5,"d":"R$ 0.50"},{"v":0.8,"d":"R$ 0.80"},{"v":45.8,"d":"R$ 45.80"},{"$f":"Cálculos!$D$18","v":{"v":0.25,"d":"25.00%"}},{"$f":"Cálculos!$D$10","v":{"v":0.085,"d":"8.50%"}},{"v":68.87,"d":"R$ 68.87"},{"v":48.21,"d":"R$ 48.21"},{"v":0.24997894583998845,"d":"25.00%"}]
[null,null,{"$f":"Produtos!D15","v":"Boné Trucker"},{"$f":"Produtos!G15","v":{"v":14,"d":"R$ 14.00"}},{"v":0.9,"d":"0.90"},{"v":45,"d":"R$ 45.00"},{"v":40.5,"d":"R$ 40.50"},{"v":0.7,"d":"R$ 0.70"},{"v":1.1,"d":"R$ 1.10"},{"v":56.300000000000004,"d":"R$ 56.30"},{"$f":"Cálculos!$D$18","v":{"v":0.25,"d":"25.00%"}},{"$f":"Cálculos!$D$10","v":{"v":0.085,"d":"8.50%"}},{"v":84.66,"d":"R$ 84.66"},{"v":59.26,"d":"R$ 59.26"},{"v":0.24998700685093306,"d":"25.00%"}]

{"sheet":"Prec Infoprodutos","index":24,"n_rows":13,"n_cols":16,"rows_kept":13,"hidden":true}
[]
[null,null,"PREC INFOPRODUTOS"]
[]
[]
[]
[]
[null,null,"Infoproduto","Categoria","Custo de Produção","Vendas Estimadas","Custo Produção por Venda","Marketing por Venda","Comissão Afiliados %","Taxa da Plataforma %","Impostos %","Total % s/ Preço","Lucro Desejado %","Preço de Venda","Lucro Líquido","Margem Líquida %"]
[null,null,"Curso Online de Excel","Curso",{"v":18000,"d":"R$ 18,000.00"},600,{"$f":"IFERROR(E8/F8,0)","v":{"v":30,"d":"R$ 30.00"}},{"v":38,"d":"R$ 38.00"},{"v":0.4,"d":"40.00%"},{"v":0.0999,"d":"9.99%"},{"$f":"Cálculos!$D$10","v":{"v":0.085,"d":"8.50%"}},{"$f":"I8+J8+K8","v":{"v":0.5849,"d":"58.49%"}},{"$f":"Cálculos!$D$18","v":{"v":0.25,"d":"25.00%"}},{"$f":"IFERROR(ROUND((G8+H8)/(1-L8-M8),2),0)","v":{"v":411.87,"d":"R$ 411.87"}},{"$f":"N8-G8-H8-N8*L8","v":{"v":102.96723700000001,"d":"R$ 102.97"}},{"$f":"IFERROR(O8/N8,0)","v":{"v":0.24999936144900092,"d":"25.00%"}}]
[null,null,"E-book Precificação","E-book",{"v":3500,"d":"R$ 3,500.00"},{"v":1500,"d":"1,500"},{"v":2.3333333333333335,"d":"R$ 2.33"},{"v":9.5,"d":"R$ 9.50"},{"v":0.3,"d":"30.00%"},{"v":0.0999,"d":"9.99%"},{"$f":"Cálculos!$D$10","v":{"v":0.085,"d":"8.50%"}},{"v":0.4849,"d":"48.49%"},{"$f":"Cálculos!$D$18","v":{"v":0.25,"d":"25.00%"}},{"v":44.64,"d":"R$ 44.64"},{"v":11.160730666666666,"d":"R$ 11.16"},{"v":0.2500163679808841,"d":"25.00%"}]
[null,null,"Mentoria em Grupo","Mentoria",{"v":9000,"d":"R$ 9,000.00"},80,{"v":112.5,"d":"R$ 112.50"},{"v":120,"d":"R$ 120.00"},{"v":0.2,"d":"20.00%"},{"v":0.0499,"d":"4.99%"},{"$f":"Cálculos!$D$10","v":{"v":0.085,"d":"8.50%"}},{"v":0.33490000000000003,"d":"33.49%"},{"$f":"Cálculos!$D$18","v":{"v":0.25,"d":"25.00%"}},{"v":560.11,"d":"R$ 560.11"},{"v":140.029161,"d":"R$ 140.03"},{"v":0.2500029654889218,"d":"25.00%"}]
[null,null,"Curso de Marketing Digital","Curso",{"v":24000,"d":"R$ 24,000.00"},900,{"v":26.666666666666668,"d":"R$ 26.67"},{"v":52,"d":"R$ 52.00"},{"v":0.4,"d":"40.00%"},{"v":0.0999,"d":"9.99%"},{"$f":"Cálculos!$D$10","v":{"v":0.085,"d":"8.50%"}},{"v":0.5849,"d":"58.49%"},{"$f":"Cálculos!$D$18","v":{"v":0.25,"d":"25.00%"}},{"v":476.48,"d":"R$ 476.48"},{"v":119.12018133333333,"d":"R$ 119.12"},{"v":0.2500003805686143,"d":"25.00%"}]
[null,null,"Templates Financeiros","Template",{"v":6500,"d":"R$ 6,500.00"},{"v":1200,"d":"1,200"},{"v":5.416666666666667,"d":"R$ 5.42"},{"v":14,"d":"R$ 14.00"},{"v":0.35,"d":"35.00%"},{"v":0.0999,"d":"9.99%"},{"$f":"Cálculos!$D$10","v":{"v":0.085,"d":"8.50%"}},{"v":0.5348999999999999,"d":"53.49%"},{"$f":"Cálculos!$D$18","v":{"v":0.25,"d":"25.00%"}},{"v":90.27,"d":"R$ 90.27"},{"v":22.56791033333333,"d":"R$ 22.57"},{"v":0.25000454562239205,"d":"25.00%"}]
[null,null,"Comunidade Premium","Comunidade",{"v":12000,"d":"R$ 12,000.00"},400,{"v":30,"d":"R$ 30.00"},{"v":28,"d":"R$ 28.00"},{"v":0.25,"d":"25.00%"},{"v":0.0699,"d":"6.99%"},{"$f":"Cálculos!$D$10","v":{"v":0.085,"d":"8.50%"}},{"v":0.40490000000000004,"d":"40.49%"},{"$f":"Cálculos!$D$18","v":{"v":0.25,"d":"25.00%"}},{"v":168.07,"d":"R$ 168.07"},{"v":42.018456999999984,"d":"R$ 42.02"},{"v":0.250005694056048,"d":"25.00%"}]

{"sheet":"Prec Assinaturas","index":25,"n_rows":13,"n_cols":16,"rows_kept":13,"hidden":true}
[]
[null,null,"PREC ASSINATURAS"]
[]
[]
[]
[]
[null,null,"Plano","CAC","Churn Mensal %","Tempo de Vida (meses)","CAC por Mês","Suporte por Cliente","Infraestrutura por Cliente","Custo Total Mensal","Impostos %","Margem Desejada %","Mensalidade","LTV","LTV / CAC","Margem Líquida %"]
[null,null,"Plano Básico",{"v":180,"d":"R$ 180.00"},{"v":0.08,"d":"8.00%"},{"$f":"IFERROR(1/E8,0)","v":{"v":12.5,"d":"12.50"}},{"$f":"IFERROR(D8/F8,0)","v":{"v":14.4,"d":"R$ 14.40"}},{"v":8,"d":"R$ 8.00"},{"v":6.5,"d":"R$ 6.50"},{"$f":"G8+H8+I8","v":{"v":28.9,"d":"R$ 28.90"}},{"$f":"Cálculos!$D$10","v":{"v":0.085,"d":"8.50%"}},{"$f":"Cálculos!$D$18","v":{"v":0.25,"d":"25.00%"}},{"$f":"IFERROR(ROUND(J8/(1-K8-L8),2),0)","v":{"v":43.46,"d":"R$ 43.46"}},{"$f":"M8*F8","v":{"v":543.25,"d":"R$ 543.25"}},{"$f":"IFERROR(N8/D8,0)","v":{"v":3.0180555555555557,"d":"3.02x"}},{"$f":"IFERROR((M8-J8-M8*K8)/M8,0)","v":{"v":0.250020708697653,"d":"25.00%"}}]
[null,null,"Plano Profissional",{"v":420,"d":"R$ 420.00"},{"v":0.05,"d":"5.00%"},{"v":20,"d":"20.00"},{"v":21,"d":"R$ 21.00"},{"v":18,"d":"R$ 18.00"},{"v":14,"d":"R$ 14.00"},{"v":53,"d":"R$ 53.00"},{"$f":"Cálculos!$D$10","v":{"v":0.085,"d":"8.50%"}},{"$f":"Cálculos!$D$18","v":{"v":0.25,"d":"25.00%"}},{"v":79.7,"d":"R$ 79.70"},{"v":1594,"d":"R$ 1,594.00"},{"v":3.795238095238095,"d":"3.80x"},{"v":0.25000627352572147,"d":"25.00%"}]
[null,null,"Plano Empresarial",{"v":1200,"d":"R$ 1,200.00"},{"v":0.03,"d":"3.00%"},{"v":33.333333333333336,"d":"33.33"},{"v":36,"d":"R$ 36.00"},{"v":55,"d":"R$ 55.00"},{"v":38,"d":"R$ 38.00"},{"v":129,"d":"R$ 129.00"},{"$f":"Cálculos!$D$10","v":{"v":0.085,"d":"8.50%"}},{"$f":"Cálculos!$D$18","v":{"v":0.25,"d":"25.00%"}},{"v":193.98,"d":"R$ 193.98"},{"v":6466,"d":"R$ 6,466.00"},{"v":5.388333333333334,"d":"5.39x"},{"v":0.24998298793690069,"d":"25.00%"}]
[null,null,"Plano Enterprise",{"v":3500,"d":"R$ 3,500.00"},{"v":0.02,"d":"2.00%"},{"v":50,"d":"50.00"},{"v":70,"d":"R$ 70.00"},{"v":180,"d":"R$ 180.00"},{"v":120,"d":"R$ 120.00"},{"v":370,"d":"R$ 370.00"},{"$f":"Cálculos!$D$10","v":{"v":0.085,"d":"8.50%"}},{"$f":"Cálculos!$D$18","v":{"v":0.25,"d":"25.00%"}},{"v":556.39,"d":"R$ 556.39"},{"v":27819.5,"d":"R$ 27,819.50"},{"v":7.948428571428572,"d":"7.95x"},{"v":0.24999883175470441,"d":"25.00%"}]
[null,null,"Plano Anual Básico",{"v":150,"d":"R$ 150.00"},{"v":0.04,"d":"4.00%"},{"v":25,"d":"25.00"},{"v":6,"d":"R$ 6.00"},{"v":7,"d":"R$ 7.00"},{"v":6,"d":"R$ 6.00"},{"v":19,"d":"R$ 19.00"},{"$f":"Cálculos!$D$10","v":{"v":0.085,"d":"8.50%"}},{"$f":"Cálculos!$D$18","v":{"v":0.25,"d":"25.00%"}},{"v":28.57,"d":"R$ 28.57"},{"v":714.25,"d":"R$ 714.25"},{"v":4.761666666666667,"d":"4.76x"},{"v":0.2499667483374169,"d":"25.00%"}]
[null,null,"Plano Anual Pro",{"v":380,"d":"R$ 380.00"},{"v":0.025,"d":"2.50%"},{"v":40,"d":"40.00"},{"v":9.5,"d":"R$ 9.50"},{"v":16,"d":"R$ 16.00"},{"v":13,"d":"R$ 13.00"},{"v":38.5,"d":"R$ 38.50"},{"$f":"Cálculos!$D$10","v":{"v":0.085,"d":"8.50%"}},{"$f":"Cálculos!$D$18","v":{"v":0.25,"d":"25.00%"}},{"v":57.89,"d":"R$ 57.89"},{"v":2315.6,"d":"R$ 2,315.60"},{"v":6.093684210526315,"d":"6.09x"},{"v":0.24994558645707377,"d":"24.99%"}]

{"sheet":"Simulador Cenários","index":26,"n_rows":25,"n_cols":7,"rows_kept":25,"hidden":true}
[]
[null,null,"SIMULADOR CENÁRIOS"]
[]
[]
[]
[]
[null,null,"Variável","Atual","Otimista","Pessimista","Personalizado"]
[null,null,"Variação de custo (%)",0,{"v":-0.1,"d":"(10.00%)"},{"v":0.15,"d":"15.00%"},{"v":0.05,"d":"5.00%"}]
[null,null,"Margem/Lucro desejado (%)",{"v":0.25,"d":"25.00%"},{"v":0.32,"d":"32.00%"},{"v":0.18,"d":"18.00%"},{"v":0.28,"d":"28.00%"}]
[null,null,"Carga tributária (%)",{"$f":"Cálculos!$D$10","v":{"v":0.085,"d":"8.50%"}},{"$f":"Cálculos!$D$10*0.9","v":{"v":0.07650000000000001,"d":"7.65%"}},{"$f":"Cálculos!$D$10*1.15","v":{"v":0.09775,"d":"9.78%"}},{"$f":"Cálculos!$D$10","v":{"v":0.085,"d":"8.50%"}}]
[null,null,"Markup aplicado",{"v":2.5,"d":"2.50x"},{"v":2.9,"d":"2.90x"},{"v":2.1,"d":"2.10x"},{"v":2.6,"d":"2.60x"}]
[null,null,"Despesas comerciais (%)",{"$f":"Cálculos!$D$15","v":{"v":0.2949,"d":"29.49%"}},{"$f":"Cálculos!$D$15*0.88","v":{"v":0.259512,"d":"25.95%"}},{"$f":"Cálculos!$D$15*1.2","v":{"v":0.35388,"d":"35.39%"}},{"$f":"Cálculos!$D$15","v":{"v":0.2949,"d":"29.49%"}}]
[null,null,"Volume de vendas (un.)",{"v":1200,"d":"1,200"},{"v":1560,"d":"1,560"},840,{"v":1320,"d":"1,320"}]
[]
[null,null,"RESULTADOS SIMULADOS"]
[null,null,"Custo médio por unidade",{"$f":"Cálculos!$D$48/SUM(Cálculos!$U$25:$U$39)*(1+D$8)","v":{"v":138.50144128635264,"d":"R$ 138.50"}},{"$f":"Cálculos!$D$48/SUM(Cálculos!$U$25:$U$39)*(1+E$8)","v":{"v":124.65129715771738,"d":"R$ 124.65"}},{"$f":"Cálculos!$D$48/SUM(Cálculos!$U$25:$U$39)*(1+F$8)","v":{"v":159.27665747930553,"d":"R$ 159.28"}},{"$f":"Cálculos!$D$48/SUM(Cálculos!$U$25:$U$39)*(1+G$8)","v":{"v":145.4265133506703,"d":"R$ 145.43"}}]
[null,null,"Preço médio simulado",{"$f":"Cálculos!$D$51*(1+D$8)*D$11/Cálculos!$D$17","v":{"v":346.25431103948426,"d":"R$ 346.25"}},{"$f":"Cálculos!$D$51*(1+E$8)*E$11/Cálculos!$D$17","v":{"v":361.48950072522155,"d":"R$ 361.49"}},{"$f":"Cálculos!$D$51*(1+F$8)*F$11/Cálculos!$D$17","v":{"v":334.4816644641418,"d":"R$ 334.48"}},{"$f":"Cálculos!$D$51*(1+G$8)*G$11/Cálculos!$D$17","v":{"v":378.10970765511684,"d":"R$ 378.11"}}]
[null,null,"Receita total simulada",{"$f":"D17*D$13","v":{"v":415505.1732473811,"d":"R$ 415,505.17"}},{"$f":"E17*E$13","v":{"v":563923.6211313456,"d":"R$ 563,923.62"}},{"$f":"F17*F$13","v":{"v":280964.5981498791,"d":"R$ 280,964.60"}},{"$f":"G17*G$13","v":{"v":499104.81410475424,"d":"R$ 499,104.81"}}]
[null,null,"Custo total simulado",{"$f":"D16*D$13","v":{"v":166201.72954362317,"d":"R$ 166,201.73"}},{"$f":"E16*E$13","v":{"v":194456.0235660391,"d":"R$ 194,456.02"}},{"$f":"F16*F$13","v":{"v":133792.39228261664,"d":"R$ 133,792.39"}},{"$f":"G16*G$13","v":{"v":191962.99762288478,"d":"R$ 191,963.00"}}]
[null,null,"Tributos totais",{"$f":"D18*D$10","v":{"v":35317.9397260274,"d":"R$ 35,317.94"}},{"$f":"E18*E$10","v":{"v":43140.15701654795,"d":"R$ 43,140.16"}},{"$f":"F18*F$10","v":{"v":27464.28946915068,"d":"R$ 27,464.29"}},{"$f":"G18*G$10","v":{"v":42423.90919890411,"d":"R$ 42,423.91"}}]
[null,null,"Despesas comerciais totais",{"$f":"D18*D$12","v":{"v":122532.47559065268,"d":"R$ 122,532.48"}},{"$f":"E18*E$12","v":{"v":146344.9467670378,"d":"R$ 146,344.95"}},{"$f":"F18*F$12","v":{"v":99427.7519932792,"d":"R$ 99,427.75"}},{"$f":"G18*G$12","v":{"v":147186.009679492,"d":"R$ 147,186.01"}}]
[null,null,"Custos fixos",{"$f":"Cálculos!$D$13","v":{"v":25230,"d":"R$ 25,230.00"}},{"$f":"Cálculos!$D$13","v":{"v":25230,"d":"R$ 25,230.00"}},{"$f":"Cálculos!$D$13","v":{"v":25230,"d":"R$ 25,230.00"}},{"$f":"Cálculos!$D$13","v":{"v":25230,"d":"R$ 25,230.00"}}]
[null,null,"Lucro líquido total",{"$f":"D18-D19-D20-D21-D22","v":{"v":66223.02838707787,"d":"R$ 66,223.03"}},{"$f":"E18-E19-E20-E21-E22","v":{"v":154752.4937817208,"d":"R$ 154,752.49"}},{"$f":"F18-F19-F20-F21-F22","v":{"v":-4949.835595167446,"d":"(R$ 4,949.84)"}},{"$f":"G18-G19-G20-G21-G22","v":{"v":92301.8976034733,"d":"R$ 92,301.90"}}]
[null,null,"Margem líquida (%)",{"$f":"IFERROR(D23/D18,0)","v":{"v":0.15937955205108933,"d":"15.94%"}},{"$f":"IFERROR(E23/E18,0)","v":{"v":0.2744210172846738,"d":"27.44%"}},{"$f":"IFERROR(F23/F18,0)","v":{"v":-0.017617292811128404,"d":"(1.76%)"}},{"$f":"IFERROR(G23/G18,0)","v":{"v":0.1849348974303834,"d":"18.49%"}}]
[null,null,"Lucro por unidade",{"$f":"IFERROR(D23/D$13,0)","v":{"v":55.18585698923155,"d":"R$ 55.19"}},{"$f":"IFERROR(E23/E$13,0)","v":{"v":99.2003165267441,"d":"R$ 99.20"}},{"$f":"IFERROR(F23/F$13,0)","v":{"v":-5.892661422818388,"d":"(R$ 5.89)"}},{"$f":"IFERROR(G23/G$13,0)","v":{"v":69.9256800026313,"d":"R$ 69.93"}}]

{"sheet":"Comparativo Métodos","index":27,"n_rows":15,"n_cols":16,"rows_kept":15,"hidden":true}
[]
[null,null,"COMPARATIVO MÉTODOS"]
[]
[]
[]
[]
[null,null,"Produto","Custo Total","Markup","Margem","Lucro Desejado","Comércio","Indústria","E-commerce","Delivery","Artesanato","Menor Preço","Maior Preço","Diferença %","Método de Maior Preço"]
[null,null,{"$f":"Produtos!D8","v":"Camiseta Premium"},{"$f":"Cálculos!H25","v":{"v":46.474999999999994,"d":"R$ 46.48"}},{"$f":"'Prec Markup'!G8","v":{"v":116.19,"d":"R$ 116.19"}},{"$f":"'Prec Margem'!G8","v":{"v":162.86,"d":"R$ 162.86"}},{"$f":"'Prec Lucro Desejado'!G8","v":{"v":115.94,"d":"R$ 115.94"}},{"$f":"'Prec Comércio'!K8","v":{"v":64,"d":"R$ 64.00"}},{"$f":"'Prec Indústria'!O8","v":{"v":198.39,"d":"R$ 198.39"}},{"$f":"'Prec E-commerce'!N8","v":{"v":140.14,"d":"R$ 140.14"}},{"$f":"'Prec Delivery'!M8","v":{"v":126.04,"d":"R$ 126.04"}},{"$f":"'Prec Artesanato'!M8","v":{"v":140.15,"d":"R$ 140.15"}},{"$f":"MIN(E8:L8)","v":{"v":64,"d":"R$ 64.00"}},{"$f":"MAX(E8:L8)","v":{"v":198.39,"d":"R$ 198.39"}},{"$f":"IFERROR(N8/M8-1,0)","v":{"v":2.09984375,"d":"209.98%"}},{"$f":"IFERROR(INDEX($E$7:$L$7,MATCH(MAX(E8:L8),E8:L8,0)),\"-\")","v":"Indústria"}]
[null,null,{"$f":"Produtos!D9","v":"Caneca Cerâmica 350ml"},{"$f":"Cálculos!H26","v":{"v":29.755,"d":"R$ 29.76"}},{"$f":"'Prec Markup'!G9","v":{"v":74.39,"d":"R$ 74.39"}},{"$f":"'Prec Margem'!G9","v":{"v":117.68,"d":"R$ 117.68"}},{"$f":"'Prec Lucro Desejado'!G9","v":{"v":82.24,"d":"R$ 82.24"}},{"$f":"'Prec Comércio'!K9","v":{"v":24.25,"d":"R$ 24.25"}},{"$f":"'Prec Indústria'!O9","v":{"v":129.78,"d":"R$ 129.78"}},{"$f":"'Prec E-commerce'!N9","v":{"v":101.27,"d":"R$ 101.27"}},{"$f":"'Prec Delivery'!M9","v":{"v":83.71,"d":"R$ 83.71"}},{"$f":"'Prec Artesanato'!M9","v":{"v":69.92,"d":"R$ 69.92"}},{"v":24.25,"d":"R$ 24.25"},{"v":129.78,"d":"R$ 129.78"},{"v":4.351752577319588,"d":"435.18%"},"Indústria"]
[null,null,{"$f":"Produtos!D10","v":"Kit Presente Gourmet"},{"$f":"Cálculos!H27","v":{"v":69.275,"d":"R$ 69.28"}},{"$f":"'Prec Markup'!G10","v":{"v":173.19,"d":"R$ 173.19"}},{"$f":"'Prec Margem'!G10","v":{"v":224.47,"d":"R$ 224.47"}},{"$f":"'Prec Lucro Desejado'!G10","v":{"v":161.9,"d":"R$ 161.90"}},{"$f":"'Prec Comércio'!K10","v":{"v":120,"d":"R$ 120.00"}},{"$f":"'Prec Indústria'!O10","v":{"v":308.66,"d":"R$ 308.66"}},{"$f":"'Prec E-commerce'!N10","v":{"v":193.15,"d":"R$ 193.15"}},{"$f":"'Prec Delivery'!M10","v":{"v":183.76,"d":"R$ 183.76"}},{"$f":"'Prec Artesanato'!M10","v":{"v":209.92,"d":"R$ 209.92"}},{"v":120,"d":"R$ 120.00"},{"v":308.66,"d":"R$ 308.66"},{"v":1.572166666666667,"d":"157.22%"},"Indústria"]
[null,null,{"$f":"Produtos!D11","v":"Mochila Executiva"},{"$f":"Cálculos!H28","v":{"v":106.57499999999999,"d":"R$ 106.58"}},{"$f":"'Prec Markup'!G11","v":{"v":266.44,"d":"R$ 266.44"}},{"$f":"'Prec Margem'!G11","v":{"v":325.25,"d":"R$ 325.25"}},{"$f":"'Prec Lucro Desejado'!G11","v":{"v":237.08,"d":"R$ 237.08"}},{"$f":"'Prec Comércio'!K11","v":{"v":210,"d":"R$ 210.00"}},{"$f":"'Prec Indústria'!O11","v":{"v":461.55,"d":"R$ 461.55"}},{"$f":"'Prec E-commerce'!N11","v":{"v":279.88,"d":"R$ 279.88"}},{"$f":"'Prec Delivery'!M11","v":{"v":278.19,"d":"R$ 278.19"}},{"$f":"'Prec Artesanato'!M11","v":{"v":364.51,"d":"R$ 364.51"}},{"v":210,"d":"R$ 210.00"},{"v":461.55,"d":"R$ 461.55"},{"v":1.197857142857143,"d":"119.79%"},"Indústria"]
[null,null,{"$f":"Produtos!D12","v":"Fone Bluetooth TWS"},{"$f":"Cálculos!H29","v":{"v":93.555,"d":"R$ 93.56"}},{"$f":"'Prec Markup'!G12","v":{"v":233.89,"d":"R$ 233.89"}},{"$f":"'Prec Margem'!G12","v":{"v":290.07,"d":"R$ 290.07"}},{"$f":"'Prec Lucro Desejado'!G12","v":{"v":210.85,"d":"R$ 210.85"}},{"$f":"'Prec Comércio'!K12","v":{"v":178.83,"d":"R$ 178.83"}},{"$f":"'Prec Indústria'!O12","v":{"v":322.47,"d":"R$ 322.47"}},{"$f":"'Prec E-commerce'!N12","v":{"v":249.6,"d":"R$ 249.60"}},{"$f":"'Prec Delivery'!M12","v":{"v":245.23,"d":"R$ 245.23"}},{"$f":"'Prec Artesanato'!M12","v":{"v":178.65,"d":"R$ 178.65"}},{"v":178.65,"d":"R$ 178.65"},{"v":322.47,"d":"R$ 322.47"},{"v":0.8050377833753151,"d":"80.50%"},"Indústria"]
[null,null,{"$f":"Produtos!D13","v":"Garrafa Térmica 1L"},{"$f":"Cálculos!H30","v":{"v":56.725,"d":"R$ 56.73"}},{"$f":"'Prec Markup'!G13","v":{"v":141.81,"d":"R$ 141.81"}},{"$f":"'Prec Margem'!G13","v":{"v":190.56,"d":"R$ 190.56"}},{"$f":"'Prec Lucro Desejado'!G13","v":{"v":136.6,"d":"R$ 136.60"}},{"$f":"'Prec Comércio'!K13","v":{"v":90.83,"d":"R$ 90.83"}},{"$f":"'Prec Indústria'!O13","v":{"v":214.68,"d":"R$ 214.68"}},{"$f":"'Prec E-commerce'!N13","v":{"v":163.97,"d":"R$ 163.97"}},{"$f":"'Prec Delivery'!M13","v":{"v":151.99,"d":"R$ 151.99"}},{"$f":"'Prec Artesanato'!M13","v":{"v":122.41,"d":"R$ 122.41"}},{"v":90.83,"d":"R$ 90.83"},{"v":214.68,"d":"R$ 214.68"},{"v":1.363536276560608,"d":"136.35%"},"Indústria"]
[null,null,{"$f":"Produtos!D14","v":"Agenda Executiva 2026"},{"$f":"Cálculos!H31","v":{"v":38.537499999999994,"d":"R$ 38.54"}},{"$f":"'Prec Markup'!G14","v":{"v":96.34,"d":"R$ 96.34"}},{"$f":"'Prec Margem'!G14","v":{"v":141.41,"d":"R$ 141.41"}},{"$f":"'Prec Lucro Desejado'!G14","v":{"v":99.93,"d":"R$ 99.93"}},{"$f":"'Prec Comércio'!K14","v":{"v":46.25,"d":"R$ 46.25"}},{"$f":"'Prec Indústria'!O14","v":{"v":145.69,"d":"R$ 145.69"}},{"$f":"'Prec E-commerce'!N14","v":{"v":121.69,"d":"R$ 121.69"}},{"$f":"'Prec Delivery'!M14","v":{"v":105.94,"d":"R$ 105.94"}},{"$f":"'Prec Artesanato'!M14","v":{"v":68.87,"d":"R$ 68.87"}},{"v":46.25,"d":"R$ 46.25"},{"v":145.69,"d":"R$ 145.69"},{"v":2.150054054054054,"d":"215.01%"},"Indústria"]
[null,null,{"$f":"Produtos!D15","v":"Boné Trucker"},{"$f":"Cálculos!H32","v":{"v":35.489285714285714,"d":"R$ 35.49"}},{"$f":"'Prec Markup'!G15","v":{"v":88.72,"d":"R$ 88.72"}},{"$f":"'Prec Margem'!G15","v":{"v":133.18,"d":"R$ 133.18"}},{"$f":"'Prec Lucro Desejado'!G15","v":{"v":93.79,"d":"R$ 93.79"}},{"$f":"'Prec Comércio'!K15","v":{"v":38.39,"d":"R$ 38.39"}},{"$f":"'Prec Indústria'!O15","v":{"v":152.37,"d":"R$ 152.37"}},{"$f":"'Prec E-commerce'!N15","v":{"v":114.6,"d":"R$ 114.60"}},{"$f":"'Prec Delivery'!M15","v":{"v":98.23,"d":"R$ 98.23"}},{"$f":"'Prec Artesanato'!M15","v":{"v":84.66,"d":"R$ 84.66"}},{"v":38.39,"d":"R$ 38.39"},{"v":152.37,"d":"R$ 152.37"},{"v":2.9690023443605105,"d":"296.90%"},"Indústria"]

{"sheet":"Ponto de Equilíbrio","index":28,"n_rows":38,"n_cols":9,"rows_kept":38,"hidden":true}
[]
[null,null,"PONTO DE EQUILÍBRIO"]
[]
[]
[]
[]
[null,null,"PAINEL CONSOLIDADO"]
[null,null,"Custos fixos totais (mês)",{"$f":"Cálculos!$D$13","v":{"v":25230,"d":"R$ 25,230.00"}}]
[null,null,"Preço médio de venda (produtos)",{"$f":"IFERROR(AVERAGE(Cálculos!$I$25:$I$32),0)","v":{"v":148.87125,"d":"R$ 148.87"}}]
[null,null,"Custo variável médio por unidade (produtos)",{"$f":"$D$9-$D$11","v":{"v":110.12953608928572,"d":"R$ 110.13"}}]
[null,null,"Margem de contribuição unitária (produtos)",{"$f":"IFERROR(AVERAGE(Cálculos!$R$25:$R$32),0)","v":{"v":38.74171391071429,"d":"R$ 38.74"}}]
[null,null,"Margem de contribuição (%)",{"$f":"IFERROR($D$11/$D$9,0)","v":{"v":0.26023637143312955,"d":"26.02%"}}]
[null,null,"Quantidade no ponto de equilíbrio (un.)",{"$f":"IFERROR($D$8/$D$11,0)","v":{"v":651.2360309651265,"d":"651"}}]
[null,null,"Faturamento no ponto de equilíbrio",{"$f":"IFERROR($D$8/$D$12,0)","v":{"v":96950.32197481708,"d":"R$ 96,950.32"}}]
[null,null,"Receita atual estimada",{"$f":"Cálculos!$D$47","v":{"v":429701.6,"d":"R$ 429,701.60"}}]
[null,null,"Margem de segurança (R$)",{"$f":"$D$15-$D$14","v":{"v":332751.2780251829,"d":"R$ 332,751.28"}}]
[null,null,"Margem de segurança (%)",{"$f":"IFERROR($D$16/$D$15,0)","v":{"v":0.7743775634653977,"d":"77.44%"}}]
[null,null,"Grau de alavancagem operacional",{"$f":"IFERROR(Cálculos!$D$61/Cálculos!$D$50,0)","v":{"v":1.4511203157106434,"d":"1.45"}}]
[]
[]
[null,null,"PONTO DE EQUILÍBRIO POR ITEM"]
[]
[null,null,"Item","Preço","Custo Variável Un.","MC Unitária","MC %","Qtd. p/ Equilíbrio","Faturamento p/ Equilíbrio"]
[null,null,{"$f":"Cálculos!C25","v":"Camiseta Premium"},{"$f":"Cálculos!I25","v":{"v":116.19,"d":"R$ 116.19"}},{"$f":"Cálculos!I25-Cálculos!R25","v":{"v":84.640581,"d":"R$ 84.64"}},{"$f":"Cálculos!R25","v":{"v":31.549419,"d":"R$ 31.55"}},{"$f":"Cálculos!S25","v":{"v":0.27153299767621997,"d":"27.15%"}},{"$f":"IFERROR($D$8/COUNTA(Cálculos!$C$25:$C$39)/F24,0)","v":{"v":53.31318462631594,"d":"53"}},{"$f":"H24*D24","v":{"v":6194.458921731649,"d":"R$ 6,194.46"}}]
[null,null,{"$f":"Cálculos!C26","v":"Caneca Cerâmica 350ml"},{"$f":"Cálculos!I26","v":{"v":74.39,"d":"R$ 74.39"}},{"$f":"Cálculos!I26-Cálculos!R26","v":{"v":52.040761,"d":"R$ 52.04"}},{"$f":"Cálculos!R26","v":{"v":22.349238999999997,"d":"R$ 22.35"}},{"$f":"Cálculos!S26","v":{"v":0.3004333781422234,"d":"30.04%"}},{"$f":"IFERROR($D$8/COUNTA(Cálculos!$C$25:$C$39)/F25,0)","v":{"v":75.25983323190557,"d":"75"}},{"v":5598.578994121456,"d":"R$ 5,598.58"}]
[null,null,{"$f":"Cálculos!C27","v":"Kit Presente Gourmet"},{"$f":"Cálculos!I27","v":{"v":173.19,"d":"R$ 173.19"}},{"$f":"Cálculos!I27-Cálculos!R27","v":{"v":129.094881,"d":"R$ 129.09"}},{"$f":"Cálculos!R27","v":{"v":44.09511900000001,"d":"R$ 44.10"}},{"$f":"Cálculos!S27","v":{"v":0.2546054564351291,"d":"25.46%"}},{"$f":"IFERROR($D$8/COUNTA(Cálculos!$C$25:$C$39)/F26,0)","v":{"v":38.144811447271515,"d":"38"}},{"v":6606.299894552953,"d":"R$ 6,606.30"}]
[null,null,{"$f":"Cálculos!C28","v":"Mochila Executiva"},{"$f":"Cálculos!I28","v":{"v":266.44,"d":"R$ 266.44"}},{"$f":"Cálculos!I28-Cálculos!R28","v":{"v":201.820556,"d":"R$ 201.82"}},{"$f":"Cálculos!R28","v":{"v":64.61944399999999,"d":"R$ 64.62"}},{"$f":"Cálculos!S28","v":{"v":0.24252906470499921,"d":"24.25%"}},{"$f":"IFERROR($D$8/COUNTA(Cálculos!$C$25:$C$39)/F27,0)","v":{"v":26.029317120091598,"d":"26"}},{"v":6935.251253477205,"d":"R$ 6,935.25"}]
[null,null,{"$f":"Cálculos!C29","v":"Fone Bluetooth TWS"},{"$f":"Cálculos!I29","v":{"v":233.89,"d":"R$ 233.89"}},{"$f":"Cálculos!I29-Cálculos!R29","v":{"v":176.434811,"d":"R$ 176.43"}},{"$f":"Cálculos!R29","v":{"v":57.45518899999999,"d":"R$ 57.46"}},{"$f":"Cálculos!S29","v":{"v":0.2456504724443114,"d":"24.57%"}},{"$f":"IFERROR($D$8/COUNTA(Cálculos!$C$25:$C$39)/F28,0)","v":{"v":29.274988548031757,"d":"29"}},{"v":6847.127071499147,"d":"R$ 6,847.13"}]
[null,null,{"$f":"Cálculos!C30","v":"Garrafa Térmica 1L"},{"$f":"Cálculos!I30","v":{"v":141.81,"d":"R$ 141.81"}},{"$f":"Cálculos!I30-Cálculos!R30","v":{"v":104.623619,"d":"R$ 104.62"}},{"$f":"Cálculos!R30","v":{"v":37.186381,"d":"R$ 37.19"}},{"$f":"Cálculos!S30","v":{"v":0.26222678936605315,"d":"26.22%"}},{"$f":"IFERROR($D$8/COUNTA(Cálculos!$C$25:$C$39)/F29,0)","v":{"v":45.23161315428894,"d":"45"}},{"v":6414.295061409714,"d":"R$ 6,414.30"}]
[null,null,{"$f":"Cálculos!C31","v":"Agenda Executiva 2026"},{"$f":"Cálculos!I31","v":{"v":96.34,"d":"R$ 96.34"}},{"$f":"Cálculos!I31-Cálculos!R31","v":{"v":69.16206600000001,"d":"R$ 69.16"}},{"$f":"Cálculos!R31","v":{"v":27.177933999999993,"d":"R$ 27.18"}},{"$f":"Cálculos!S31","v":{"v":0.282104359559892,"d":"28.21%"}},{"$f":"IFERROR($D$8/COUNTA(Cálculos!$C$25:$C$39)/F30,0)","v":{"v":61.8884422929278,"d":"62"}},{"v":5962.332530500665,"d":"R$ 5,962.33"}]
[null,null,{"$f":"Cálculos!C32","v":"Boné Trucker"},{"$f":"Cálculos!I32","v":{"v":88.72,"d":"R$ 88.72"}},{"$f":"Cálculos!I32-Cálculos!R32","v":{"v":63.21901371428571,"d":"R$ 63.22"}},{"$f":"Cálculos!R32","v":{"v":25.50098628571429,"d":"R$ 25.50"}},{"$f":"Cálculos!S32","v":{"v":0.287432216926446,"d":"28.74%"}},{"$f":"IFERROR($D$8/COUNTA(Cálculos!$C$25:$C$39)/F31,0)","v":{"v":65.95823318968098,"d":"66"}},{"v":5851.814448588497,"d":"R$ 5,851.81"}]
[null,null,{"$f":"Cálculos!C33","v":"Consultoria Empresarial"},{"$f":"Cálculos!I33","v":{"v":5731.53,"d":"R$ 5,731.53"}},{"$f":"Cálculos!I33-Cálculos!R33","v":{"v":4291.208247,"d":"R$ 4,291.21"}},{"$f":"Cálculos!R33","v":{"v":1440.321753,"d":"R$ 1,440.32"}},{"$f":"Cálculos!S33","v":{"v":0.25129795237920766,"d":"25.13%"}},{"$f":"IFERROR($D$8/COUNTA(Cálculos!$C$25:$C$39)/F32,0)","v":{"v":1.1677946240113477,"d":"1"}},{"v":6693.249921359759,"d":"R$ 6,693.25"}]
[null,null,{"$f":"Cálculos!C34","v":"Criação de Identidade Visual"},{"$f":"Cálculos!I34","v":{"v":13785.37,"d":"R$ 13,785.37"}},{"$f":"Cálculos!I34-Cálculos!R34","v":{"v":10090.862063,"d":"R$ 10,090.86"}},{"$f":"Cálculos!R34","v":{"v":3694.5079370000008,"d":"R$ 3,694.51"}},{"$f":"Cálculos!S34","v":{"v":0.2680020875029107,"d":"26.80%"}},{"$f":"IFERROR($D$8/COUNTA(Cálculos!$C$25:$C$39)/F33,0)","v":{"v":0.45527037123266023,"d":"0"}},{"v":6276.070517479578,"d":"R$ 6,276.07"}]
[null,null,{"$f":"Cálculos!C35","v":"Manutenção Predial"},{"$f":"Cálculos!I35","v":{"v":2017.61,"d":"R$ 2,017.61"}},{"$f":"Cálculos!I35-Cálculos!R35","v":{"v":1510.290039,"d":"R$ 1,510.29"}},{"$f":"Cálculos!R35","v":{"v":507.31996100000003,"d":"R$ 507.32"}},{"$f":"Cálculos!S35","v":{"v":0.2514459984833541,"d":"25.14%"}},{"$f":"IFERROR($D$8/COUNTA(Cálculos!$C$25:$C$39)/F34,0)","v":{"v":3.315461896442115,"d":"3"}},{"v":6689.309076880576,"d":"R$ 6,689.31"}]
[null,null,{"$f":"Cálculos!C36","v":"Desenvolvimento de Sistema"},{"$f":"Cálculos!I36","v":{"v":74079.55,"d":"R$ 74,079.55"}},{"$f":"Cálculos!I36-Cálculos!R36","v":{"v":54706.62104499999,"d":"R$ 54,706.62"}},{"$f":"Cálculos!R36","v":{"v":19372.928955000007,"d":"R$ 19,372.93"}},{"$f":"Cálculos!S36","v":{"v":0.2615152083807205,"d":"26.15%"}},{"$f":"IFERROR($D$8/COUNTA(Cálculos!$C$25:$C$39)/F35,0)","v":{"v":0.0868221838786999,"d":"0"}},{"v":6431.748311751344,"d":"R$ 6,431.75"}]
[null,null,{"$f":"Cálculos!C37","v":"Assessoria Contábil Mensal"},{"$f":"Cálculos!I37","v":{"v":4852.84,"d":"R$ 4,852.84"}},{"$f":"Cálculos!I37-Cálculos!R37","v":{"v":3567.393916,"d":"R$ 3,567.39"}},{"$f":"Cálculos!R37","v":{"v":1285.4460840000004,"d":"R$ 1,285.45"}},{"$f":"Cálculos!S37","v":{"v":0.2648853215848864,"d":"26.49%"}},{"$f":"IFERROR($D$8/COUNTA(Cálculos!$C$25:$C$39)/F36,0)","v":{"v":1.3084951760606083,"d":"1"}},{"v":6349.917730193963,"d":"R$ 6,349.92"}]
[null,null,{"$f":"Cálculos!C38","v":"Projeto Arquitetônico"},{"$f":"Cálculos!I38","v":{"v":40027.27,"d":"R$ 40,027.27"}},{"$f":"Cálculos!I38-Cálculos!R38","v":{"v":29690.159872999997,"d":"R$ 29,690.16"}},{"$f":"Cálculos!R38","v":{"v":10337.110126999998,"d":"R$ 10,337.11"}},{"$f":"Cálculos!S38","v":{"v":0.2582516900852843,"d":"25.83%"}},{"$f":"IFERROR($D$8/COUNTA(Cálculos!$C$25:$C$39)/F37,0)","v":{"v":0.16271472194213185,"d":"0"}},{"v":6513.026108152635,"d":"R$ 6,513.03"}]
[null,null,{"$f":"Cálculos!C39","v":"Treinamento Corporativo"},{"$f":"Cálculos!I39","v":{"v":6460.23,"d":"R$ 6,460.23"}},{"$f":"Cálculos!I39-Cálculos!R39","v":{"v":4898.041377,"d":"R$ 4,898.04"}},{"$f":"Cálculos!R39","v":{"v":1562.1886229999998,"d":"R$ 1,562.19"}},{"$f":"Cálculos!S39","v":{"v":0.24181625468443071,"d":"24.18%"}},{"$f":"IFERROR($D$8/COUNTA(Cálculos!$C$25:$C$39)/F38,0)","v":{"v":1.0766945650710966,"d":"1"}},{"v":6955.69453010925,"d":"R$ 6,955.69"}]

{"sheet":"Margem Contribuição","index":29,"n_rows":22,"n_cols":11,"rows_kept":22,"hidden":true}
[]
[null,null,"MARGEM CONTRIBUIÇÃO"]
[]
[]
[]
[]
[null,null,"Item","Tipo","Preço de Venda","Custo Variável Unitário","Tributos Unitários","Despesas Comerciais Un.","Margem de Contribuição","MC %","Classificação"]
[null,null,{"$f":"Cálculos!C25","v":"Camiseta Premium"},{"$f":"Cálculos!D25","v":"Produto"},{"$f":"Cálculos!I25","v":{"v":116.19,"d":"R$ 116.19"}},{"$f":"Cálculos!F25","v":{"v":26.7,"d":"R$ 26.70"}},{"$f":"Cálculos!K25","v":{"v":9.87615,"d":"R$ 9.88"}},{"$f":"Cálculos!L25","v":{"v":48.064431,"d":"R$ 48.06"}},{"$f":"E8-F8-G8-H8","v":{"v":31.549419,"d":"R$ 31.55"}},{"$f":"IFERROR(I8/E8,0)","v":{"v":0.27153299767621997,"d":"27.15%"}},{"$f":"IF(J8>=0.35,\"Excelente\",IF(J8>=0.25,\"Boa\",IF(J8>=0.15,\"Aceitável\",\"Crítica\")))","v":"Boa"}]
[null,null,{"$f":"Cálculos!C26","v":"Caneca Cerâmica 350ml"},{"$f":"Cálculos!D26","v":"Produto"},{"$f":"Cálculos!I26","v":{"v":74.39,"d":"R$ 74.39"}},{"$f":"Cálculos!F26","v":{"v":9.98,"d":"R$ 9.98"}},{"$f":"Cálculos!K26","v":{"v":6.323150000000001,"d":"R$ 6.32"}},{"$f":"Cálculos!L26","v":{"v":35.737611,"d":"R$ 35.74"}},{"v":22.349238999999997,"d":"R$ 22.35"},{"v":0.3004333781422234,"d":"30.04%"},"Boa"]
[null,null,{"$f":"Cálculos!C27","v":"Kit Presente Gourmet"},{"$f":"Cálculos!D27","v":"Produto"},{"$f":"Cálculos!I27","v":{"v":173.19,"d":"R$ 173.19"}},{"$f":"Cálculos!F27","v":{"v":49.5,"d":"R$ 49.50"}},{"$f":"Cálculos!K27","v":{"v":14.721150000000002,"d":"R$ 14.72"}},{"$f":"Cálculos!L27","v":{"v":64.87373099999999,"d":"R$ 64.87"}},{"v":44.09511900000001,"d":"R$ 44.10"},{"v":0.2546054564351291,"d":"25.46%"},"Boa"]
[null,null,{"$f":"Cálculos!C28","v":"Mochila Executiva"},{"$f":"Cálculos!D28","v":"Produto"},{"$f":"Cálculos!I28","v":{"v":266.44,"d":"R$ 266.44"}},{"$f":"Cálculos!F28","v":{"v":86.8,"d":"R$ 86.80"}},{"$f":"Cálculos!K28","v":{"v":22.6474,"d":"R$ 22.65"}},{"$f":"Cálculos!L28","v":{"v":92.373156,"d":"R$ 92.37"}},{"v":64.61944399999999,"d":"R$ 64.62"},{"v":0.24252906470499921,"d":"24.25%"},"Aceitável"]
[null,null,{"$f":"Cálculos!C29","v":"Fone Bluetooth TWS"},{"$f":"Cálculos!D29","v":"Produto"},{"$f":"Cálculos!I29","v":{"v":233.89,"d":"R$ 233.89"}},{"$f":"Cálculos!F29","v":{"v":73.78,"d":"R$ 73.78"}},{"$f":"Cálculos!K29","v":{"v":19.88065,"d":"R$ 19.88"}},{"$f":"Cálculos!L29","v":{"v":82.77416099999999,"d":"R$ 82.77"}},{"v":57.45518899999999,"d":"R$ 57.46"},{"v":0.2456504724443114,"d":"24.57%"},"Aceitável"]
[null,null,{"$f":"Cálculos!C30","v":"Garrafa Térmica 1L"},{"$f":"Cálculos!D30","v":"Produto"},{"$f":"Cálculos!I30","v":{"v":141.81,"d":"R$ 141.81"}},{"$f":"Cálculos!F30","v":{"v":36.95,"d":"R$ 36.95"}},{"$f":"Cálculos!K30","v":{"v":12.05385,"d":"R$ 12.05"}},{"$f":"Cálculos!L30","v":{"v":55.619769000000005,"d":"R$ 55.62"}},{"v":37.186381,"d":"R$ 37.19"},{"v":0.26222678936605315,"d":"26.22%"},"Boa"]
[null,null,{"$f":"Cálculos!C31","v":"Agenda Executiva 2026"},{"$f":"Cálculos!D31","v":"Produto"},{"$f":"Cálculos!I31","v":{"v":96.34,"d":"R$ 96.34"}},{"$f":"Cálculos!F31","v":{"v":18.7625,"d":"R$ 18.76"}},{"$f":"Cálculos!K31","v":{"v":8.1889,"d":"R$ 8.19"}},{"$f":"Cálculos!L31","v":{"v":42.210666,"d":"R$ 42.21"}},{"v":27.177933999999993,"d":"R$ 27.18"},{"v":0.282104359559892,"d":"28.21%"},"Boa"]
[null,null,{"$f":"Cálculos!C32","v":"Boné Trucker"},{"$f":"Cálculos!D32","v":"Produto"},{"$f":"Cálculos!I32","v":{"v":88.72,"d":"R$ 88.72"}},{"$f":"Cálculos!F32","v":{"v":15.714285714285714,"d":"R$ 15.71"}},{"$f":"Cálculos!K32","v":{"v":7.541200000000001,"d":"R$ 7.54"}},{"$f":"Cálculos!L32","v":{"v":39.963528,"d":"R$ 39.96"}},{"v":25.50098628571429,"d":"R$ 25.50"},{"v":0.287432216926446,"d":"28.74%"},"Boa"]
[null,null,{"$f":"Cálculos!C33","v":"Consultoria Empresarial"},{"$f":"Cálculos!D33","v":"Serviço"},{"$f":"Cálculos!I33","v":{"v":5731.53,"d":"R$ 5,731.53"}},{"$f":"Cálculos!F33","v":{"v":2100,"d":"R$ 2,100.00"}},{"$f":"Cálculos!K33","v":{"v":487.18005,"d":"R$ 487.18"}},{"$f":"Cálculos!L33","v":{"v":1704.0281969999999,"d":"R$ 1,704.03"}},{"v":1440.321753,"d":"R$ 1,440.32"},{"v":0.25129795237920766,"d":"25.13%"},"Boa"]
[null,null,{"$f":"Cálculos!C34","v":"Criação de Identidade Visual"},{"$f":"Cálculos!D34","v":"Serviço"},{"$f":"Cálculos!I34","v":{"v":13785.37,"d":"R$ 13,785.37"}},{"$f":"Cálculos!F34","v":{"v":4840,"d":"R$ 4,840.00"}},{"$f":"Cálculos!K34","v":{"v":1171.75645,"d":"R$ 1,171.76"}},{"$f":"Cálculos!L34","v":{"v":4079.105613,"d":"R$ 4,079.11"}},{"v":3694.5079370000008,"d":"R$ 3,694.51"},{"v":0.2680020875029107,"d":"26.80%"},"Boa"]
[null,null,{"$f":"Cálculos!C35","v":"Manutenção Predial"},{"$f":"Cálculos!D35","v":"Serviço"},{"$f":"Cálculos!I35","v":{"v":2017.61,"d":"R$ 2,017.61"}},{"$f":"Cálculos!F35","v":{"v":730,"d":"R$ 730.00"}},{"$f":"Cálculos!K35","v":{"v":171.49685,"d":"R$ 171.50"}},{"$f":"Cálculos!L35","v":{"v":608.7931889999999,"d":"R$ 608.79"}},{"v":507.31996100000003,"d":"R$ 507.32"},{"v":0.2514459984833541,"d":"25.14%"},"Boa"]
[null,null,{"$f":"Cálculos!C36","v":"Desenvolvimento de Sistema"},{"$f":"Cálculos!D36","v":"Serviço"},{"$f":"Cálculos!I36","v":{"v":74079.55,"d":"R$ 74,079.55"}},{"$f":"Cálculos!F36","v":{"v":26550,"d":"R$ 26,550.00"}},{"$f":"Cálculos!K36","v":{"v":6296.761750000001,"d":"R$ 6,296.76"}},{"$f":"Cálculos!L36","v":{"v":21859.859295,"d":"R$ 21,859.86"}},{"v":19372.928955000007,"d":"R$ 19,372.93"},{"v":0.2615152083807205,"d":"26.15%"},"Boa"]
[null,null,{"$f":"Cálculos!C37","v":"Assessoria Contábil Mensal"},{"$f":"Cálculos!D37","v":"Serviço"},{"$f":"Cálculos!I37","v":{"v":4852.84,"d":"R$ 4,852.84"}},{"$f":"Cálculos!F37","v":{"v":1710,"d":"R$ 1,710.00"}},{"$f":"Cálculos!K37","v":{"v":412.49140000000006,"d":"R$ 412.49"}},{"$f":"Cálculos!L37","v":{"v":1444.9025159999999,"d":"R$ 1,444.90"}},{"v":1285.4460840000004,"d":"R$ 1,285.45"},{"v":0.2648853215848864,"d":"26.49%"},"Boa"]
[null,null,{"$f":"Cálculos!C38","v":"Projeto Arquitetônico"},{"$f":"Cálculos!D38","v":"Serviço"},{"$f":"Cálculos!I38","v":{"v":40027.27,"d":"R$ 40,027.27"}},{"$f":"Cálculos!F38","v":{"v":14470,"d":"R$ 14,470.00"}},{"$f":"Cálculos!K38","v":{"v":3402.31795,"d":"R$ 3,402.32"}},{"$f":"Cálculos!L38","v":{"v":11817.841922999998,"d":"R$ 11,817.84"}},{"v":10337.110126999998,"d":"R$ 10,337.11"},{"v":0.2582516900852843,"d":"25.83%"},"Boa"]
[null,null,{"$f":"Cálculos!C39","v":"Treinamento Corporativo"},{"$f":"Cálculos!D39","v":"Serviço"},{"$f":"Cálculos!I39","v":{"v":6460.23,"d":"R$ 6,460.23"}},{"$f":"Cálculos!F39","v":{"v":2430,"d":"R$ 2,430.00"}},{"$f":"Cálculos!K39","v":{"v":549.11955,"d":"R$ 549.12"}},{"$f":"Cálculos!L39","v":{"v":1918.921827,"d":"R$ 1,918.92"}},{"v":1562.1886229999998,"d":"R$ 1,562.19"},{"v":0.24181625468443071,"d":"24.18%"},"Aceitável"]

{"sheet":"Lucratividade","index":30,"n_rows":22,"n_cols":12,"rows_kept":22,"hidden":true}
[]
[null,null,"LUCRATIVIDADE"]
[]
[]
[]
[]
[null,null,"Item","Volume Mensal","Receita","Custo Total","Lucro Bruto","Lucro Líquido","Margem Bruta %","Margem Líquida %","Rentabilidade %","Lucro Total Mensal"]
[null,null,{"$f":"Cálculos!C25","v":"Camiseta Premium"},{"$f":"Cálculos!U25","v":220},{"$f":"Cálculos!J25","v":{"v":25561.8,"d":"R$ 25,561.80"}},{"$f":"Cálculos!H25","v":{"v":46.474999999999994,"d":"R$ 46.48"}},{"$f":"Cálculos!M25","v":{"v":89.49,"d":"R$ 89.49"}},{"$f":"Cálculos!N25","v":{"v":11.774419000000002,"d":"R$ 11.77"}},{"$f":"Cálculos!O25","v":{"v":0.7702039762458043,"d":"77.02%"}},{"$f":"Cálculos!P25","v":{"v":0.10133762802306569,"d":"10.13%"}},{"$f":"IFERROR(H8/F8,0)","v":{"v":0.2533495212479829,"d":"25.33%"}},{"$f":"H8*D8","v":{"v":2590.3721800000003,"d":"R$ 2,590.37"}}]
[null,null,{"$f":"Cálculos!C26","v":"Caneca Cerâmica 350ml"},{"$f":"Cálculos!U26","v":380},{"$f":"Cálculos!J26","v":{"v":28268.2,"d":"R$ 28,268.20"}},{"$f":"Cálculos!H26","v":{"v":29.755,"d":"R$ 29.76"}},{"$f":"Cálculos!M26","v":{"v":64.41,"d":"R$ 64.41"}},{"$f":"Cálculos!N26","v":{"v":2.5742390000000057,"d":"R$ 2.57"}},{"$f":"Cálculos!O26","v":{"v":0.8658421830891249,"d":"86.58%"}},{"$f":"Cálculos!P26","v":{"v":0.034604637720123746,"d":"3.46%"}},{"v":0.08651450176440954,"d":"8.65%"},{"v":978.2108200000022,"d":"R$ 978.21"}]
[null,null,{"$f":"Cálculos!C27","v":"Kit Presente Gourmet"},{"$f":"Cálculos!U27","v":60},{"$f":"Cálculos!J27","v":{"v":10391.4,"d":"R$ 10,391.40"}},{"$f":"Cálculos!H27","v":{"v":69.275,"d":"R$ 69.28"}},{"$f":"Cálculos!M27","v":{"v":123.69,"d":"R$ 123.69"}},{"$f":"Cálculos!N27","v":{"v":24.320119000000005,"d":"R$ 24.32"}},{"$f":"Cálculos!O27","v":{"v":0.7141867313355275,"d":"71.42%"}},{"$f":"Cálculos!P27","v":{"v":0.1404244991050292,"d":"14.04%"}},{"v":0.3510663154095995,"d":"35.11%"},{"v":1459.2071400000004,"d":"R$ 1,459.21"}]
[null,null,{"$f":"Cálculos!C28","v":"Mochila Executiva"},{"$f":"Cálculos!U28","v":45},{"$f":"Cálculos!J28","v":{"v":11989.8,"d":"R$ 11,989.80"}},{"$f":"Cálculos!H28","v":{"v":106.57499999999999,"d":"R$ 106.58"}},{"$f":"Cálculos!M28","v":{"v":179.64,"d":"R$ 179.64"}},{"$f":"Cálculos!N28","v":{"v":44.84444400000001,"d":"R$ 44.84"}},{"$f":"Cálculos!O28","v":{"v":0.6742230896261822,"d":"67.42%"}},{"$f":"Cálculos!P28","v":{"v":0.1683097282690287,"d":"16.83%"}},{"v":0.42077826882477143,"d":"42.08%"},{"v":2017.9999800000005,"d":"R$ 2,018.00"}]
[null,null,{"$f":"Cálculos!C29","v":"Fone Bluetooth TWS"},{"$f":"Cálculos!U29","v":130},{"$f":"Cálculos!J29","v":{"v":30405.699999999997,"d":"R$ 30,405.70"}},{"$f":"Cálculos!H29","v":{"v":93.555,"d":"R$ 93.56"}},{"$f":"Cálculos!M29","v":{"v":160.10999999999999,"d":"R$ 160.11"}},{"$f":"Cálculos!N29","v":{"v":37.680188999999984,"d":"R$ 37.68"}},{"$f":"Cálculos!O29","v":{"v":0.6845525674462354,"d":"68.46%"}},{"$f":"Cálculos!P29","v":{"v":0.16110218051220654,"d":"16.11%"}},{"v":0.4027597562930894,"d":"40.28%"},{"v":4898.424569999998,"d":"R$ 4,898.42"}]
[null,null,{"$f":"Cálculos!C30","v":"Garrafa Térmica 1L"},{"$f":"Cálculos!U30","v":150},{"$f":"Cálculos!J30","v":{"v":21271.5,"d":"R$ 21,271.50"}},{"$f":"Cálculos!H30","v":{"v":56.725,"d":"R$ 56.73"}},{"$f":"Cálculos!M30","v":{"v":104.86,"d":"R$ 104.86"}},{"$f":"Cálculos!N30","v":{"v":17.411381000000006,"d":"R$ 17.41"}},{"$f":"Cálculos!O30","v":{"v":0.7394400959029688,"d":"73.94%"}},{"$f":"Cálculos!P30","v":{"v":0.12277964177420496,"d":"12.28%"}},{"v":0.3069436932569415,"d":"30.69%"},{"v":2611.707150000001,"d":"R$ 2,611.71"}]
[null,null,{"$f":"Cálculos!C31","v":"Agenda Executiva 2026"},{"$f":"Cálculos!U31","v":110},{"$f":"Cálculos!J31","v":{"v":10597.4,"d":"R$ 10,597.40"}},{"$f":"Cálculos!H31","v":{"v":38.537499999999994,"d":"R$ 38.54"}},{"$f":"Cálculos!M31","v":{"v":77.5775,"d":"R$ 77.58"}},{"$f":"Cálculos!N31","v":{"v":7.402934000000002,"d":"R$ 7.40"}},{"$f":"Cálculos!O31","v":{"v":0.8052470417272161,"d":"80.52%"}},{"$f":"Cálculos!P31","v":{"v":0.07684174797591864,"d":"7.68%"}},{"v":0.1920968926370419,"d":"19.21%"},{"v":814.3227400000002,"d":"R$ 814.32"}]
[null,null,{"$f":"Cálculos!C32","v":"Boné Trucker"},{"$f":"Cálculos!U32","v":105},{"$f":"Cálculos!J32","v":{"v":9315.6,"d":"R$ 9,315.60"}},{"$f":"Cálculos!H32","v":{"v":35.489285714285714,"d":"R$ 35.49"}},{"$f":"Cálculos!M32","v":{"v":73.00571428571429,"d":"R$ 73.01"}},{"$f":"Cálculos!N32","v":{"v":5.725986285714285,"d":"R$ 5.73"}},{"$f":"Cálculos!O32","v":{"v":0.8228777534458329,"d":"82.29%"}},{"$f":"Cálculos!P32","v":{"v":0.06453997166044054,"d":"6.45%"}},{"v":0.16134408372748313,"d":"16.13%"},{"v":601.2285599999999,"d":"R$ 601.23"}]
[null,null,{"$f":"Cálculos!C33","v":"Consultoria Empresarial"},{"$f":"Cálculos!U33","v":6},{"$f":"Cálculos!J33","v":{"v":34389.18,"d":"R$ 34,389.18"}},{"$f":"Cálculos!H33","v":{"v":2292.6136363636365,"d":"R$ 2,292.61"}},{"$f":"Cálculos!M33","v":{"v":3631.5299999999997,"d":"R$ 3,631.53"}},{"$f":"Cálculos!N33","v":{"v":1247.7081166363635,"d":"R$ 1,247.71"}},{"$f":"Cálculos!O33","v":{"v":0.6336056864397465,"d":"63.36%"}},{"$f":"Cálculos!P33","v":{"v":0.21769198043739865,"d":"21.77%"}},{"v":0.5442295626468401,"d":"54.42%"},{"v":7486.248699818181,"d":"R$ 7,486.25"}]
[null,null,{"$f":"Cálculos!C34","v":"Criação de Identidade Visual"},{"$f":"Cálculos!U34","v":2},{"$f":"Cálculos!J34","v":{"v":27570.74,"d":"R$ 27,570.74"}},{"$f":"Cálculos!H34","v":{"v":5514.147727272727,"d":"R$ 5,514.15"}},{"$f":"Cálculos!M34","v":{"v":8945.37,"d":"R$ 8,945.37"}},{"$f":"Cálculos!N34","v":{"v":3020.3602097272747,"d":"R$ 3,020.36"}},{"$f":"Cálculos!O34","v":{"v":0.6489031487729383,"d":"64.89%"}},{"$f":"Cálculos!P34","v":{"v":0.21909895851379213,"d":"21.91%"}},{"v":0.5477474233758208,"d":"54.77%"},{"v":6040.720419454549,"d":"R$ 6,040.72"}]
[null,null,{"$f":"Cálculos!C35","v":"Manutenção Predial"},{"$f":"Cálculos!U35","v":18},{"$f":"Cálculos!J35","v":{"v":36316.979999999996,"d":"R$ 36,316.98"}},{"$f":"Cálculos!H35","v":{"v":807.0454545454545,"d":"R$ 807.05"}},{"$f":"Cálculos!M35","v":{"v":1287.61,"d":"R$ 1,287.61"}},{"$f":"Cálculos!N35","v":{"v":430.27450645454553,"d":"R$ 430.27"}},{"$f":"Cálculos!O35","v":{"v":0.6381857742576613,"d":"63.82%"}},{"$f":"Cálculos!P35","v":{"v":0.21325950330071003,"d":"21.33%"}},{"v":0.5331477973528584,"d":"53.31%"},{"v":7744.94111618182,"d":"R$ 7,744.94"}]
[null,null,{"$f":"Cálculos!C36","v":"Desenvolvimento de Sistema"},{"$f":"Cálculos!U36","v":1},{"$f":"Cálculos!J36","v":{"v":74079.55,"d":"R$ 74,079.55"}},{"$f":"Cálculos!H36","v":{"v":29631.818181818184,"d":"R$ 29,631.82"}},{"$f":"Cálculos!M36","v":{"v":47529.55,"d":"R$ 47,529.55"}},{"$f":"Cálculos!N36","v":{"v":16291.110773181823,"d":"R$ 16,291.11"}},{"$f":"Cálculos!O36","v":{"v":0.641601494609511,"d":"64.16%"}},{"$f":"Cálculos!P36","v":{"v":0.21991373831484967,"d":"21.99%"}},{"v":0.5497843795213991,"d":"54.98%"},{"v":16291.110773181823,"d":"R$ 16,291.11"}]
[null,null,{"$f":"Cálculos!C37","v":"Assessoria Contábil Mensal"},{"$f":"Cálculos!U37","v":9},{"$f":"Cálculos!J37","v":{"v":43675.56,"d":"R$ 43,675.56"}},{"$f":"Cálculos!H37","v":{"v":1941.1363636363637,"d":"R$ 1,941.14"}},{"$f":"Cálculos!M37","v":{"v":3142.84,"d":"R$ 3,142.84"}},{"$f":"Cálculos!N37","v":{"v":1054.3097203636364,"d":"R$ 1,054.31"}},{"$f":"Cálculos!O37","v":{"v":0.6476290172352684,"d":"64.76%"}},{"$f":"Cálculos!P37","v":{"v":0.21725622941692624,"d":"21.73%"}},{"v":0.5431404717948718,"d":"54.31%"},{"v":9488.787483272728,"d":"R$ 9,488.79"}]
[null,null,{"$f":"Cálculos!C38","v":"Projeto Arquitetônico"},{"$f":"Cálculos!U38","v":1},{"$f":"Cálculos!J38","v":{"v":40027.27,"d":"R$ 40,027.27"}},{"$f":"Cálculos!H38","v":{"v":16010.909090909092,"d":"R$ 16,010.91"}},{"$f":"Cálculos!M38","v":{"v":25557.269999999997,"d":"R$ 25,557.27"}},{"$f":"Cálculos!N38","v":{"v":8796.201036090906,"d":"R$ 8,796.20"}},{"$f":"Cálculos!O38","v":{"v":0.6384964550417752,"d":"63.85%"}},{"$f":"Cálculos!P38","v":{"v":0.21975520778936228,"d":"21.98%"}},{"v":0.5493879820406539,"d":"54.94%"},{"v":8796.201036090906,"d":"R$ 8,796.20"}]
[null,null,{"$f":"Cálculos!C39","v":"Treinamento Corporativo"},{"$f":"Cálculos!U39","v":4},{"$f":"Cálculos!J39","v":{"v":25840.92,"d":"R$ 25,840.92"}},{"$f":"Cálculos!H39","v":{"v":2584.090909090909,"d":"R$ 2,584.09"}},{"$f":"Cálculos!M39","v":{"v":4030.2299999999996,"d":"R$ 4,030.23"}},{"$f":"Cálculos!N39","v":{"v":1408.0977139090908,"d":"R$ 1,408.10"}},{"$f":"Cálculos!O39","v":{"v":0.6238524015398832,"d":"62.39%"}},{"$f":"Cálculos!P39","v":{"v":0.21796402200991155,"d":"21.80%"}},{"v":0.5449102850659631,"d":"54.49%"},{"v":5632.390855636363,"d":"R$ 5,632.39"}]

{"sheet":"ROI","index":31,"n_rows":14,"n_cols":11,"rows_kept":14,"hidden":true}
[]
[null,null,"ROI"]
[]
[]
[]
[]
[null,null,"Investimento / Projeto","Valor Investido","Retorno Mensal Esperado","Prazo (meses)","Retorno Total","Ganho Líquido","ROI %","ROI Mensal %","Payback (meses)"]
[null,null,"Nova loja física",{"v":120000,"d":"R$ 120,000.00"},{"v":9500,"d":"R$ 9,500.00"},{"v":24,"d":"24.00"},{"$f":"E8*F8","v":{"v":228000,"d":"R$ 228,000.00"}},{"$f":"G8-D8","v":{"v":108000,"d":"R$ 108,000.00"}},{"$f":"IFERROR(H8/D8,0)","v":{"v":0.9,"d":"90.00%"}},{"$f":"IFERROR(I8/F8,0)","v":{"v":0.0375,"d":"3.75%"}},{"$f":"IFERROR(D8/E8,0)","v":{"v":12.631578947368421,"d":"12.63"}}]
[null,null,"Máquina de corte laser",{"v":68000,"d":"R$ 68,000.00"},{"v":6200,"d":"R$ 6,200.00"},{"v":36,"d":"36.00"},{"v":223200,"d":"R$ 223,200.00"},{"v":155200,"d":"R$ 155,200.00"},{"v":2.2823529411764705,"d":"228.24%"},{"v":0.06339869281045751,"d":"6.34%"},{"v":10.96774193548387,"d":"10.97"}]
[null,null,"Campanha de marketing",{"v":25000,"d":"R$ 25,000.00"},{"v":4800,"d":"R$ 4,800.00"},{"v":12,"d":"12.00"},{"v":57600,"d":"R$ 57,600.00"},{"v":32600,"d":"R$ 32,600.00"},{"v":1.304,"d":"130.40%"},{"v":0.10866666666666668,"d":"10.87%"},{"v":5.208333333333333,"d":"5.21"}]
[null,null,"Loja virtual própria",{"v":45000,"d":"R$ 45,000.00"},{"v":5400,"d":"R$ 5,400.00"},{"v":18,"d":"18.00"},{"v":97200,"d":"R$ 97,200.00"},{"v":52200,"d":"R$ 52,200.00"},{"v":1.16,"d":"116.00%"},{"v":0.06444444444444444,"d":"6.44%"},{"v":8.333333333333334,"d":"8.33"}]
[null,null,"Contratação de vendedor",{"v":38000,"d":"R$ 38,000.00"},{"v":4100,"d":"R$ 4,100.00"},{"v":24,"d":"24.00"},{"v":98400,"d":"R$ 98,400.00"},{"v":60400,"d":"R$ 60,400.00"},{"v":1.5894736842105264,"d":"158.95%"},{"v":0.0662280701754386,"d":"6.62%"},{"v":9.268292682926829,"d":"9.27"}]
[null,null,"Linha de produtos premium",{"v":85000,"d":"R$ 85,000.00"},{"v":8200,"d":"R$ 8,200.00"},{"v":30,"d":"30.00"},{"v":246000,"d":"R$ 246,000.00"},{"v":161000,"d":"R$ 161,000.00"},{"v":1.8941176470588235,"d":"189.41%"},{"v":0.06313725490196079,"d":"6.31%"},{"v":10.365853658536585,"d":"10.37"}]
[null,null,"Sistema de gestão (ERP)",{"v":32000,"d":"R$ 32,000.00"},{"v":2900,"d":"R$ 2,900.00"},{"v":36,"d":"36.00"},{"v":104400,"d":"R$ 104,400.00"},{"v":72400,"d":"R$ 72,400.00"},{"v":2.2625,"d":"226.25%"},{"v":0.06284722222222222,"d":"6.28%"},{"v":11.03448275862069,"d":"11.03"}]

{"sheet":"Descontos","index":32,"n_rows":41,"n_cols":12,"rows_kept":41,"hidden":true}
[]
[null,null,"DESCONTOS"]
[]
[]
[]
[]
[null,null,"Produto","Preço Cheio","Custo Total","% Desconto","Valor do Desconto","Preço Líquido","Tributos","Desp. Comerciais","Lucro Restante","Margem Restante %"]
[null,null,{"$f":"Cálculos!C25","v":"Camiseta Premium"},{"$f":"Cálculos!I25","v":{"v":116.19,"d":"R$ 116.19"}},{"$f":"Cálculos!H25","v":{"v":46.474999999999994,"d":"R$ 46.48"}},{"v":0.05,"d":"5.00%"},{"$f":"D8*F8","v":{"v":5.8095,"d":"R$ 5.81"}},{"$f":"D8-G8","v":{"v":110.3805,"d":"R$ 110.38"}},{"$f":"H8*Cálculos!$D$10","v":{"v":9.3823425,"d":"R$ 9.38"}},{"$f":"H8*Cálculos!$D$15+Cálculos!$D$16","v":{"v":46.35120945,"d":"R$ 46.35"}},{"$f":"H8-E8-I8-J8","v":{"v":8.171948050000005,"d":"R$ 8.17"}},{"$f":"IFERROR(K8/H8,0)","v":{"v":0.07403434528743759,"d":"7.40%"}}]
[null,null,{"$f":"Cálculos!C26","v":"Caneca Cerâmica 350ml"},{"$f":"Cálculos!I26","v":{"v":74.39,"d":"R$ 74.39"}},{"$f":"Cálculos!H26","v":{"v":29.755,"d":"R$ 29.76"}},{"v":0.1,"d":"10.00%"},{"v":7.439,"d":"R$ 7.44"},{"v":66.951,"d":"R$ 66.95"},{"$f":"H9*Cálculos!$D$10","v":{"v":5.690835,"d":"R$ 5.69"}},{"$f":"H9*Cálculos!$D$15+Cálculos!$D$16","v":{"v":33.5438499,"d":"R$ 33.54"}},{"v":-2.0386849,"d":"(R$ 2.04)"},{"v":-0.03045040253319592,"d":"(3.05%)"}]
[null,null,{"$f":"Cálculos!C27","v":"Kit Presente Gourmet"},{"$f":"Cálculos!I27","v":{"v":173.19,"d":"R$ 173.19"}},{"$f":"Cálculos!H27","v":{"v":69.275,"d":"R$ 69.28"}},{"v":0.15,"d":"15.00%"},{"v":25.9785,"d":"R$ 25.98"},{"v":147.2115,"d":"R$ 147.21"},{"$f":"H10*Cálculos!$D$10","v":{"v":12.512977500000002,"d":"R$ 12.51"}},{"$f":"H10*Cálculos!$D$15+Cálculos!$D$16","v":{"v":57.212671349999994,"d":"R$ 57.21"}},{"v":8.210851149999996,"d":"R$ 8.21"},{"v":0.05577588130003428,"d":"5.58%"}]
[null,null,{"$f":"Cálculos!C28","v":"Mochila Executiva"},{"$f":"Cálculos!I28","v":{"v":266.44,"d":"R$ 266.44"}},{"$f":"Cálculos!H28","v":{"v":106.57499999999999,"d":"R$ 106.58"}},{"v":0.05,"d":"5.00%"},{"v":13.322000000000001,"d":"R$ 13.32"},{"v":253.118,"d":"R$ 253.12"},{"$f":"H11*Cálculos!$D$10","v":{"v":21.51503,"d":"R$ 21.52"}},{"$f":"H11*Cálculos!$D$15+Cálculos!$D$16","v":{"v":88.4444982,"d":"R$ 88.44"}},{"v":36.58347180000001,"d":"R$ 36.58"},{"v":0.14453129291476707,"d":"14.45%"}]
[null,null,{"$f":"Cálculos!C29","v":"Fone Bluetooth TWS"},{"$f":"Cálculos!I29","v":{"v":233.89,"d":"R$ 233.89"}},{"$f":"Cálculos!H29","v":{"v":93.555,"d":"R$ 93.56"}},{"v":0.1,"d":"10.00%"},{"v":23.389,"d":"R$ 23.39"},{"v":210.50099999999998,"d":"R$ 210.50"},{"$f":"H12*Cálculos!$D$10","v":{"v":17.892585,"d":"R$ 17.89"}},{"$f":"H12*Cálculos!$D$15+Cálculos!$D$16","v":{"v":75.87674489999999,"d":"R$ 75.88"}},{"v":23.17667009999998,"d":"R$ 23.18"},{"v":0.11010242279134058,"d":"11.01%"}]
[null,null,{"$f":"Cálculos!C30","v":"Garrafa Térmica 1L"},{"$f":"Cálculos!I30","v":{"v":141.81,"d":"R$ 141.81"}},{"$f":"Cálculos!H30","v":{"v":56.725,"d":"R$ 56.73"}},{"v":0.05,"d":"5.00%"},{"v":7.0905000000000005,"d":"R$ 7.09"},{"v":134.7195,"d":"R$ 134.72"},{"$f":"H13*Cálculos!$D$10","v":{"v":11.451157500000003,"d":"R$ 11.45"}},{"$f":"H13*Cálculos!$D$15+Cálculos!$D$16","v":{"v":53.52878055000001,"d":"R$ 53.53"}},{"v":13.014561950000001,"d":"R$ 13.01"},{"v":0.09660488607811045,"d":"9.66%"}]
[null,null,{"$f":"Cálculos!C31","v":"Agenda Executiva 2026"},{"$f":"Cálculos!I31","v":{"v":96.34,"d":"R$ 96.34"}},{"$f":"Cálculos!H31","v":{"v":38.537499999999994,"d":"R$ 38.54"}},{"v":0.15,"d":"15.00%"},{"v":14.451,"d":"R$ 14.45"},{"v":81.88900000000001,"d":"R$ 81.89"},{"$f":"H14*Cálculos!$D$10","v":{"v":6.960565000000002,"d":"R$ 6.96"}},{"$f":"H14*Cálculos!$D$15+Cálculos!$D$16","v":{"v":37.9490661,"d":"R$ 37.95"}},{"v":-1.55813109999999,"d":"(R$ 1.56)"},{"v":-0.019027355322448557,"d":"(1.90%)"}]
[null,null,{"$f":"Cálculos!C32","v":"Boné Trucker"},{"$f":"Cálculos!I32","v":{"v":88.72,"d":"R$ 88.72"}},{"$f":"Cálculos!H32","v":{"v":35.489285714285714,"d":"R$ 35.49"}},{"v":0.2,"d":"20.00%"},{"v":17.744,"d":"R$ 17.74"},{"v":70.976,"d":"R$ 70.98"},{"$f":"H15*Cálculos!$D$10","v":{"v":6.03296,"d":"R$ 6.03"}},{"$f":"H15*Cálculos!$D$15+Cálculos!$D$16","v":{"v":34.7308224,"d":"R$ 34.73"}},{"v":-5.277068114285715,"d":"(R$ 5.28)"},{"v":-0.07435003542444932,"d":"(7.44%)"}]
[null,null,{"$f":"Cálculos!C33","v":"Consultoria Empresarial"},{"$f":"Cálculos!I33","v":{"v":5731.53,"d":"R$ 5,731.53"}},{"$f":"Cálculos!H33","v":{"v":2292.6136363636365,"d":"R$ 2,292.61"}},{"v":0.05,"d":"5.00%"},{"v":286.5765,"d":"R$ 286.58"},{"v":5444.9535,"d":"R$ 5,444.95"},{"$f":"H16*Cálculos!$D$10","v":{"v":462.8210475,"d":"R$ 462.82"}},{"$f":"H16*Cálculos!$D$15+Cálculos!$D$16","v":{"v":1619.5167871499998,"d":"R$ 1,619.52"}},{"v":1070.0020289863633,"d":"R$ 1,070.00"},{"v":0.1965126109867354,"d":"19.65%"}]
[null,null,{"$f":"Cálculos!C34","v":"Criação de Identidade Visual"},{"$f":"Cálculos!I34","v":{"v":13785.37,"d":"R$ 13,785.37"}},{"$f":"Cálculos!H34","v":{"v":5514.147727272727,"d":"R$ 5,514.15"}},{"v":0.1,"d":"10.00%"},{"v":1378.5370000000003,"d":"R$ 1,378.54"},{"v":12406.833,"d":"R$ 12,406.83"},{"$f":"H17*Cálculos!$D$10","v":{"v":1054.580805,"d":"R$ 1,054.58"}},{"$f":"H17*Cálculos!$D$15+Cálculos!$D$16","v":{"v":3672.5750517,"d":"R$ 3,672.58"}},{"v":2165.529416027273,"d":"R$ 2,165.53"},{"v":0.17454328723754667,"d":"17.45%"}]
[null,null,{"$f":"Cálculos!C35","v":"Manutenção Predial"},{"$f":"Cálculos!I35","v":{"v":2017.61,"d":"R$ 2,017.61"}},{"$f":"Cálculos!H35","v":{"v":807.0454545454545,"d":"R$ 807.05"}},{"v":0.05,"d":"5.00%"},{"v":100.8805,"d":"R$ 100.88"},{"v":1916.7295,"d":"R$ 1,916.73"},{"$f":"H18*Cálculos!$D$10","v":{"v":162.9220075,"d":"R$ 162.92"}},{"$f":"H18*Cálculos!$D$15+Cálculos!$D$16","v":{"v":579.0435295499999,"d":"R$ 579.04"}},{"v":367.71850840454545,"d":"R$ 367.72"},{"v":0.19184684557969472,"d":"19.18%"}]
[null,null,{"$f":"Cálculos!C36","v":"Desenvolvimento de Sistema"},{"$f":"Cálculos!I36","v":{"v":74079.55,"d":"R$ 74,079.55"}},{"$f":"Cálculos!H36","v":{"v":29631.818181818184,"d":"R$ 29,631.82"}},{"v":0.1,"d":"10.00%"},{"v":7407.955000000001,"d":"R$ 7,407.96"},{"v":66671.595,"d":"R$ 66,671.60"},{"$f":"H19*Cálculos!$D$10","v":{"v":5667.085575,"d":"R$ 5,667.09"}},{"$f":"H19*Cálculos!$D$15+Cálculos!$D$16","v":{"v":19675.2533655,"d":"R$ 19,675.25"}},{"v":11697.437877681816,"d":"R$ 11,697.44"},{"v":0.17544859812761066,"d":"17.54%"}]
[null,null,{"$f":"Cálculos!C37","v":"Assessoria Contábil Mensal"},{"$f":"Cálculos!I37","v":{"v":4852.84,"d":"R$ 4,852.84"}},{"$f":"Cálculos!H37","v":{"v":1941.1363636363637,"d":"R$ 1,941.14"}},{"v":0.05,"d":"5.00%"},{"v":242.64200000000002,"d":"R$ 242.64"},{"v":4610.198,"d":"R$ 4,610.20"},{"$f":"H20*Cálculos!$D$10","v":{"v":391.86683000000005,"d":"R$ 391.87"}},{"$f":"H20*Cálculos!$D$15+Cálculos!$D$16","v":{"v":1373.3473902,"d":"R$ 1,373.35"}},{"v":903.8474161636364,"d":"R$ 903.85"},{"v":0.19605392570202762,"d":"19.61%"}]
[null,null,{"$f":"Cálculos!C38","v":"Projeto Arquitetônico"},{"$f":"Cálculos!I38","v":{"v":40027.27,"d":"R$ 40,027.27"}},{"$f":"Cálculos!H38","v":{"v":16010.909090909092,"d":"R$ 16,010.91"}},{"v":0.1,"d":"10.00%"},{"v":4002.727,"d":"R$ 4,002.73"},{"v":36024.543,"d":"R$ 36,024.54"},{"$f":"H21*Cálculos!$D$10","v":{"v":3062.086155,"d":"R$ 3,062.09"}},{"$f":"H21*Cálculos!$D$15+Cálculos!$D$16","v":{"v":10637.437730699998,"d":"R$ 10,637.44"}},{"v":6314.110023390907,"d":"R$ 6,314.11"},{"v":0.17527245309929143,"d":"17.53%"}]
[null,null,{"$f":"Cálculos!C39","v":"Treinamento Corporativo"},{"$f":"Cálculos!I39","v":{"v":6460.23,"d":"R$ 6,460.23"}},{"$f":"Cálculos!H39","v":{"v":2584.090909090909,"d":"R$ 2,584.09"}},{"v":0.05,"d":"5.00%"},{"v":323.0115,"d":"R$ 323.01"},{"v":6137.2185,"d":"R$ 6,137.22"},{"$f":"H22*Cálculos!$D$10","v":{"v":521.6635725,"d":"R$ 521.66"}},{"$f":"H22*Cálculos!$D$15+Cálculos!$D$16","v":{"v":1823.66573565,"d":"R$ 1,823.67"}},{"v":1207.7982827590909,"d":"R$ 1,207.80"},{"v":0.196798970536749,"d":"19.68%"}]
[]
[]
[null,null,"DESCONTO MÁXIMO SEM PREJUÍZO (por item)"]
[null,null,"Item","Desconto Máx. (mantendo lucro zero)","Desconto Máx. (mantendo 10% de margem)"]
[null,null,{"$f":"Cálculos!C25","v":"Camiseta Premium"},{"$f":"IFERROR(1-(Cálculos!H25+Cálculos!$D$16)/(Cálculos!I25*(1-Cálculos!$D$10-Cálculos!$D$15)),0)","v":{"v":0.16342142883900312,"d":"16.34%"}},{"$f":"IFERROR(1-(Cálculos!H25+Cálculos!$D$16)/(Cálculos!I25*(1-Cálculos!$D$10-Cálculos!$D$15-0.1)),0)","v":{"v":0.002571866993012595,"d":"0.26%"}}]
[null,null,{"$f":"Cálculos!C26","v":"Caneca Cerâmica 350ml"},{"$f":"IFERROR(1-(Cálculos!H26+Cálculos!$D$16)/(Cálculos!I26*(1-Cálculos!$D$10-Cálculos!$D$15)),0)","v":{"v":0.055804931011326775,"d":"5.58%"}},{"$f":"IFERROR(1-(Cálculos!H26+Cálculos!$D$16)/(Cálculos!I26*(1-Cálculos!$D$10-Cálculos!$D$15-0.1)),0)","v":{"v":-0.12573613205129042,"d":"(12.57%)"}}]
[null,null,{"$f":"Cálculos!C27","v":"Kit Presente Gourmet"},{"$f":"IFERROR(1-(Cálculos!H27+Cálculos!$D$16)/(Cálculos!I27*(1-Cálculos!$D$10-Cálculos!$D$15)),0)","v":{"v":0.226454602652845,"d":"22.65%"}},{"$f":"IFERROR(1-(Cálculos!H27+Cálculos!$D$16)/(Cálculos!I27*(1-Cálculos!$D$10-Cálculos!$D$15-0.1)),0)","v":{"v":0.07772447434152907,"d":"7.77%"}}]
[null,null,{"$f":"Cálculos!C28","v":"Mochila Executiva"},{"$f":"IFERROR(1-(Cálculos!H28+Cálculos!$D$16)/(Cálculos!I28*(1-Cálculos!$D$10-Cálculos!$D$15)),0)","v":{"v":0.27142352567171224,"d":"27.14%"}},{"$f":"IFERROR(1-(Cálculos!H28+Cálculos!$D$16)/(Cálculos!I28*(1-Cálculos!$D$10-Cálculos!$D$15-0.1)),0)","v":{"v":0.13133960443958625,"d":"13.13%"}}]
[null,null,{"$f":"Cálculos!C29","v":"Fone Bluetooth TWS"},{"$f":"IFERROR(1-(Cálculos!H29+Cálculos!$D$16)/(Cálculos!I29*(1-Cálculos!$D$10-Cálculos!$D$15)),0)","v":{"v":0.2598003233546309,"d":"25.98%"}},{"$f":"IFERROR(1-(Cálculos!H29+Cálculos!$D$16)/(Cálculos!I29*(1-Cálculos!$D$10-Cálculos!$D$15-0.1)),0)","v":{"v":0.11748160067719027,"d":"11.75%"}}]
[null,null,{"$f":"Cálculos!C30","v":"Garrafa Térmica 1L"},{"$f":"IFERROR(1-(Cálculos!H30+Cálculos!$D$16)/(Cálculos!I30*(1-Cálculos!$D$10-Cálculos!$D$15)),0)","v":{"v":0.19799974483825988,"d":"19.80%"}},{"$f":"IFERROR(1-(Cálculos!H30+Cálculos!$D$16)/(Cálculos!I30*(1-Cálculos!$D$10-Cálculos!$D$15-0.1)),0)","v":{"v":0.043798580607969595,"d":"4.38%"}}]
[null,null,{"$f":"Cálculos!C31","v":"Agenda Executiva 2026"},{"$f":"IFERROR(1-(Cálculos!H31+Cálculos!$D$16)/(Cálculos!I31*(1-Cálculos!$D$10-Cálculos!$D$15)),0)","v":{"v":0.12391831636174622,"d":"12.39%"}},{"$f":"IFERROR(1-(Cálculos!H31+Cálculos!$D$16)/(Cálculos!I31*(1-Cálculos!$D$10-Cálculos!$D$15-0.1)),0)","v":{"v":-0.04452653725068467,"d":"(4.45%)"}}]
[null,null,{"$f":"Cálculos!C32","v":"Boné Trucker"},{"$f":"IFERROR(1-(Cálculos!H32+Cálculos!$D$16)/(Cálculos!I32*(1-Cálculos!$D$10-Cálculos!$D$15)),0)","v":{"v":0.10407994139725962,"d":"10.41%"}},{"$f":"IFERROR(1-(Cálculos!H32+Cálculos!$D$16)/(Cálculos!I32*(1-Cálculos!$D$10-Cálculos!$D$15-0.1)),0)","v":{"v":-0.06817925079707621,"d":"(6.82%)"}}]
[null,null,{"$f":"Cálculos!C33","v":"Consultoria Empresarial"},{"$f":"IFERROR(1-(Cálculos!H33+Cálculos!$D$16)/(Cálculos!I33*(1-Cálculos!$D$10-Cálculos!$D$15)),0)","v":{"v":0.35105947498371015,"d":"35.11%"}},{"$f":"IFERROR(1-(Cálculos!H33+Cálculos!$D$16)/(Cálculos!I33*(1-Cálculos!$D$10-Cálculos!$D$15-0.1)),0)","v":{"v":0.22628721483829783,"d":"22.63%"}}]
[null,null,{"$f":"Cálculos!C34","v":"Criação de Identidade Visual"},{"$f":"IFERROR(1-(Cálculos!H34+Cálculos!$D$16)/(Cálculos!I34*(1-Cálculos!$D$10-Cálculos!$D$15)),0)","v":{"v":0.35332842850151924,"d":"35.33%"}},{"$f":"IFERROR(1-(Cálculos!H34+Cálculos!$D$16)/(Cálculos!I34*(1-Cálculos!$D$10-Cálculos!$D$15-0.1)),0)","v":{"v":0.22899242167620093,"d":"22.90%"}}]
[null,null,{"$f":"Cálculos!C35","v":"Manutenção Predial"},{"$f":"IFERROR(1-(Cálculos!H35+Cálculos!$D$16)/(Cálculos!I35*(1-Cálculos!$D$10-Cálculos!$D$15)),0)","v":{"v":0.3439114712154653,"d":"34.39%"}},{"$f":"IFERROR(1-(Cálculos!H35+Cálculos!$D$16)/(Cálculos!I35*(1-Cálculos!$D$10-Cálculos!$D$15-0.1)),0)","v":{"v":0.2177648592592003,"d":"21.78%"}}]
[null,null,{"$f":"Cálculos!C36","v":"Desenvolvimento de Sistema"},{"$f":"IFERROR(1-(Cálculos!H36+Cálculos!$D$16)/(Cálculos!I36*(1-Cálculos!$D$10-Cálculos!$D$15)),0)","v":{"v":0.3546423775437021,"d":"35.46%"}},{"$f":"IFERROR(1-(Cálculos!H36+Cálculos!$D$16)/(Cálculos!I36*(1-Cálculos!$D$10-Cálculos!$D$15-0.1)),0)","v":{"v":0.2305590046430489,"d":"23.06%"}}]
[null,null,{"$f":"Cálculos!C37","v":"Assessoria Contábil Mensal"},{"$f":"IFERROR(1-(Cálculos!H37+Cálculos!$D$16)/(Cálculos!I37*(1-Cálculos!$D$10-Cálculos!$D$15)),0)","v":{"v":0.3503567640976073,"d":"35.04%"}},{"$f":"IFERROR(1-(Cálculos!H37+Cálculos!$D$16)/(Cálculos!I37*(1-Cálculos!$D$10-Cálculos!$D$15-0.1)),0)","v":{"v":0.22544939322616098,"d":"22.54%"}}]
[null,null,{"$f":"Cálculos!C38","v":"Projeto Arquitetônico"},{"$f":"IFERROR(1-(Cálculos!H38+Cálculos!$D$16)/(Cálculos!I38*(1-Cálculos!$D$10-Cálculos!$D$15)),0)","v":{"v":0.3543867243821357,"d":"35.44%"}},{"$f":"IFERROR(1-(Cálculos!H38+Cálculos!$D$16)/(Cálculos!I38*(1-Cálculos!$D$10-Cálculos!$D$15-0.1)),0)","v":{"v":0.23025419686476134,"d":"23.03%"}}]
[null,null,{"$f":"Cálculos!C39","v":"Treinamento Corporativo"},{"$f":"IFERROR(1-(Cálculos!H39+Cálculos!$D$16)/(Cálculos!I39*(1-Cálculos!$D$10-Cálculos!$D$15)),0)","v":{"v":0.3514981809545421,"d":"35.15%"}},{"$f":"IFERROR(1-(Cálculos!H39+Cálculos!$D$16)/(Cálculos!I39*(1-Cálculos!$D$10-Cálculos!$D$15-0.1)),0)","v":{"v":0.22681027112076835,"d":"22.68%"}}]

{"sheet":"Parcelamentos","index":33,"n_rows":26,"n_cols":10,"rows_kept":26,"hidden":true}
[]
[null,null,"PARCELAMENTOS"]
[]
[]
[]
[]
[null,null,"PREMISSAS"]
[null,null,"Preço de venda base",{"$f":"Cálculos!$I$25","v":{"v":116.19,"d":"R$ 116.19"}}]
[null,null,"Taxa da operadora por parcela (%)",{"v":0.0199,"d":"1.99%"}]
[null,null,"Taxa de antecipação mensal (%)",{"v":0.0149,"d":"1.49%"}]
[null,null,"Custo do item",{"$f":"Cálculos!$H$25","v":{"v":46.474999999999994,"d":"R$ 46.48"}}]
[]
[]
[null,null,"Nº Parcelas","Valor da Parcela","Total Recebido do Cliente","Taxa Total da Operadora","Custo de Antecipação","Recebimento Líquido","Perda vs. À Vista","Margem Líquida %"]
[null,null,{"$f":"1","v":1},{"$f":"IFERROR($D$8/C15,0)","v":{"v":116.19,"d":"R$ 116.19"}},{"$f":"$D$8","v":{"v":116.19,"d":"R$ 116.19"}},{"$f":"$D$8*$D$9*C15","v":{"v":2.3121810000000003,"d":"R$ 2.31"}},{"$f":"$D$8*$D$10*(C15-1)/2","v":0},{"$f":"E15-F15-G15","v":{"v":113.877819,"d":"R$ 113.88"}},{"$f":"$D$8-H15","v":{"v":2.3121809999999954,"d":"R$ 2.31"}},{"$f":"IFERROR((H15-$D$11-H15*Cálculos!$D$10)/H15,0)","v":{"v":0.5068871610985104,"d":"50.69%"}}]
[null,null,{"$f":"2","v":2},{"v":58.095,"d":"R$ 58.10"},{"v":116.19,"d":"R$ 116.19"},{"v":4.6243620000000005,"d":"R$ 4.62"},{"v":0.8656155,"d":"R$ 0.87"},{"v":110.70002249999999,"d":"R$ 110.70"},{"v":5.489977500000009,"d":"R$ 5.49"},{"$f":"IFERROR((H16-$D$11-H16*Cálculos!$D$10)/H16,0)","v":{"v":0.495171720380635,"d":"49.52%"}}]
[null,null,{"$f":"3","v":3},{"v":38.73,"d":"R$ 38.73"},{"v":116.19,"d":"R$ 116.19"},{"v":6.936543,"d":"R$ 6.94"},{"v":1.731231,"d":"R$ 1.73"},{"v":107.522226,"d":"R$ 107.52"},{"v":8.667773999999994,"d":"R$ 8.67"},{"$f":"IFERROR((H17-$D$11-H17*Cálculos!$D$10)/H17,0)","v":{"v":0.48276378494991357,"d":"48.28%"}}]
[null,null,{"$f":"4","v":4},{"v":29.0475,"d":"R$ 29.05"},{"v":116.19,"d":"R$ 116.19"},{"v":9.248724000000001,"d":"R$ 9.25"},{"v":2.5968465,"d":"R$ 2.60"},{"v":104.3444295,"d":"R$ 104.34"},{"v":11.845570499999994,"d":"R$ 11.85"},{"$f":"IFERROR((H18-$D$11-H18*Cálculos!$D$10)/H18,0)","v":{"v":0.46960008528773456,"d":"46.96%"}}]
[null,null,{"$f":"5","v":5},{"v":23.238,"d":"R$ 23.24"},{"v":116.19,"d":"R$ 116.19"},{"v":11.560905000000002,"d":"R$ 11.56"},{"v":3.462462,"d":"R$ 3.46"},{"v":101.16663299999999,"d":"R$ 101.17"},{"v":15.023367000000007,"d":"R$ 15.02"},{"$f":"IFERROR((H19-$D$11-H19*Cálculos!$D$10)/H19,0)","v":{"v":0.4556094023115309,"d":"45.56%"}}]
[null,null,{"$f":"6","v":6},{"v":19.365,"d":"R$ 19.37"},{"v":116.19,"d":"R$ 116.19"},{"v":13.873086,"d":"R$ 13.87"},{"v":4.3280775,"d":"R$ 4.33"},{"v":97.98883649999999,"d":"R$ 97.99"},{"v":18.201163500000007,"d":"R$ 18.20"},{"$f":"IFERROR((H20-$D$11-H20*Cálculos!$D$10)/H20,0)","v":{"v":0.4407112783454674,"d":"44.07%"}}]
[null,null,{"$f":"7","v":7},{"v":16.59857142857143,"d":"R$ 16.60"},{"v":116.19,"d":"R$ 116.19"},{"v":16.185267000000003,"d":"R$ 16.19"},{"v":5.193693,"d":"R$ 5.19"},{"v":94.81103999999999,"d":"R$ 94.81"},{"v":21.378960000000006,"d":"R$ 21.38"},{"$f":"IFERROR((H21-$D$11-H21*Cálculos!$D$10)/H21,0)","v":{"v":0.4248144688635416,"d":"42.48%"}}]
[null,null,{"$f":"8","v":8},{"v":14.52375,"d":"R$ 14.52"},{"v":116.19,"d":"R$ 116.19"},{"v":18.497448000000002,"d":"R$ 18.50"},{"v":6.0593085,"d":"R$ 6.06"},{"v":91.63324349999999,"d":"R$ 91.63"},{"v":24.556756500000006,"d":"R$ 24.56"},{"$f":"IFERROR((H22-$D$11-H22*Cálculos!$D$10)/H22,0)","v":{"v":0.40781507207588913,"d":"40.78%"}}]
[null,null,{"$f":"9","v":9},{"v":12.91,"d":"R$ 12.91"},{"v":116.19,"d":"R$ 116.19"},{"v":20.809629,"d":"R$ 20.81"},{"v":6.924924,"d":"R$ 6.92"},{"v":88.45544699999999,"d":"R$ 88.46"},{"v":27.734553000000005,"d":"R$ 27.73"},{"$f":"IFERROR((H23-$D$11-H23*Cálculos!$D$10)/H23,0)","v":{"v":0.3895942553430316,"d":"38.96%"}}]
[null,null,{"$f":"10","v":10},{"v":11.619,"d":"R$ 11.62"},{"v":116.19,"d":"R$ 116.19"},{"v":23.121810000000004,"d":"R$ 23.12"},{"v":7.7905394999999995,"d":"R$ 7.79"},{"v":85.2776505,"d":"R$ 85.28"},{"v":30.912349500000005,"d":"R$ 30.91"},{"$f":"IFERROR((H24-$D$11-H24*Cálculos!$D$10)/H24,0)","v":{"v":0.370015473251107,"d":"37.00%"}}]
[null,null,{"$f":"11","v":11},{"v":10.562727272727273,"d":"R$ 10.56"},{"v":116.19,"d":"R$ 116.19"},{"v":25.433991000000002,"d":"R$ 25.43"},{"v":8.656155,"d":"R$ 8.66"},{"v":82.099854,"d":"R$ 82.10"},{"v":34.090146000000004,"d":"R$ 34.09"},{"$f":"IFERROR((H25-$D$11-H25*Cálculos!$D$10)/H25,0)","v":{"v":0.34892103961597787,"d":"34.89%"}}]
[null,null,{"$f":"12","v":12},{"v":9.6825,"d":"R$ 9.68"},{"v":116.19,"d":"R$ 116.19"},{"v":27.746172,"d":"R$ 27.75"},{"v":9.5217705,"d":"R$ 9.52"},{"v":78.9220575,"d":"R$ 78.92"},{"v":37.267942500000004,"d":"R$ 37.27"},{"$f":"IFERROR((H26-$D$11-H26*Cálculos!$D$10)/H26,0)","v":{"v":0.32612787131785054,"d":"32.61%"}}]

{"sheet":"Simulação Tributária","index":34,"n_rows":23,"n_cols":10,"rows_kept":23,"hidden":true}
[]
[null,null,"SIMULAÇÃO TRIBUTÁRIA"]
[]
[]
[]
[]
[null,null,"COMPARAÇÃO ENTRE REGIMES TRIBUTÁRIOS"]
[]
[null,null,"Receita mensal estimada",{"$f":"Cálculos!$D$47","v":{"v":429701.6,"d":"R$ 429,701.60"}}]
[null,null,"Custo total mensal",{"$f":"Cálculos!$D$48","v":{"v":171880.28863636364,"d":"R$ 171,880.29"}}]
[]
[]
[null,null,"Regime","Carga Tributária %","Tributos Mensais","Receita Líquida","Custos","Custos Fixos","Lucro Líquido","Margem Líquida %"]
[null,null,{"$f":"Tributos!C8","v":"Simples Nacional"},{"$f":"Tributos!L8","v":{"v":0.085,"d":"8.50%"}},{"$f":"$D$9*D14","v":{"v":36524.636,"d":"R$ 36,524.64"}},{"$f":"$D$9-E14","v":{"v":393176.964,"d":"R$ 393,176.96"}},{"$f":"$D$10","v":{"v":171880.28863636364,"d":"R$ 171,880.29"}},{"$f":"Cálculos!$D$13","v":{"v":25230,"d":"R$ 25,230.00"}},{"$f":"F14-G14-H14","v":{"v":196066.67536363634,"d":"R$ 196,066.68"}},{"$f":"IFERROR(I14/$D$9,0)","v":{"v":0.45628565349450956,"d":"45.63%"}}]
[null,null,{"$f":"Tributos!C9","v":"Lucro Presumido"},{"$f":"Tributos!L9","v":{"v":0.2473,"d":"24.73%"}},{"$f":"$D$9*D15","v":{"v":106265.20567999998,"d":"R$ 106,265.21"}},{"$f":"$D$9-E15","v":{"v":323436.39431999996,"d":"R$ 323,436.39"}},{"$f":"$D$10","v":{"v":171880.28863636364,"d":"R$ 171,880.29"}},{"$f":"Cálculos!$D$13","v":{"v":25230,"d":"R$ 25,230.00"}},{"$f":"F15-G15-H15","v":{"v":126326.10568363633,"d":"R$ 126,326.11"}},{"$f":"IFERROR(I15/$D$9,0)","v":{"v":0.2939856534945095,"d":"29.40%"}}]
[null,null,{"$f":"Tributos!C10","v":"Lucro Real"},{"$f":"Tributos!L10","v":{"v":0.3065,"d":"30.65%"}},{"$f":"$D$9*D16","v":{"v":131703.5404,"d":"R$ 131,703.54"}},{"$f":"$D$9-E16","v":{"v":297998.0596,"d":"R$ 297,998.06"}},{"$f":"$D$10","v":{"v":171880.28863636364,"d":"R$ 171,880.29"}},{"$f":"Cálculos!$D$13","v":{"v":25230,"d":"R$ 25,230.00"}},{"$f":"F16-G16-H16","v":{"v":100887.77096363634,"d":"R$ 100,887.77"}},{"$f":"IFERROR(I16/$D$9,0)","v":{"v":0.23478565349450956,"d":"23.48%"}}]
[null,null,{"$f":"Tributos!C11","v":"Serviços - Simples"},{"$f":"Tributos!L11","v":{"v":0.06,"d":"6.00%"}},{"$f":"$D$9*D17","v":{"v":25782.095999999998,"d":"R$ 25,782.10"}},{"$f":"$D$9-E17","v":{"v":403919.50399999996,"d":"R$ 403,919.50"}},{"$f":"$D$10","v":{"v":171880.28863636364,"d":"R$ 171,880.29"}},{"$f":"Cálculos!$D$13","v":{"v":25230,"d":"R$ 25,230.00"}},{"$f":"F17-G17-H17","v":{"v":206809.21536363632,"d":"R$ 206,809.22"}},{"$f":"IFERROR(I17/$D$9,0)","v":{"v":0.4812856534945095,"d":"48.13%"}}]
[null,null,{"$f":"Tributos!C12","v":"Serviços - Presumido"},{"$f":"Tributos!L12","v":{"v":0.11729999999999999,"d":"11.73%"}},{"$f":"$D$9*D18","v":{"v":50403.99767999999,"d":"R$ 50,404.00"}},{"$f":"$D$9-E18","v":{"v":379297.60232,"d":"R$ 379,297.60"}},{"$f":"$D$10","v":{"v":171880.28863636364,"d":"R$ 171,880.29"}},{"$f":"Cálculos!$D$13","v":{"v":25230,"d":"R$ 25,230.00"}},{"$f":"F18-G18-H18","v":{"v":182187.31368363637,"d":"R$ 182,187.31"}},{"$f":"IFERROR(I18/$D$9,0)","v":{"v":0.4239856534945096,"d":"42.40%"}}]
[]
[]
[null,null,"Regime mais vantajoso",{"$f":"IFERROR(INDEX($C$14:$C$18,MATCH(MAX($I$14:$I$18),$I$14:$I$18,0)),\"-\")","v":"Serviços - Simples"}]
[null,null,"Economia vs. regime atual",{"$f":"IFERROR(MAX($I$14:$I$18)-INDEX($I$14:$I$18,MATCH(Cálculos!$D$9,$C$14:$C$18,0)),0)","v":{"v":10742.539999999979,"d":"R$ 10,742.54"}}]
[null,null,"Regime atualmente selecionado",{"$f":"Cálculos!$D$9","v":"Simples Nacional"}]

{"sheet":"Cálculos","index":35,"n_rows":102,"n_cols":21,"rows_kept":102,"hidden":true}
[]
[null,null,"CÁLCULOS"]
[]
[]
[]
[]
[]
[null,null,"1. PARÂMETROS GLOBAIS"]
[null,null,"Regime tributário ativo","Simples Nacional"]
[null,null,"Carga tributária do regime (%)",{"$f":"IFERROR(INDEX(Tributos!$L$8:$L$12,MATCH($D$9,Tributos!$C$8:$C$12,0)),0)","v":{"v":0.085,"d":"8.50%"}}]
[null,null,"Volume mensal estimado de vendas (un.)",1200]
[null,null,"Total de custos fixos rateáveis (R$)",{"$f":"SUMIFS('Custos Fixos'!$F$8:$F$17,'Custos Fixos'!$G$8:$G$17,\"Sim\")","v":{"v":23730,"d":"R$ 23,730.00"}}]
[null,null,"Total de custos fixos (R$)",{"$f":"SUM('Custos Fixos'!$F$8:$F$17)","v":{"v":25230,"d":"R$ 25,230.00"}}]
[null,null,"Custo fixo rateado por unidade (R$)",{"$f":"IFERROR($D$12/$D$11,0)","v":{"v":19.775,"d":"R$ 19.78"}}]
[null,null,"Despesas comerciais - total % s/ preço",{"$f":"SUMIFS('Despesas Comerciais'!$F$8:$F$14,'Despesas Comerciais'!$H$8:$H$14,\"Preço de Venda\")","v":{"v":0.2949,"d":"29.49%"}}]
[null,null,"Despesas comerciais - total fixo por un. (R$)",{"$f":"SUM('Despesas Comerciais'!$G$8:$G$14)","v":{"v":13.8,"d":"R$ 13.80"}}]
[null,null,"Markup padrão de referência",{"v":2.5,"d":"2.50x"}]
[null,null,"Margem líquida desejada padrão (%)",{"v":0.25,"d":"25.00%"}]
[null,null,"Horas produtivas mensais (base)",176]
[]
[]
[null,null,"2. MATRIZ CONSOLIDADA POR ITEM"]
[]
[null,null,"Item","Tipo","Categoria","Custo Direto","Custo Fixo Rateado","Custo Total","Preço Praticado","Receita Est.","Tributos R$","Desp. Comerciais R$","Lucro Bruto","Lucro Líquido","Margem Bruta %","Margem Líquida %","Markup Efetivo","Margem Contribuição R$","MC %","Status","Volume Mensal (un.)"]
[null,null,{"$f":"Produtos!D8","v":"Camiseta Premium"},"Produto",{"$f":"Produtos!E8","v":"Vestuário"},{"$f":"Produtos!M8","v":{"v":26.7,"d":"R$ 26.70"}},{"$f":"$D$14","v":{"v":19.775,"d":"R$ 19.78"}},{"$f":"F25+G25","v":{"v":46.474999999999994,"d":"R$ 46.48"}},{"$f":"ROUND(H25*$D$17,2)","v":{"v":116.19,"d":"R$ 116.19"}},{"$f":"I25*U25","v":{"v":25561.8,"d":"R$ 25,561.80"}},{"$f":"I25*$D$10","v":{"v":9.87615,"d":"R$ 9.88"}},{"$f":"I25*$D$15+$D$16","v":{"v":48.064431,"d":"R$ 48.06"}},{"$f":"I25-F25","v":{"v":89.49,"d":"R$ 89.49"}},{"$f":"I25-H25-K25-L25","v":{"v":11.774419000000002,"d":"R$ 11.77"}},{"$f":"IFERROR(M25/I25,0)","v":{"v":0.7702039762458043,"d":"77.02%"}},{"$f":"IFERROR(N25/I25,0)","v":{"v":0.10133762802306569,"d":"10.13%"}},{"$f":"IFERROR(I25/H25,0)","v":{"v":2.5000537923614847,"d":"2.50x"}},{"$f":"I25-F25-K25-L25","v":{"v":31.549419,"d":"R$ 31.55"}},{"$f":"IFERROR(R25/I25,0)","v":{"v":0.27153299767621997,"d":"27.15%"}},{"$f":"IF(I25=0,\"Sem preço\",IF(N25<0,\"Prejuízo\",IF(P25<0.05,\"Margem baixa\",\"Saudável\")))","v":"Saudável"},220]
[null,null,{"$f":"Produtos!D9","v":"Caneca Cerâmica 350ml"},"Produto",{"$f":"Produtos!E9","v":"Utilidades"},{"$f":"Produtos!M9","v":{"v":9.98,"d":"R$ 9.98"}},{"v":19.775,"d":"R$ 19.78"},{"v":29.755,"d":"R$ 29.76"},{"v":74.39,"d":"R$ 74.39"},{"v":28268.2,"d":"R$ 28,268.20"},{"v":6.323150000000001,"d":"R$ 6.32"},{"v":35.737611,"d":"R$ 35.74"},{"v":64.41,"d":"R$ 64.41"},{"v":2.5742390000000057,"d":"R$ 2.57"},{"v":0.8658421830891249,"d":"86.58%"},{"v":0.034604637720123746,"d":"3.46%"},{"v":2.5000840194925225,"d":"2.50x"},{"v":22.349238999999997,"d":"R$ 22.35"},{"v":0.3004333781422234,"d":"30.04%"},"Margem baixa",380]
[null,null,{"$f":"Produtos!D10","v":"Kit Presente Gourmet"},"Produto",{"$f":"Produtos!E10","v":"Alimentos"},{"$f":"Produtos!M10","v":{"v":49.5,"d":"R$ 49.50"}},{"v":19.775,"d":"R$ 19.78"},{"v":69.275,"d":"R$ 69.28"},{"v":173.19,"d":"R$ 173.19"},{"v":10391.4,"d":"R$ 10,391.40"},{"v":14.721150000000002,"d":"R$ 14.72"},{"v":64.87373099999999,"d":"R$ 64.87"},{"v":123.69,"d":"R$ 123.69"},{"v":24.320119000000005,"d":"R$ 24.32"},{"v":0.7141867313355275,"d":"71.42%"},{"v":0.1404244991050292,"d":"14.04%"},{"v":2.5000360880548538,"d":"2.50x"},{"v":44.09511900000001,"d":"R$ 44.10"},{"v":0.2546054564351291,"d":"25.46%"},"Saudável",60]
[null,null,{"$f":"Produtos!D11","v":"Mochila Executiva"},"Produto",{"$f":"Produtos!E11","v":"Acessórios"},{"$f":"Produtos!M11","v":{"v":86.8,"d":"R$ 86.80"}},{"v":19.775,"d":"R$ 19.78"},{"v":106.57499999999999,"d":"R$ 106.58"},{"v":266.44,"d":"R$ 266.44"},{"v":11989.8,"d":"R$ 11,989.80"},{"v":22.6474,"d":"R$ 22.65"},{"v":92.373156,"d":"R$ 92.37"},{"v":179.64,"d":"R$ 179.64"},{"v":44.84444400000001,"d":"R$ 44.84"},{"v":0.6742230896261822,"d":"67.42%"},{"v":0.1683097282690287,"d":"16.83%"},{"v":2.500023457658926,"d":"2.50x"},{"v":64.61944399999999,"d":"R$ 64.62"},{"v":0.24252906470499921,"d":"24.25%"},"Saudável",45]
[null,null,{"$f":"Produtos!D12","v":"Fone Bluetooth TWS"},"Produto",{"$f":"Produtos!E12","v":"Eletrônicos"},{"$f":"Produtos!M12","v":{"v":73.78,"d":"R$ 73.78"}},{"v":19.775,"d":"R$ 19.78"},{"v":93.555,"d":"R$ 93.56"},{"v":233.89,"d":"R$ 233.89"},{"v":30405.699999999997,"d":"R$ 30,405.70"},{"v":19.88065,"d":"R$ 19.88"},{"v":82.77416099999999,"d":"R$ 82.77"},{"v":160.10999999999999,"d":"R$ 160.11"},{"v":37.680188999999984,"d":"R$ 37.68"},{"v":0.6845525674462354,"d":"68.46%"},{"v":0.16110218051220654,"d":"16.11%"},{"v":2.5000267222489443,"d":"2.50x"},{"v":57.45518899999999,"d":"R$ 57.46"},{"v":0.2456504724443114,"d":"24.57%"},"Saudável",130]
[null,null,{"$f":"Produtos!D13","v":"Garrafa Térmica 1L"},"Produto",{"$f":"Produtos!E13","v":"Utilidades"},{"$f":"Produtos!M13","v":{"v":36.95,"d":"R$ 36.95"}},{"v":19.775,"d":"R$ 19.78"},{"v":56.725,"d":"R$ 56.73"},{"v":141.81,"d":"R$ 141.81"},{"v":21271.5,"d":"R$ 21,271.50"},{"v":12.05385,"d":"R$ 12.05"},{"v":55.619769000000005,"d":"R$ 55.62"},{"v":104.86,"d":"R$ 104.86"},{"v":17.411381000000006,"d":"R$ 17.41"},{"v":0.7394400959029688,"d":"73.94%"},{"v":0.12277964177420496,"d":"12.28%"},{"v":2.499955927721463,"d":"2.50x"},{"v":37.186381,"d":"R$ 37.19"},{"v":0.26222678936605315,"d":"26.22%"},"Saudável",150]
[null,null,{"$f":"Produtos!D14","v":"Agenda Executiva 2026"},"Produto",{"$f":"Produtos!E14","v":"Papelaria"},{"$f":"Produtos!M14","v":{"v":18.7625,"d":"R$ 18.76"}},{"v":19.775,"d":"R$ 19.78"},{"v":38.537499999999994,"d":"R$ 38.54"},{"v":96.34,"d":"R$ 96.34"},{"v":10597.4,"d":"R$ 10,597.40"},{"v":8.1889,"d":"R$ 8.19"},{"v":42.210666,"d":"R$ 42.21"},{"v":77.5775,"d":"R$ 77.58"},{"v":7.402934000000002,"d":"R$ 7.40"},{"v":0.8052470417272161,"d":"80.52%"},{"v":0.07684174797591864,"d":"7.68%"},{"v":2.499902692182939,"d":"2.50x"},{"v":27.177933999999993,"d":"R$ 27.18"},{"v":0.282104359559892,"d":"28.21%"},"Saudável",110]
[null,null,{"$f":"Produtos!D15","v":"Boné Trucker"},"Produto",{"$f":"Produtos!E15","v":"Vestuário"},{"$f":"Produtos!M15","v":{"v":15.714285714285714,"d":"R$ 15.71"}},{"v":19.775,"d":"R$ 19.78"},{"v":35.489285714285714,"d":"R$ 35.49"},{"v":88.72,"d":"R$ 88.72"},{"v":9315.6,"d":"R$ 9,315.60"},{"v":7.541200000000001,"d":"R$ 7.54"},{"v":39.963528,"d":"R$ 39.96"},{"v":73.00571428571429,"d":"R$ 73.01"},{"v":5.725986285714285,"d":"R$ 5.73"},{"v":0.8228777534458329,"d":"82.29%"},{"v":0.06453997166044054,"d":"6.45%"},{"v":2.4999094294052533,"d":"2.50x"},{"v":25.50098628571429,"d":"R$ 25.50"},{"v":0.287432216926446,"d":"28.74%"},"Saudável",105]
[null,null,{"$f":"Serviços!D8","v":"Consultoria Empresarial"},"Serviço",{"$f":"Serviços!E8","v":"Consultoria"},{"$f":"Serviços!K8","v":{"v":2100,"d":"R$ 2,100.00"}},{"$f":"IFERROR($D$12/$D$19*Serviços!F8/COUNTA(Serviços!$D$8:$D$14),0)","v":{"v":192.6136363636364,"d":"R$ 192.61"}},{"v":2292.6136363636365,"d":"R$ 2,292.61"},{"v":5731.53,"d":"R$ 5,731.53"},{"v":34389.18,"d":"R$ 34,389.18"},{"v":487.18005,"d":"R$ 487.18"},{"v":1704.0281969999999,"d":"R$ 1,704.03"},{"v":3631.5299999999997,"d":"R$ 3,631.53"},{"v":1247.7081166363635,"d":"R$ 1,247.71"},{"v":0.6336056864397465,"d":"63.36%"},{"v":0.21769198043739865,"d":"21.77%"},{"v":2.499998215613383,"d":"2.50x"},{"v":1440.321753,"d":"R$ 1,440.32"},{"v":0.25129795237920766,"d":"25.13%"},"Saudável",6]
[null,null,{"$f":"Serviços!D9","v":"Criação de Identidade Visual"},"Serviço",{"$f":"Serviços!E9","v":"Design"},{"$f":"Serviços!K9","v":{"v":4840,"d":"R$ 4,840.00"}},{"$f":"IFERROR($D$12/$D$19*Serviços!F9/COUNTA(Serviços!$D$8:$D$14),0)","v":{"v":674.1477272727273,"d":"R$ 674.15"}},{"v":5514.147727272727,"d":"R$ 5,514.15"},{"v":13785.37,"d":"R$ 13,785.37"},{"v":27570.74,"d":"R$ 27,570.74"},{"v":1171.75645,"d":"R$ 1,171.76"},{"v":4079.105613,"d":"R$ 4,079.11"},{"v":8945.37,"d":"R$ 8,945.37"},{"v":3020.3602097272747,"d":"R$ 3,020.36"},{"v":0.6489031487729383,"d":"64.89%"},{"v":0.21909895851379213,"d":"21.91%"},{"v":2.5000001236488787,"d":"2.50x"},{"v":3694.5079370000008,"d":"R$ 3,694.51"},{"v":0.2680020875029107,"d":"26.80%"},"Saudável",2]
[null,null,{"$f":"Serviços!D10","v":"Manutenção Predial"},"Serviço",{"$f":"Serviços!E10","v":"Manutenção"},{"$f":"Serviços!K10","v":{"v":730,"d":"R$ 730.00"}},{"$f":"IFERROR($D$12/$D$19*Serviços!F10/COUNTA(Serviços!$D$8:$D$14),0)","v":{"v":77.04545454545455,"d":"R$ 77.05"}},{"v":807.0454545454545,"d":"R$ 807.05"},{"v":2017.61,"d":"R$ 2,017.61"},{"v":36316.979999999996,"d":"R$ 36,316.98"},{"v":171.49685,"d":"R$ 171.50"},{"v":608.7931889999999,"d":"R$ 608.79"},{"v":1287.61,"d":"R$ 1,287.61"},{"v":430.27450645454553,"d":"R$ 430.27"},{"v":0.6381857742576613,"d":"63.82%"},{"v":0.21325950330071003,"d":"21.33%"},{"v":2.499995494226978,"d":"2.50x"},{"v":507.31996100000003,"d":"R$ 507.32"},{"v":0.2514459984833541,"d":"25.14%"},"Saudável",18]
[null,null,{"$f":"Serviços!D11","v":"Desenvolvimento de Sistema"},"Serviço",{"$f":"Serviços!E11","v":"Tecnologia"},{"$f":"Serviços!K11","v":{"v":26550,"d":"R$ 26,550.00"}},{"$f":"IFERROR($D$12/$D$19*Serviços!F11/COUNTA(Serviços!$D$8:$D$14),0)","v":{"v":3081.8181818181824,"d":"R$ 3,081.82"}},{"v":29631.818181818184,"d":"R$ 29,631.82"},{"v":74079.55,"d":"R$ 74,079.55"},{"v":74079.55,"d":"R$ 74,079.55"},{"v":6296.761750000001,"d":"R$ 6,296.76"},{"v":21859.859295,"d":"R$ 21,859.86"},{"v":47529.55,"d":"R$ 47,529.55"},{"v":16291.110773181823,"d":"R$ 16,291.11"},{"v":0.641601494609511,"d":"64.16%"},{"v":0.21991373831484967,"d":"21.99%"},{"v":2.5000001533977603,"d":"2.50x"},{"v":19372.928955000007,"d":"R$ 19,372.93"},{"v":0.2615152083807205,"d":"26.15%"},"Saudável",1]
[null,null,{"$f":"Serviços!D12","v":"Assessoria Contábil Mensal"},"Serviço",{"$f":"Serviços!E12","v":"Contabilidade"},{"$f":"Serviços!K12","v":{"v":1710,"d":"R$ 1,710.00"}},{"$f":"IFERROR($D$12/$D$19*Serviços!F12/COUNTA(Serviços!$D$8:$D$14),0)","v":{"v":231.13636363636365,"d":"R$ 231.14"}},{"v":1941.1363636363637,"d":"R$ 1,941.14"},{"v":4852.84,"d":"R$ 4,852.84"},{"v":43675.56,"d":"R$ 43,675.56"},{"v":412.49140000000006,"d":"R$ 412.49"},{"v":1444.9025159999999,"d":"R$ 1,444.90"},{"v":3142.84,"d":"R$ 3,142.84"},{"v":1054.3097203636364,"d":"R$ 1,054.31"},{"v":0.6476290172352684,"d":"64.76%"},{"v":0.21725622941692624,"d":"21.73%"},{"v":2.4999995316707646,"d":"2.50x"},{"v":1285.4460840000004,"d":"R$ 1,285.45"},{"v":0.2648853215848864,"d":"26.49%"},"Saudável",9]
[null,null,{"$f":"Serviços!D13","v":"Projeto Arquitetônico"},"Serviço",{"$f":"Serviços!E13","v":"Arquitetura"},{"$f":"Serviços!K13","v":{"v":14470,"d":"R$ 14,470.00"}},{"$f":"IFERROR($D$12/$D$19*Serviços!F13/COUNTA(Serviços!$D$8:$D$14),0)","v":{"v":1540.9090909090912,"d":"R$ 1,540.91"}},{"v":16010.909090909092,"d":"R$ 16,010.91"},{"v":40027.27,"d":"R$ 40,027.27"},{"v":40027.27,"d":"R$ 40,027.27"},{"v":3402.31795,"d":"R$ 3,402.32"},{"v":11817.841922999998,"d":"R$ 11,817.84"},{"v":25557.269999999997,"d":"R$ 25,557.27"},{"v":8796.201036090906,"d":"R$ 8,796.20"},{"v":0.6384964550417752,"d":"63.85%"},{"v":0.21975520778936228,"d":"21.98%"},{"v":2.499999829661594,"d":"2.50x"},{"v":10337.110126999998,"d":"R$ 10,337.11"},{"v":0.2582516900852843,"d":"25.83%"},"Saudável",1]
[null,null,{"$f":"Serviços!D14","v":"Treinamento Corporativo"},"Serviço",{"$f":"Serviços!E14","v":"Treinamento"},{"$f":"Serviços!K14","v":{"v":2430,"d":"R$ 2,430.00"}},{"$f":"IFERROR($D$12/$D$19*Serviços!F14/COUNTA(Serviços!$D$8:$D$14),0)","v":{"v":154.0909090909091,"d":"R$ 154.09"}},{"v":2584.090909090909,"d":"R$ 2,584.09"},{"v":6460.23,"d":"R$ 6,460.23"},{"v":25840.92,"d":"R$ 25,840.92"},{"v":549.11955,"d":"R$ 549.12"},{"v":1918.921827,"d":"R$ 1,918.92"},{"v":4030.2299999999996,"d":"R$ 4,030.23"},{"v":1408.0977139090908,"d":"R$ 1,408.10"},{"v":0.6238524015398832,"d":"62.39%"},{"v":0.21796402200991155,"d":"21.80%"},{"v":2.500001055408971,"d":"2.50x"},{"v":1562.1886229999998,"d":"R$ 1,562.19"},{"v":0.24181625468443071,"d":"24.18%"},"Saudável",4]
[]
[]
[null,null,"3. INDICADORES CONSOLIDADOS (alimentam o Dashboard)"]
[null,null,"Quantidade de itens cadastrados",{"$f":"COUNTA($C$25:$C$39)","v":15}]
[null,null,"Quantidade de produtos",{"$f":"COUNTIF($D$25:$D$39,\"Produto\")","v":8}]
[null,null,"Quantidade de serviços",{"$f":"COUNTIF($D$25:$D$39,\"Serviço\")","v":7}]
[null,null,"Quantidade de cenários simulados",{"$f":"COUNTA('Simulador Cenários'!$D$7:$G$7)","v":4}]
[null,null,"Receita estimada total",{"$f":"SUM($J$25:$J$39)","v":{"v":429701.6,"d":"R$ 429,701.60"}}]
[null,null,"Custo total estimado",{"$f":"SUMPRODUCT($H$25:$H$39,$U$25:$U$39)","v":{"v":171880.28863636364,"d":"R$ 171,880.29"}}]
[null,null,"Lucro bruto estimado",{"$f":"SUMPRODUCT($M$25:$M$39,$U$25:$U$39)","v":{"v":292761.425,"d":"R$ 292,761.43"}}]
[null,null,"Lucro líquido estimado",{"$f":"SUMPRODUCT($N$25:$N$39,$U$25:$U$39)","v":{"v":77451.87352363636,"d":"R$ 77,451.87"}}]
[null,null,"Ticket médio",{"$f":"IFERROR(SUM($J$25:$J$39)/SUM($U$25:$U$39),0)","v":{"v":346.25431103948426,"d":"R$ 346.25"}}]
[null,null,"Custo médio por item",{"$f":"IFERROR(AVERAGE($H$25:$H$39),0)","v":{"v":3950.5432099567106,"d":"R$ 3,950.54"}}]
[null,null,"Margem líquida média",{"$f":"IFERROR(AVERAGE($P$25:$P$39),0)","v":{"v":0.1596586449881979,"d":"15.97%"}}]
[null,null,"Markup médio efetivo",{"$f":"IFERROR(AVERAGE($Q$25:$Q$39),0)","v":{"v":2.4999991021836485,"d":"2.50x"}}]
[null,null,"Maior margem líquida (%)",{"$f":"IFERROR(MAX($P$25:$P$39),0)","v":{"v":0.21991373831484967,"d":"21.99%"}}]
[null,null,"Menor margem líquida (%)",{"$f":"IFERROR(MIN($P$25:$P$39),0)","v":{"v":0.034604637720123746,"d":"3.46%"}}]
[null,null,"Item de maior margem",{"$f":"IFERROR(INDEX($C$25:$C$39,MATCH(MAX($P$25:$P$39),$P$25:$P$39,0)),\"-\")","v":"Desenvolvimento de Sistema"}]
[null,null,"Item de menor margem",{"$f":"IFERROR(INDEX($C$25:$C$39,MATCH(MIN($P$25:$P$39),$P$25:$P$39,0)),\"-\")","v":"Caneca Cerâmica 350ml"}]
[null,null,"Produto mais lucrativo",{"$f":"IFERROR(INDEX($C$25:$C$32,MATCH(MAX($N$25:$N$32),$N$25:$N$32,0)),\"-\")","v":"Mochila Executiva"}]
[null,null,"Serviço mais lucrativo",{"$f":"IFERROR(INDEX($C$33:$C$39,MATCH(MAX($N$33:$N$39),$N$33:$N$39,0)),\"-\")","v":"Desenvolvimento de Sistema"}]
[null,null,"Margem de contribuição total",{"$f":"SUMPRODUCT($R$25:$R$39,$U$25:$U$39)","v":{"v":112391.98716,"d":"R$ 112,391.99"}}]
[null,null,"MC média (%)",{"$f":"IFERROR(AVERAGE($S$25:$S$39),0)","v":{"v":0.2629152832237379,"d":"26.29%"}}]
[null,null,"Ponto de equilíbrio (R$ faturamento)",{"$f":"IFERROR($D$13/AVERAGE($S$25:$S$39),0)","v":{"v":95962.47008025607,"d":"R$ 95,962.47"}}]
[null,null,"Ponto de equilíbrio (unidades médias)",{"$f":"IFERROR($D$13/AVERAGE($R$25:$R$32),0)","v":{"v":651.2360309651265,"d":"651"}}]
[null,null,"Rentabilidade sobre receita",{"$f":"IFERROR($D$50/$D$47,0)","v":{"v":0.18024571824642116,"d":"18.02%"}}]
[null,null,"Itens com prejuízo",{"$f":"COUNTIF($T$25:$T$39,\"Prejuízo\")","v":0}]
[null,null,"Itens com margem baixa",{"$f":"COUNTIF($T$25:$T$39,\"Margem baixa\")","v":1}]
[null,null,"Itens saudáveis",{"$f":"COUNTIF($T$25:$T$39,\"Saudável\")","v":14}]
[]
[]
[null,null,"4. RANKINGS (Top 10) — base dos gráficos"]
[]
[null,null,"Top 10 Produtos (lucro líquido/un.)","Lucro Líquido","Margem %",null,"Top 10 Serviços (lucro líquido)","Lucro Líquido","Margem %"]
[null,null,{"$f":"IFERROR(INDEX($C$25:$C$32,MATCH(LARGE($N$25:$N$32,1),$N$25:$N$32,0)),\"-\")","v":"Mochila Executiva"},{"$f":"IFERROR(LARGE($N$25:$N$32,1),0)","v":{"v":44.84444400000001,"d":"R$ 44.84"}},{"$f":"IFERROR(INDEX($P$25:$P$32,MATCH(LARGE($N$25:$N$32,1),$N$25:$N$32,0)),0)","v":{"v":0.1683097282690287,"d":"16.83%"}},null,{"$f":"IFERROR(INDEX($C$33:$C$39,MATCH(LARGE($N$33:$N$39,1),$N$33:$N$39,0)),\"-\")","v":"Desenvolvimento de Sistema"},{"$f":"IFERROR(LARGE($N$33:$N$39,1),0)","v":{"v":16291.110773181823,"d":"R$ 16,291.11"}},{"$f":"IFERROR(INDEX($P$33:$P$39,MATCH(LARGE($N$33:$N$39,1),$N$33:$N$39,0)),0)","v":{"v":0.21991373831484967,"d":"21.99%"}}]
[null,null,{"$f":"IFERROR(INDEX($C$25:$C$32,MATCH(LARGE($N$25:$N$32,2),$N$25:$N$32,0)),\"-\")","v":"Fone Bluetooth TWS"},{"$f":"IFERROR(LARGE($N$25:$N$32,2),0)","v":{"v":37.680188999999984,"d":"R$ 37.68"}},{"$f":"IFERROR(INDEX($P$25:$P$32,MATCH(LARGE($N$25:$N$32,2),$N$25:$N$32,0)),0)","v":{"v":0.16110218051220654,"d":"16.11%"}},null,{"$f":"IFERROR(INDEX($C$33:$C$39,MATCH(LARGE($N$33:$N$39,2),$N$33:$N$39,0)),\"-\")","v":"Projeto Arquitetônico"},{"$f":"IFERROR(LARGE($N$33:$N$39,2),0)","v":{"v":8796.201036090906,"d":"R$ 8,796.20"}},{"$f":"IFERROR(INDEX($P$33:$P$39,MATCH(LARGE($N$33:$N$39,2),$N$33:$N$39,0)),0)","v":{"v":0.21975520778936228,"d":"21.98%"}}]
[null,null,{"$f":"IFERROR(INDEX($C$25:$C$32,MATCH(LARGE($N$25:$N$32,3),$N$25:$N$32,0)),\"-\")","v":"Kit Presente Gourmet"},{"$f":"IFERROR(LARGE($N$25:$N$32,3),0)","v":{"v":24.320119000000005,"d":"R$ 24.32"}},{"$f":"IFERROR(INDEX($P$25:$P$32,MATCH(LARGE($N$25:$N$32,3),$N$25:$N$32,0)),0)","v":{"v":0.1404244991050292,"d":"14.04%"}},null,{"$f":"IFERROR(INDEX($C$33:$C$39,MATCH(LARGE($N$33:$N$39,3),$N$33:$N$39,0)),\"-\")","v":"Criação de Identidade Visual"},{"$f":"IFERROR(LARGE($N$33:$N$39,3),0)","v":{"v":3020.3602097272747,"d":"R$ 3,020.36"}},{"$f":"IFERROR(INDEX($P$33:$P$39,MATCH(LARGE($N$33:$N$39,3),$N$33:$N$39,0)),0)","v":{"v":0.21909895851379213,"d":"21.91%"}}]
[null,null,{"$f":"IFERROR(INDEX($C$25:$C$32,MATCH(LARGE($N$25:$N$32,4),$N$25:$N$32,0)),\"-\")","v":"Garrafa Térmica 1L"},{"$f":"IFERROR(LARGE($N$25:$N$32,4),0)","v":{"v":17.411381000000006,"d":"R$ 17.41"}},{"$f":"IFERROR(INDEX($P$25:$P$32,MATCH(LARGE($N$25:$N$32,4),$N$25:$N$32,0)),0)","v":{"v":0.12277964177420496,"d":"12.28%"}},null,{"$f":"IFERROR(INDEX($C$33:$C$39,MATCH(LARGE($N$33:$N$39,4),$N$33:$N$39,0)),\"-\")","v":"Treinamento Corporativo"},{"$f":"IFERROR(LARGE($N$33:$N$39,4),0)","v":{"v":1408.0977139090908,"d":"R$ 1,408.10"}},{"$f":"IFERROR(INDEX($P$33:$P$39,MATCH(LARGE($N$33:$N$39,4),$N$33:$N$39,0)),0)","v":{"v":0.21796402200991155,"d":"21.80%"}}]
[null,null,{"$f":"IFERROR(INDEX($C$25:$C$32,MATCH(LARGE($N$25:$N$32,5),$N$25:$N$32,0)),\"-\")","v":"Camiseta Premium"},{"$f":"IFERROR(LARGE($N$25:$N$32,5),0)","v":{"v":11.774419000000002,"d":"R$ 11.77"}},{"$f":"IFERROR(INDEX($P$25:$P$32,MATCH(LARGE($N$25:$N$32,5),$N$25:$N$32,0)),0)","v":{"v":0.10133762802306569,"d":"10.13%"}},null,{"$f":"IFERROR(INDEX($C$33:$C$39,MATCH(LARGE($N$33:$N$39,5),$N$33:$N$39,0)),\"-\")","v":"Consultoria Empresarial"},{"$f":"IFERROR(LARGE($N$33:$N$39,5),0)","v":{"v":1247.7081166363635,"d":"R$ 1,247.71"}},{"$f":"IFERROR(INDEX($P$33:$P$39,MATCH(LARGE($N$33:$N$39,5),$N$33:$N$39,0)),0)","v":{"v":0.21769198043739865,"d":"21.77%"}}]
[null,null,{"$f":"IFERROR(INDEX($C$25:$C$32,MATCH(LARGE($N$25:$N$32,6),$N$25:$N$32,0)),\"-\")","v":"Agenda Executiva 2026"},{"$f":"IFERROR(LARGE($N$25:$N$32,6),0)","v":{"v":7.402934000000002,"d":"R$ 7.40"}},{"$f":"IFERROR(INDEX($P$25:$P$32,MATCH(LARGE($N$25:$N$32,6),$N$25:$N$32,0)),0)","v":{"v":0.07684174797591864,"d":"7.68%"}},null,{"$f":"IFERROR(INDEX($C$33:$C$39,MATCH(LARGE($N$33:$N$39,6),$N$33:$N$39,0)),\"-\")","v":"Assessoria Contábil Mensal"},{"$f":"IFERROR(LARGE($N$33:$N$39,6),0)","v":{"v":1054.3097203636364,"d":"R$ 1,054.31"}},{"$f":"IFERROR(INDEX($P$33:$P$39,MATCH(LARGE($N$33:$N$39,6),$N$33:$N$39,0)),0)","v":{"v":0.21725622941692624,"d":"21.73%"}}]
[null,null,{"$f":"IFERROR(INDEX($C$25:$C$32,MATCH(LARGE($N$25:$N$32,7),$N$25:$N$32,0)),\"-\")","v":"Boné Trucker"},{"$f":"IFERROR(LARGE($N$25:$N$32,7),0)","v":{"v":5.725986285714285,"d":"R$ 5.73"}},{"$f":"IFERROR(INDEX($P$25:$P$32,MATCH(LARGE($N$25:$N$32,7),$N$25:$N$32,0)),0)","v":{"v":0.06453997166044054,"d":"6.45%"}},null,{"$f":"IFERROR(INDEX($C$33:$C$39,MATCH(LARGE($N$33:$N$39,7),$N$33:$N$39,0)),\"-\")","v":"Manutenção Predial"},{"$f":"IFERROR(LARGE($N$33:$N$39,7),0)","v":{"v":430.27450645454553,"d":"R$ 430.27"}},{"$f":"IFERROR(INDEX($P$33:$P$39,MATCH(LARGE($N$33:$N$39,7),$N$33:$N$39,0)),0)","v":{"v":0.21325950330071003,"d":"21.33%"}}]
[null,null,{"$f":"IFERROR(INDEX($C$25:$C$32,MATCH(LARGE($N$25:$N$32,8),$N$25:$N$32,0)),\"-\")","v":"Caneca Cerâmica 350ml"},{"$f":"IFERROR(LARGE($N$25:$N$32,8),0)","v":{"v":2.5742390000000057,"d":"R$ 2.57"}},{"$f":"IFERROR(INDEX($P$25:$P$32,MATCH(LARGE($N$25:$N$32,8),$N$25:$N$32,0)),0)","v":{"v":0.034604637720123746,"d":"3.46%"}}]
[]
[]
[]
[null,null,"5. TABELAS AUXILIARES (listas suspensas)"]
[]
[null,null,"Tipo","Situação","Unidade","Regime Tributário","Rateável","Incide sobre","Cenário","Método de Precificação","Categoria","Fornecedor","Status Margem"]
[null,null,"Produto","Ativo","UN","Simples Nacional","Sim","Preço de Venda","Atual","Markup","Vestuário","Têxtil Sul Ltda","Saudável"]
[null,null,"Serviço","Inativo","CX","Lucro Presumido","Não","Custo","Otimista","Margem","Utilidades","Cerâmica Vale","Margem baixa"]
[{"$nulls":3},"Descontinuado","KG","Lucro Real",null,"Unidade","Pessimista","Lucro Desejado","Alimentos","Distrib. Gourmet","Prejuízo"]
[{"$nulls":3},"Em análise","L","Serviços - Simples",null,"Pedido","Personalizado","Hora Trabalhada","Acessórios","Couro & Cia","Sem preço"]
[{"$nulls":4},"M","Serviços - Presumido",{"$nulls":3},"Homem Hora","Eletrônicos","ImportTech"]
[{"$nulls":4},"M²",{"$nulls":4},"Projeto","Papelaria","Gráfica Central"]
[{"$nulls":4},"H",{"$nulls":4},"Prestador de Serviços","Consultoria","Interno"]
[{"$nulls":4},"PROJ",{"$nulls":4},"Comércio","Design"]
[{"$nulls":4},"VISITA",{"$nulls":4},"Indústria","Manutenção"]
[{"$nulls":4},"MÊS",{"$nulls":4},"E-commerce","Tecnologia"]
[{"$nulls":4},"PC",{"$nulls":4},"Delivery","Contabilidade"]
[{"$nulls":9},"Alimentação","Arquitetura"]
[{"$nulls":9},"Artesanato","Treinamento"]
[{"$nulls":9},"Infoprodutos"]
[{"$nulls":9},"Assinaturas"]

{"sheet":"Relatórios","index":36,"n_rows":192,"n_cols":13,"rows_kept":192,"hidden":true}
[]
[null,null,"RELATÓRIOS"]
[]
[]
[]
[]
[null,null,"ÍNDICE DE RELATÓRIOS"]
[]
[null,null,"R1","Lista completa de produtos com preços","linha 20"]
[null,null,"R2","Lista de serviços com preços","linha 34"]
[null,null,"R3","Itens sem margem adequada / abaixo do custo","linha 46"]
[null,null,"R4","Resumo geral de custos e despesas","linha 62"]
[null,null,"R5","Resumo financeiro e receitas projetadas","linha 76"]
[null,null,"R6","Margem e markup por categoria","linha 90"]
[null,null,"R7","Impacto de tributos e despesas comerciais","linha 108"]
[null,null,"R8","Comparativo entre métodos de precificação","linha 122"]
[null,null,"R9","Ranking de lucratividade e menor margem","linha 136"]
[null,null,"R10","Ponto de equilíbrio, MC, ROI, descontos e tributário","linha 152"]
[]
[null,null,"R1 — LISTA COMPLETA DE PRODUTOS COM PREÇOS"]
[null,null,"Produto","Categoria","Custo Total","Preço de Venda","Lucro Líquido","Margem Líquida %","Markup","Volume Mensal","Receita Mensal","Status"]
[null,null,{"$f":"Cálculos!C25","v":"Camiseta Premium"},{"$f":"Cálculos!E25","v":"Vestuário"},{"$f":"Cálculos!H25","v":{"v":46.474999999999994,"d":"R$ 46.48"}},{"$f":"Cálculos!I25","v":{"v":116.19,"d":"R$ 116.19"}},{"$f":"Cálculos!N25","v":{"v":11.774419000000002,"d":"R$ 11.77"}},{"$f":"Cálculos!P25","v":{"v":0.10133762802306569,"d":"10.13%"}},{"$f":"Cálculos!Q25","v":{"v":2.5000537923614847,"d":"2.50x"}},{"$f":"Cálculos!U25","v":220},{"$f":"Cálculos!J25","v":{"v":25561.8,"d":"R$ 25,561.80"}},{"$f":"Cálculos!T25","v":"Saudável"}]
[null,null,{"$f":"Cálculos!C26","v":"Caneca Cerâmica 350ml"},{"$f":"Cálculos!E26","v":"Utilidades"},{"$f":"Cálculos!H26","v":{"v":29.755,"d":"R$ 29.76"}},{"$f":"Cálculos!I26","v":{"v":74.39,"d":"R$ 74.39"}},{"$f":"Cálculos!N26","v":{"v":2.5742390000000057,"d":"R$ 2.57"}},{"$f":"Cálculos!P26","v":{"v":0.034604637720123746,"d":"3.46%"}},{"$f":"Cálculos!Q26","v":{"v":2.5000840194925225,"d":"2.50x"}},{"$f":"Cálculos!U26","v":380},{"$f":"Cálculos!J26","v":{"v":28268.2,"d":"R$ 28,268.20"}},{"$f":"Cálculos!T26","v":"Margem baixa"}]
[null,null,{"$f":"Cálculos!C27","v":"Kit Presente Gourmet"},{"$f":"Cálculos!E27","v":"Alimentos"},{"$f":"Cálculos!H27","v":{"v":69.275,"d":"R$ 69.28"}},{"$f":"Cálculos!I27","v":{"v":173.19,"d":"R$ 173.19"}},{"$f":"Cálculos!N27","v":{"v":24.320119000000005,"d":"R$ 24.32"}},{"$f":"Cálculos!P27","v":{"v":0.1404244991050292,"d":"14.04%"}},{"$f":"Cálculos!Q27","v":{"v":2.5000360880548538,"d":"2.50x"}},{"$f":"Cálculos!U27","v":60},{"$f":"Cálculos!J27","v":{"v":10391.4,"d":"R$ 10,391.40"}},{"$f":"Cálculos!T27","v":"Saudável"}]
[null,null,{"$f":"Cálculos!C28","v":"Mochila Executiva"},{"$f":"Cálculos!E28","v":"Acessórios"},{"$f":"Cálculos!H28","v":{"v":106.57499999999999,"d":"R$ 106.58"}},{"$f":"Cálculos!I28","v":{"v":266.44,"d":"R$ 266.44"}},{"$f":"Cálculos!N28","v":{"v":44.84444400000001,"d":"R$ 44.84"}},{"$f":"Cálculos!P28","v":{"v":0.1683097282690287,"d":"16.83%"}},{"$f":"Cálculos!Q28","v":{"v":2.500023457658926,"d":"2.50x"}},{"$f":"Cálculos!U28","v":45},{"$f":"Cálculos!J28","v":{"v":11989.8,"d":"R$ 11,989.80"}},{"$f":"Cálculos!T28","v":"Saudável"}]
[null,null,{"$f":"Cálculos!C29","v":"Fone Bluetooth TWS"},{"$f":"Cálculos!E29","v":"Eletrônicos"},{"$f":"Cálculos!H29","v":{"v":93.555,"d":"R$ 93.56"}},{"$f":"Cálculos!I29","v":{"v":233.89,"d":"R$ 233.89"}},{"$f":"Cálculos!N29","v":{"v":37.680188999999984,"d":"R$ 37.68"}},{"$f":"Cálculos!P29","v":{"v":0.16110218051220654,"d":"16.11%"}},{"$f":"Cálculos!Q29","v":{"v":2.5000267222489443,"d":"2.50x"}},{"$f":"Cálculos!U29","v":130},{"$f":"Cálculos!J29","v":{"v":30405.699999999997,"d":"R$ 30,405.70"}},{"$f":"Cálculos!T29","v":"Saudável"}]
[null,null,{"$f":"Cálculos!C30","v":"Garrafa Térmica 1L"},{"$f":"Cálculos!E30","v":"Utilidades"},{"$f":"Cálculos!H30","v":{"v":56.725,"d":"R$ 56.73"}},{"$f":"Cálculos!I30","v":{"v":141.81,"d":"R$ 141.81"}},{"$f":"Cálculos!N30","v":{"v":17.411381000000006,"d":"R$ 17.41"}},{"$f":"Cálculos!P30","v":{"v":0.12277964177420496,"d":"12.28%"}},{"$f":"Cálculos!Q30","v":{"v":2.499955927721463,"d":"2.50x"}},{"$f":"Cálculos!U30","v":150},{"$f":"Cálculos!J30","v":{"v":21271.5,"d":"R$ 21,271.50"}},{"$f":"Cálculos!T30","v":"Saudável"}]
[null,null,{"$f":"Cálculos!C31","v":"Agenda Executiva 2026"},{"$f":"Cálculos!E31","v":"Papelaria"},{"$f":"Cálculos!H31","v":{"v":38.537499999999994,"d":"R$ 38.54"}},{"$f":"Cálculos!I31","v":{"v":96.34,"d":"R$ 96.34"}},{"$f":"Cálculos!N31","v":{"v":7.402934000000002,"d":"R$ 7.40"}},{"$f":"Cálculos!P31","v":{"v":0.07684174797591864,"d":"7.68%"}},{"$f":"Cálculos!Q31","v":{"v":2.499902692182939,"d":"2.50x"}},{"$f":"Cálculos!U31","v":110},{"$f":"Cálculos!J31","v":{"v":10597.4,"d":"R$ 10,597.40"}},{"$f":"Cálculos!T31","v":"Saudável"}]
[null,null,{"$f":"Cálculos!C32","v":"Boné Trucker"},{"$f":"Cálculos!E32","v":"Vestuário"},{"$f":"Cálculos!H32","v":{"v":35.489285714285714,"d":"R$ 35.49"}},{"$f":"Cálculos!I32","v":{"v":88.72,"d":"R$ 88.72"}},{"$f":"Cálculos!N32","v":{"v":5.725986285714285,"d":"R$ 5.73"}},{"$f":"Cálculos!P32","v":{"v":0.06453997166044054,"d":"6.45%"}},{"$f":"Cálculos!Q32","v":{"v":2.4999094294052533,"d":"2.50x"}},{"$f":"Cálculos!U32","v":105},{"$f":"Cálculos!J32","v":{"v":9315.6,"d":"R$ 9,315.60"}},{"$f":"Cálculos!T32","v":"Saudável"}]
[null,null,"TOTAL",{"$nulls":3},{"$f":"SUMPRODUCT(G22:G29,J22:J29)","v":{"v":15971.473140000002,"d":"R$ 15,971.47"}},{"$nulls":3},{"$f":"SUM(K22:K29)","v":{"v":147801.4,"d":"R$ 147,801.40"}}]
[]
[]
[]
[null,null,"R2 — LISTA DE SERVIÇOS COM PREÇOS"]
[null,null,"Serviço","Categoria","Custo Total","Preço de Venda","Lucro Líquido","Margem Líquida %","Markup","Volume Mensal","Receita Mensal","Status"]
[null,null,{"$f":"Cálculos!C33","v":"Consultoria Empresarial"},{"$f":"Cálculos!E33","v":"Consultoria"},{"$f":"Cálculos!H33","v":{"v":2292.6136363636365,"d":"R$ 2,292.61"}},{"$f":"Cálculos!I33","v":{"v":5731.53,"d":"R$ 5,731.53"}},{"$f":"Cálculos!N33","v":{"v":1247.7081166363635,"d":"R$ 1,247.71"}},{"$f":"Cálculos!P33","v":{"v":0.21769198043739865,"d":"21.77%"}},{"$f":"Cálculos!Q33","v":{"v":2.499998215613383,"d":"2.50x"}},{"$f":"Cálculos!U33","v":6},{"$f":"Cálculos!J33","v":{"v":34389.18,"d":"R$ 34,389.18"}},{"$f":"Cálculos!T33","v":"Saudável"}]
[null,null,{"$f":"Cálculos!C34","v":"Criação de Identidade Visual"},{"$f":"Cálculos!E34","v":"Design"},{"$f":"Cálculos!H34","v":{"v":5514.147727272727,"d":"R$ 5,514.15"}},{"$f":"Cálculos!I34","v":{"v":13785.37,"d":"R$ 13,785.37"}},{"$f":"Cálculos!N34","v":{"v":3020.3602097272747,"d":"R$ 3,020.36"}},{"$f":"Cálculos!P34","v":{"v":0.21909895851379213,"d":"21.91%"}},{"$f":"Cálculos!Q34","v":{"v":2.5000001236488787,"d":"2.50x"}},{"$f":"Cálculos!U34","v":2},{"$f":"Cálculos!J34","v":{"v":27570.74,"d":"R$ 27,570.74"}},{"$f":"Cálculos!T34","v":"Saudável"}]
[null,null,{"$f":"Cálculos!C35","v":"Manutenção Predial"},{"$f":"Cálculos!E35","v":"Manutenção"},{"$f":"Cálculos!H35","v":{"v":807.0454545454545,"d":"R$ 807.05"}},{"$f":"Cálculos!I35","v":{"v":2017.61,"d":"R$ 2,017.61"}},{"$f":"Cálculos!N35","v":{"v":430.27450645454553,"d":"R$ 430.27"}},{"$f":"Cálculos!P35","v":{"v":0.21325950330071003,"d":"21.33%"}},{"$f":"Cálculos!Q35","v":{"v":2.499995494226978,"d":"2.50x"}},{"$f":"Cálculos!U35","v":18},{"$f":"Cálculos!J35","v":{"v":36316.979999999996,"d":"R$ 36,316.98"}},{"$f":"Cálculos!T35","v":"Saudável"}]
[null,null,{"$f":"Cálculos!C36","v":"Desenvolvimento de Sistema"},{"$f":"Cálculos!E36","v":"Tecnologia"},{"$f":"Cálculos!H36","v":{"v":29631.818181818184,"d":"R$ 29,631.82"}},{"$f":"Cálculos!I36","v":{"v":74079.55,"d":"R$ 74,079.55"}},{"$f":"Cálculos!N36","v":{"v":16291.110773181823,"d":"R$ 16,291.11"}},{"$f":"Cálculos!P36","v":{"v":0.21991373831484967,"d":"21.99%"}},{"$f":"Cálculos!Q36","v":{"v":2.5000001533977603,"d":"2.50x"}},{"$f":"Cálculos!U36","v":1},{"$f":"Cálculos!J36","v":{"v":74079.55,"d":"R$ 74,079.55"}},{"$f":"Cálculos!T36","v":"Saudável"}]
[null,null,{"$f":"Cálculos!C37","v":"Assessoria Contábil Mensal"},{"$f":"Cálculos!E37","v":"Contabilidade"},{"$f":"Cálculos!H37","v":{"v":1941.1363636363637,"d":"R$ 1,941.14"}},{"$f":"Cálculos!I37","v":{"v":4852.84,"d":"R$ 4,852.84"}},{"$f":"Cálculos!N37","v":{"v":1054.3097203636364,"d":"R$ 1,054.31"}},{"$f":"Cálculos!P37","v":{"v":0.21725622941692624,"d":"21.73%"}},{"$f":"Cálculos!Q37","v":{"v":2.4999995316707646,"d":"2.50x"}},{"$f":"Cálculos!U37","v":9},{"$f":"Cálculos!J37","v":{"v":43675.56,"d":"R$ 43,675.56"}},{"$f":"Cálculos!T37","v":"Saudável"}]
[null,null,{"$f":"Cálculos!C38","v":"Projeto Arquitetônico"},{"$f":"Cálculos!E38","v":"Arquitetura"},{"$f":"Cálculos!H38","v":{"v":16010.909090909092,"d":"R$ 16,010.91"}},{"$f":"Cálculos!I38","v":{"v":40027.27,"d":"R$ 40,027.27"}},{"$f":"Cálculos!N38","v":{"v":8796.201036090906,"d":"R$ 8,796.20"}},{"$f":"Cálculos!P38","v":{"v":0.21975520778936228,"d":"21.98%"}},{"$f":"Cálculos!Q38","v":{"v":2.499999829661594,"d":"2.50x"}},{"$f":"Cálculos!U38","v":1},{"$f":"Cálculos!J38","v":{"v":40027.27,"d":"R$ 40,027.27"}},{"$f":"Cálculos!T38","v":"Saudável"}]
[null,null,{"$f":"Cálculos!C39","v":"Treinamento Corporativo"},{"$f":"Cálculos!E39","v":"Treinamento"},{"$f":"Cálculos!H39","v":{"v":2584.090909090909,"d":"R$ 2,584.09"}},{"$f":"Cálculos!I39","v":{"v":6460.23,"d":"R$ 6,460.23"}},{"$f":"Cálculos!N39","v":{"v":1408.0977139090908,"d":"R$ 1,408.10"}},{"$f":"Cálculos!P39","v":{"v":0.21796402200991155,"d":"21.80%"}},{"$f":"Cálculos!Q39","v":{"v":2.500001055408971,"d":"2.50x"}},{"$f":"Cálculos!U39","v":4},{"$f":"Cálculos!J39","v":{"v":25840.92,"d":"R$ 25,840.92"}},{"$f":"Cálculos!T39","v":"Saudável"}]
[null,null,"TOTAL",{"$nulls":3},{"$f":"SUMPRODUCT(G36:G42,J36:J42)","v":{"v":61480.40038363637,"d":"R$ 61,480.40"}},{"$nulls":3},{"$f":"SUM(K36:K42)","v":{"v":281900.2,"d":"R$ 281,900.20"}}]
[]
[]
[null,null,"R3 — ITENS SEM MARGEM ADEQUADA / ABAIXO DO CUSTO"]
[null,null,"Item","Tipo","Custo Total","Preço","Lucro Líquido","Margem Líquida %","Status","Ação Recomendada"]
[null,null,{"$f":"Cálculos!C25","v":"Camiseta Premium"},{"$f":"Cálculos!D25","v":"Produto"},{"$f":"Cálculos!H25","v":{"v":46.474999999999994,"d":"R$ 46.48"}},{"$f":"Cálculos!I25","v":{"v":116.19,"d":"R$ 116.19"}},{"$f":"Cálculos!N25","v":{"v":11.774419000000002,"d":"R$ 11.77"}},{"$f":"Cálculos!P25","v":{"v":0.10133762802306569,"d":"10.13%"}},{"$f":"Cálculos!T25","v":"Saudável"},{"$f":"IF(H48<0,\"Revisar preço urgente — venda com prejuízo\",IF(H48<0.05,\"Aumentar preço ou reduzir custo\",IF(H48<0.15,\"Monitorar margem\",\"OK\")))","v":"Monitorar margem"}]
[null,null,{"$f":"Cálculos!C26","v":"Caneca Cerâmica 350ml"},{"$f":"Cálculos!D26","v":"Produto"},{"$f":"Cálculos!H26","v":{"v":29.755,"d":"R$ 29.76"}},{"$f":"Cálculos!I26","v":{"v":74.39,"d":"R$ 74.39"}},{"$f":"Cálculos!N26","v":{"v":2.5742390000000057,"d":"R$ 2.57"}},{"$f":"Cálculos!P26","v":{"v":0.034604637720123746,"d":"3.46%"}},{"$f":"Cálculos!T26","v":"Margem baixa"},"Aumentar preço ou reduzir custo"]
[null,null,{"$f":"Cálculos!C27","v":"Kit Presente Gourmet"},{"$f":"Cálculos!D27","v":"Produto"},{"$f":"Cálculos!H27","v":{"v":69.275,"d":"R$ 69.28"}},{"$f":"Cálculos!I27","v":{"v":173.19,"d":"R$ 173.19"}},{"$f":"Cálculos!N27","v":{"v":24.320119000000005,"d":"R$ 24.32"}},{"$f":"Cálculos!P27","v":{"v":0.1404244991050292,"d":"14.04%"}},{"$f":"Cálculos!T27","v":"Saudável"},"Monitorar margem"]
[null,null,{"$f":"Cálculos!C28","v":"Mochila Executiva"},{"$f":"Cálculos!D28","v":"Produto"},{"$f":"Cálculos!H28","v":{"v":106.57499999999999,"d":"R$ 106.58"}},{"$f":"Cálculos!I28","v":{"v":266.44,"d":"R$ 266.44"}},{"$f":"Cálculos!N28","v":{"v":44.84444400000001,"d":"R$ 44.84"}},{"$f":"Cálculos!P28","v":{"v":0.1683097282690287,"d":"16.83%"}},{"$f":"Cálculos!T28","v":"Saudável"},"OK"]
[null,null,{"$f":"Cálculos!C29","v":"Fone Bluetooth TWS"},{"$f":"Cálculos!D29","v":"Produto"},{"$f":"Cálculos!H29","v":{"v":93.555,"d":"R$ 93.56"}},{"$f":"Cálculos!I29","v":{"v":233.89,"d":"R$ 233.89"}},{"$f":"Cálculos!N29","v":{"v":37.680188999999984,"d":"R$ 37.68"}},{"$f":"Cálculos!P29","v":{"v":0.16110218051220654,"d":"16.11%"}},{"$f":"Cálculos!T29","v":"Saudável"},"OK"]
[null,null,{"$f":"Cálculos!C30","v":"Garrafa Térmica 1L"},{"$f":"Cálculos!D30","v":"Produto"},{"$f":"Cálculos!H30","v":{"v":56.725,"d":"R$ 56.73"}},{"$f":"Cálculos!I30","v":{"v":141.81,"d":"R$ 141.81"}},{"$f":"Cálculos!N30","v":{"v":17.411381000000006,"d":"R$ 17.41"}},{"$f":"Cálculos!P30","v":{"v":0.12277964177420496,"d":"12.28%"}},{"$f":"Cálculos!T30","v":"Saudável"},"Monitorar margem"]
[null,null,{"$f":"Cálculos!C31","v":"Agenda Executiva 2026"},{"$f":"Cálculos!D31","v":"Produto"},{"$f":"Cálculos!H31","v":{"v":38.537499999999994,"d":"R$ 38.54"}},{"$f":"Cálculos!I31","v":{"v":96.34,"d":"R$ 96.34"}},{"$f":"Cálculos!N31","v":{"v":7.402934000000002,"d":"R$ 7.40"}},{"$f":"Cálculos!P31","v":{"v":0.07684174797591864,"d":"7.68%"}},{"$f":"Cálculos!T31","v":"Saudável"},"Monitorar margem"]
[null,null,{"$f":"Cálculos!C32","v":"Boné Trucker"},{"$f":"Cálculos!D32","v":"Produto"},{"$f":"Cálculos!H32","v":{"v":35.489285714285714,"d":"R$ 35.49"}},{"$f":"Cálculos!I32","v":{"v":88.72,"d":"R$ 88.72"}},{"$f":"Cálculos!N32","v":{"v":5.725986285714285,"d":"R$ 5.73"}},{"$f":"Cálculos!P32","v":{"v":0.06453997166044054,"d":"6.45%"}},{"$f":"Cálculos!T32","v":"Saudável"},"Monitorar margem"]
[null,null,{"$f":"Cálculos!C33","v":"Consultoria Empresarial"},{"$f":"Cálculos!D33","v":"Serviço"},{"$f":"Cálculos!H33","v":{"v":2292.6136363636365,"d":"R$ 2,292.61"}},{"$f":"Cálculos!I33","v":{"v":5731.53,"d":"R$ 5,731.53"}},{"$f":"Cálculos!N33","v":{"v":1247.7081166363635,"d":"R$ 1,247.71"}},{"$f":"Cálculos!P33","v":{"v":0.21769198043739865,"d":"21.77%"}},{"$f":"Cálculos!T33","v":"Saudável"},"OK"]
[null,null,{"$f":"Cálculos!C34","v":"Criação de Identidade Visual"},{"$f":"Cálculos!D34","v":"Serviço"},{"$f":"Cálculos!H34","v":{"v":5514.147727272727,"d":"R$ 5,514.15"}},{"$f":"Cálculos!I34","v":{"v":13785.37,"d":"R$ 13,785.37"}},{"$f":"Cálculos!N34","v":{"v":3020.3602097272747,"d":"R$ 3,020.36"}},{"$f":"Cálculos!P34","v":{"v":0.21909895851379213,"d":"21.91%"}},{"$f":"Cálculos!T34","v":"Saudável"},"OK"]
[null,null,{"$f":"Cálculos!C35","v":"Manutenção Predial"},{"$f":"Cálculos!D35","v":"Serviço"},{"$f":"Cálculos!H35","v":{"v":807.0454545454545,"d":"R$ 807.05"}},{"$f":"Cálculos!I35","v":{"v":2017.61,"d":"R$ 2,017.61"}},{"$f":"Cálculos!N35","v":{"v":430.27450645454553,"d":"R$ 430.27"}},{"$f":"Cálculos!P35","v":{"v":0.21325950330071003,"d":"21.33%"}},{"$f":"Cálculos!T35","v":"Saudável"},"OK"]
[null,null,{"$f":"Cálculos!C36","v":"Desenvolvimento de Sistema"},{"$f":"Cálculos!D36","v":"Serviço"},{"$f":"Cálculos!H36","v":{"v":29631.818181818184,"d":"R$ 29,631.82"}},{"$f":"Cálculos!I36","v":{"v":74079.55,"d":"R$ 74,079.55"}},{"$f":"Cálculos!N36","v":{"v":16291.110773181823,"d":"R$ 16,291.11"}},{"$f":"Cálculos!P36","v":{"v":0.21991373831484967,"d":"21.99%"}},{"$f":"Cálculos!T36","v":"Saudável"},"OK"]
[null,null,{"$f":"Cálculos!C37","v":"Assessoria Contábil Mensal"},{"$f":"Cálculos!D37","v":"Serviço"},{"$f":"Cálculos!H37","v":{"v":1941.1363636363637,"d":"R$ 1,941.14"}},{"$f":"Cálculos!I37","v":{"v":4852.84,"d":"R$ 4,852.84"}},{"$f":"Cálculos!N37","v":{"v":1054.3097203636364,"d":"R$ 1,054.31"}},{"$f":"Cálculos!P37","v":{"v":0.21725622941692624,"d":"21.73%"}},{"$f":"Cálculos!T37","v":"Saudável"},"OK"]
[null,null,{"$f":"Cálculos!C38","v":"Projeto Arquitetônico"},{"$f":"Cálculos!D38","v":"Serviço"},{"$f":"Cálculos!H38","v":{"v":16010.909090909092,"d":"R$ 16,010.91"}},{"$f":"Cálculos!I38","v":{"v":40027.27,"d":"R$ 40,027.27"}},{"$f":"Cálculos!N38","v":{"v":8796.201036090906,"d":"R$ 8,796.20"}},{"$f":"Cálculos!P38","v":{"v":0.21975520778936228,"d":"21.98%"}},{"$f":"Cálculos!T38","v":"Saudável"},"OK"]
[null,null,{"$f":"Cálculos!C39","v":"Treinamento Corporativo"},{"$f":"Cálculos!D39","v":"Serviço"},{"$f":"Cálculos!H39","v":{"v":2584.090909090909,"d":"R$ 2,584.09"}},{"$f":"Cálculos!I39","v":{"v":6460.23,"d":"R$ 6,460.23"}},{"$f":"Cálculos!N39","v":{"v":1408.0977139090908,"d":"R$ 1,408.10"}},{"$f":"Cálculos!P39","v":{"v":0.21796402200991155,"d":"21.80%"}},{"$f":"Cálculos!T39","v":"Saudável"},"OK"]
[]
[null,null,"Itens com prejuízo:",{"$f":"Cálculos!$D$66","v":0}]
[null,null,"Itens com margem baixa:",{"$f":"Cálculos!$D$67","v":1}]
[null,null,"Itens saudáveis:",{"$f":"Cálculos!$D$68","v":14}]
[]
[]
[null,null,"R4 — RESUMO GERAL DE CUSTOS E DESPESAS"]
[null,null,"Custos fixos totais (mês)",{"$f":"Cálculos!$D$13","v":{"v":25230,"d":"R$ 25,230.00"}}]
[null,null,"Custos fixos rateáveis",{"$f":"Cálculos!$D$12","v":{"v":23730,"d":"R$ 23,730.00"}}]
[null,null,"Custos fixos não rateáveis",{"$f":"Cálculos!$D$13-Cálculos!$D$12","v":{"v":1500,"d":"R$ 1,500.00"}}]
[null,null,"Custo fixo rateado por unidade",{"$f":"Cálculos!$D$14","v":{"v":19.775,"d":"R$ 19.78"}}]
[null,null,"Custos variáveis — total unitário cadastrado",{"$f":"SUM('Custos Variáveis'!$F$8:$F$15)","v":{"v":23.25,"d":"R$ 23.25"}}]
[null,null,"Custos variáveis — total percentual",{"$f":"SUM('Custos Variáveis'!$G$8:$G$15)","v":{"v":0.2649,"d":"26.49%"}}]
[null,null,"Despesas comerciais — % sobre preço",{"$f":"Cálculos!$D$15","v":{"v":0.2949,"d":"29.49%"}}]
[null,null,"Despesas comerciais — valor fixo por unidade",{"$f":"Cálculos!$D$16","v":{"v":13.8,"d":"R$ 13.80"}}]
[null,null,"Carga tributária do regime ativo",{"$f":"Cálculos!$D$10","v":{"v":0.085,"d":"8.50%"}}]
[null,null,"Custo total estimado (mês)",{"$f":"Cálculos!$D$48","v":{"v":171880.28863636364,"d":"R$ 171,880.29"}}]
[null,null,"Custo médio por item",{"$f":"Cálculos!$D$52","v":{"v":3950.5432099567106,"d":"R$ 3,950.54"}}]
[null,null,"Folha de pagamento (salários + encargos)",{"$f":"SUMPRODUCT(Funcionários!$E$8:$E$14,1+Funcionários!$F$8:$F$14)","v":{"v":69280,"d":"R$ 69,280.00"}}]
[null,null,"Depreciação mensal de máquinas",{"$f":"SUM(Máquinas!$F$8:$F$13)","v":{"v":2032.2916666666663,"d":"R$ 2,032.29"}}]
[]
[]
[null,null,"R5 — RESUMO FINANCEIRO E RECEITAS PROJETADAS"]
[null,null,"Receita estimada mensal",{"$f":"Cálculos!$D$47","v":{"v":429701.6,"d":"R$ 429,701.60"}}]
[null,null,"Receita anualizada",{"$f":"Cálculos!$D$47*12","v":{"v":5156419.199999999,"d":"R$ 5,156,419.20"}}]
[null,null,"Lucro bruto estimado",{"$f":"Cálculos!$D$49","v":{"v":292761.425,"d":"R$ 292,761.43"}}]
[null,null,"Lucro líquido estimado",{"$f":"Cálculos!$D$50","v":{"v":77451.87352363636,"d":"R$ 77,451.87"}}]
[null,null,"Lucro líquido anualizado",{"$f":"Cálculos!$D$50*12","v":{"v":929422.4822836362,"d":"R$ 929,422.48"}}]
[null,null,"Ticket médio",{"$f":"Cálculos!$D$51","v":{"v":346.25431103948426,"d":"R$ 346.25"}}]
[null,null,"Margem líquida média",{"$f":"Cálculos!$D$53","v":{"v":0.1596586449881979,"d":"15.97%"}}]
[null,null,"Markup médio efetivo",{"$f":"Cálculos!$D$54","v":{"v":2.4999991021836485,"d":"2.50x"}}]
[null,null,"Margem de contribuição total",{"$f":"Cálculos!$D$61","v":{"v":112391.98716,"d":"R$ 112,391.99"}}]
[null,null,"MC média (%)",{"$f":"Cálculos!$D$62","v":{"v":0.2629152832237379,"d":"26.29%"}}]
[null,null,"Ponto de equilíbrio (faturamento)",{"$f":"Cálculos!$D$63","v":{"v":95962.47008025607,"d":"R$ 95,962.47"}}]
[null,null,"Rentabilidade sobre receita",{"$f":"Cálculos!$D$65","v":{"v":0.18024571824642116,"d":"18.02%"}}]
[null,null,"Tributos totais estimados",{"$f":"Cálculos!$D$47*Cálculos!$D$10","v":{"v":36524.636,"d":"R$ 36,524.64"}}]
[null,null,"Despesas comerciais totais estimadas",{"$f":"Cálculos!$D$47*Cálculos!$D$15","v":{"v":126719.00184,"d":"R$ 126,719.00"}}]
[]
[]
[null,null,"R6 — MARGEM, MARKUP E LUCRO POR CATEGORIA"]
[null,null,"Categoria","Nº Itens","Receita","Lucro Líquido Total","Margem Média %","Markup Médio","Custo Médio","Participação na Receita %"]
[null,null,"Vestuário",{"$f":"COUNTIF(Cálculos!$E$25:$E$39,$C104)","v":2},{"$f":"SUMIF(Cálculos!$E$25:$E$39,$C104,Cálculos!$J$25:$J$39)","v":{"v":34877.4,"d":"R$ 34,877.40"}},{"$f":"SUMPRODUCT((Cálculos!$E$25:$E$39=$C104)*Cálculos!$N$25:$N$39*Cálculos!$U$25:$U$39)","v":{"v":3191.6007400000003,"d":"R$ 3,191.60"}},{"$f":"IFERROR(AVERAGEIF(Cálculos!$E$25:$E$39,$C104,Cálculos!$P$25:$P$39),0)","v":{"v":0.08293879984175312,"d":"8.29%"}},{"$f":"IFERROR(AVERAGEIF(Cálculos!$E$25:$E$39,$C104,Cálculos!$Q$25:$Q$39),0)","v":{"v":2.499981610883369,"d":"2.50x"}},{"$f":"IFERROR(AVERAGEIF(Cálculos!$E$25:$E$39,$C104,Cálculos!$H$25:$H$39),0)","v":{"v":40.982142857142854,"d":"R$ 40.98"}},{"$f":"IFERROR(E104/Cálculos!$D$47,0)","v":{"v":0.08116655837446266,"d":"8.12%"}}]
[null,null,"Utilidades",{"$f":"COUNTIF(Cálculos!$E$25:$E$39,$C105)","v":2},{"$f":"SUMIF(Cálculos!$E$25:$E$39,$C105,Cálculos!$J$25:$J$39)","v":{"v":49539.7,"d":"R$ 49,539.70"}},{"$f":"SUMPRODUCT((Cálculos!$E$25:$E$39=$C105)*Cálculos!$N$25:$N$39*Cálculos!$U$25:$U$39)","v":{"v":3589.917970000003,"d":"R$ 3,589.92"}},{"$f":"IFERROR(AVERAGEIF(Cálculos!$E$25:$E$39,$C105,Cálculos!$P$25:$P$39),0)","v":{"v":0.07869213974716435,"d":"7.87%"}},{"$f":"IFERROR(AVERAGEIF(Cálculos!$E$25:$E$39,$C105,Cálculos!$Q$25:$Q$39),0)","v":{"v":2.500019973606993,"d":"2.50x"}},{"$f":"IFERROR(AVERAGEIF(Cálculos!$E$25:$E$39,$C105,Cálculos!$H$25:$H$39),0)","v":{"v":43.24,"d":"R$ 43.24"}},{"$f":"IFERROR(E105/Cálculos!$D$47,0)","v":{"v":0.11528860958395314,"d":"11.53%"}}]
[null,null,"Alimentos",{"$f":"COUNTIF(Cálculos!$E$25:$E$39,$C106)","v":1},{"$f":"SUMIF(Cálculos!$E$25:$E$39,$C106,Cálculos!$J$25:$J$39)","v":{"v":10391.4,"d":"R$ 10,391.40"}},{"$f":"SUMPRODUCT((Cálculos!$E$25:$E$39=$C106)*Cálculos!$N$25:$N$39*Cálculos!$U$25:$U$39)","v":{"v":1459.2071400000004,"d":"R$ 1,459.21"}},{"$f":"IFERROR(AVERAGEIF(Cálculos!$E$25:$E$39,$C106,Cálculos!$P$25:$P$39),0)","v":{"v":0.1404244991050292,"d":"14.04%"}},{"$f":"IFERROR(AVERAGEIF(Cálculos!$E$25:$E$39,$C106,Cálculos!$Q$25:$Q$39),0)","v":{"v":2.5000360880548538,"d":"2.50x"}},{"$f":"IFERROR(AVERAGEIF(Cálculos!$E$25:$E$39,$C106,Cálculos!$H$25:$H$39),0)","v":{"v":69.275,"d":"R$ 69.28"}},{"$f":"IFERROR(E106/Cálculos!$D$47,0)","v":{"v":0.024182828269664343,"d":"2.42%"}}]
[null,null,"Acessórios",{"$f":"COUNTIF(Cálculos!$E$25:$E$39,$C107)","v":1},{"$f":"SUMIF(Cálculos!$E$25:$E$39,$C107,Cálculos!$J$25:$J$39)","v":{"v":11989.8,"d":"R$ 11,989.80"}},{"$f":"SUMPRODUCT((Cálculos!$E$25:$E$39=$C107)*Cálculos!$N$25:$N$39*Cálculos!$U$25:$U$39)","v":{"v":2017.9999800000005,"d":"R$ 2,018.00"}},{"$f":"IFERROR(AVERAGEIF(Cálculos!$E$25:$E$39,$C107,Cálculos!$P$25:$P$39),0)","v":{"v":0.1683097282690287,"d":"16.83%"}},{"$f":"IFERROR(AVERAGEIF(Cálculos!$E$25:$E$39,$C107,Cálculos!$Q$25:$Q$39),0)","v":{"v":2.500023457658926,"d":"2.50x"}},{"$f":"IFERROR(AVERAGEIF(Cálculos!$E$25:$E$39,$C107,Cálculos!$H$25:$H$39),0)","v":{"v":106.57499999999999,"d":"R$ 106.58"}},{"$f":"IFERROR(E107/Cálculos!$D$47,0)","v":{"v":0.027902618933697245,"d":"2.79%"}}]
[null,null,"Eletrônicos",{"$f":"COUNTIF(Cálculos!$E$25:$E$39,$C108)","v":1},{"$f":"SUMIF(Cálculos!$E$25:$E$39,$C108,Cálculos!$J$25:$J$39)","v":{"v":30405.699999999997,"d":"R$ 30,405.70"}},{"$f":"SUMPRODUCT((Cálculos!$E$25:$E$39=$C108)*Cálculos!$N$25:$N$39*Cálculos!$U$25:$U$39)","v":{"v":4898.424569999998,"d":"R$ 4,898.42"}},{"$f":"IFERROR(AVERAGEIF(Cálculos!$E$25:$E$39,$C108,Cálculos!$P$25:$P$39),0)","v":{"v":0.16110218051220654,"d":"16.11%"}},{"$f":"IFERROR(AVERAGEIF(Cálculos!$E$25:$E$39,$C108,Cálculos!$Q$25:$Q$39),0)","v":{"v":2.5000267222489443,"d":"2.50x"}},{"$f":"IFERROR(AVERAGEIF(Cálculos!$E$25:$E$39,$C108,Cálculos!$H$25:$H$39),0)","v":{"v":93.555,"d":"R$ 93.56"}},{"$f":"IFERROR(E108/Cálculos!$D$47,0)","v":{"v":0.07076003440527101,"d":"7.08%"}}]
[null,null,"Papelaria",{"$f":"COUNTIF(Cálculos!$E$25:$E$39,$C109)","v":1},{"$f":"SUMIF(Cálculos!$E$25:$E$39,$C109,Cálculos!$J$25:$J$39)","v":{"v":10597.4,"d":"R$ 10,597.40"}},{"$f":"SUMPRODUCT((Cálculos!$E$25:$E$39=$C109)*Cálculos!$N$25:$N$39*Cálculos!$U$25:$U$39)","v":{"v":814.3227400000002,"d":"R$ 814.32"}},{"$f":"IFERROR(AVERAGEIF(Cálculos!$E$25:$E$39,$C109,Cálculos!$P$25:$P$39),0)","v":{"v":0.07684174797591864,"d":"7.68%"}},{"$f":"IFERROR(AVERAGEIF(Cálculos!$E$25:$E$39,$C109,Cálculos!$Q$25:$Q$39),0)","v":{"v":2.499902692182939,"d":"2.50x"}},{"$f":"IFERROR(AVERAGEIF(Cálculos!$E$25:$E$39,$C109,Cálculos!$H$25:$H$39),0)","v":{"v":38.537499999999994,"d":"R$ 38.54"}},{"$f":"IFERROR(E109/Cálculos!$D$47,0)","v":{"v":0.024662230720109025,"d":"2.47%"}}]
[null,null,"Consultoria",{"$f":"COUNTIF(Cálculos!$E$25:$E$39,$C110)","v":1},{"$f":"SUMIF(Cálculos!$E$25:$E$39,$C110,Cálculos!$J$25:$J$39)","v":{"v":34389.18,"d":"R$ 34,389.18"}},{"$f":"SUMPRODUCT((Cálculos!$E$25:$E$39=$C110)*Cálculos!$N$25:$N$39*Cálculos!$U$25:$U$39)","v":{"v":7486.248699818181,"d":"R$ 7,486.25"}},{"$f":"IFERROR(AVERAGEIF(Cálculos!$E$25:$E$39,$C110,Cálculos!$P$25:$P$39),0)","v":{"v":0.21769198043739865,"d":"21.77%"}},{"$f":"IFERROR(AVERAGEIF(Cálculos!$E$25:$E$39,$C110,Cálculos!$Q$25:$Q$39),0)","v":{"v":2.499998215613383,"d":"2.50x"}},{"$f":"IFERROR(AVERAGEIF(Cálculos!$E$25:$E$39,$C110,Cálculos!$H$25:$H$39),0)","v":{"v":2292.6136363636365,"d":"R$ 2,292.61"}},{"$f":"IFERROR(E110/Cálculos!$D$47,0)","v":{"v":0.08003037456690876,"d":"8.00%"}}]
[null,null,"Design",{"$f":"COUNTIF(Cálculos!$E$25:$E$39,$C111)","v":1},{"$f":"SUMIF(Cálculos!$E$25:$E$39,$C111,Cálculos!$J$25:$J$39)","v":{"v":27570.74,"d":"R$ 27,570.74"}},{"$f":"SUMPRODUCT((Cálculos!$E$25:$E$39=$C111)*Cálculos!$N$25:$N$39*Cálculos!$U$25:$U$39)","v":{"v":6040.720419454549,"d":"R$ 6,040.72"}},{"$f":"IFERROR(AVERAGEIF(Cálculos!$E$25:$E$39,$C111,Cálculos!$P$25:$P$39),0)","v":{"v":0.21909895851379213,"d":"21.91%"}},{"$f":"IFERROR(AVERAGEIF(Cálculos!$E$25:$E$39,$C111,Cálculos!$Q$25:$Q$39),0)","v":{"v":2.5000001236488787,"d":"2.50x"}},{"$f":"IFERROR(AVERAGEIF(Cálculos!$E$25:$E$39,$C111,Cálculos!$H$25:$H$39),0)","v":{"v":5514.147727272727,"d":"R$ 5,514.15"}},{"$f":"IFERROR(E111/Cálculos!$D$47,0)","v":{"v":0.06416252580860765,"d":"6.42%"}}]
[null,null,"Manutenção",{"$f":"COUNTIF(Cálculos!$E$25:$E$39,$C112)","v":1},{"$f":"SUMIF(Cálculos!$E$25:$E$39,$C112,Cálculos!$J$25:$J$39)","v":{"v":36316.979999999996,"d":"R$ 36,316.98"}},{"$f":"SUMPRODUCT((Cálculos!$E$25:$E$39=$C112)*Cálculos!$N$25:$N$39*Cálculos!$U$25:$U$39)","v":{"v":7744.94111618182,"d":"R$ 7,744.94"}},{"$f":"IFERROR(AVERAGEIF(Cálculos!$E$25:$E$39,$C112,Cálculos!$P$25:$P$39),0)","v":{"v":0.21325950330071003,"d":"21.33%"}},{"$f":"IFERROR(AVERAGEIF(Cálculos!$E$25:$E$39,$C112,Cálculos!$Q$25:$Q$39),0)","v":{"v":2.499995494226978,"d":"2.50x"}},{"$f":"IFERROR(AVERAGEIF(Cálculos!$E$25:$E$39,$C112,Cálculos!$H$25:$H$39),0)","v":{"v":807.0454545454545,"d":"R$ 807.05"}},{"$f":"IFERROR(E112/Cálculos!$D$47,0)","v":{"v":0.08451674371238087,"d":"8.45%"}}]
[null,null,"Tecnologia",{"$f":"COUNTIF(Cálculos!$E$25:$E$39,$C113)","v":1},{"$f":"SUMIF(Cálculos!$E$25:$E$39,$C113,Cálculos!$J$25:$J$39)","v":{"v":74079.55,"d":"R$ 74,079.55"}},{"$f":"SUMPRODUCT((Cálculos!$E$25:$E$39=$C113)*Cálculos!$N$25:$N$39*Cálculos!$U$25:$U$39)","v":{"v":16291.110773181823,"d":"R$ 16,291.11"}},{"$f":"IFERROR(AVERAGEIF(Cálculos!$E$25:$E$39,$C113,Cálculos!$P$25:$P$39),0)","v":{"v":0.21991373831484967,"d":"21.99%"}},{"$f":"IFERROR(AVERAGEIF(Cálculos!$E$25:$E$39,$C113,Cálculos!$Q$25:$Q$39),0)","v":{"v":2.5000001533977603,"d":"2.50x"}},{"$f":"IFERROR(AVERAGEIF(Cálculos!$E$25:$E$39,$C113,Cálculos!$H$25:$H$39),0)","v":{"v":29631.818181818184,"d":"R$ 29,631.82"}},{"$f":"IFERROR(E113/Cálculos!$D$47,0)","v":{"v":0.1723976592128119,"d":"17.24%"}}]
[null,null,"Contabilidade",{"$f":"COUNTIF(Cálculos!$E$25:$E$39,$C114)","v":1},{"$f":"SUMIF(Cálculos!$E$25:$E$39,$C114,Cálculos!$J$25:$J$39)","v":{"v":43675.56,"d":"R$ 43,675.56"}},{"$f":"SUMPRODUCT((Cálculos!$E$25:$E$39=$C114)*Cálculos!$N$25:$N$39*Cálculos!$U$25:$U$39)","v":{"v":9488.787483272728,"d":"R$ 9,488.79"}},{"$f":"IFERROR(AVERAGEIF(Cálculos!$E$25:$E$39,$C114,Cálculos!$P$25:$P$39),0)","v":{"v":0.21725622941692624,"d":"21.73%"}},{"$f":"IFERROR(AVERAGEIF(Cálculos!$E$25:$E$39,$C114,Cálculos!$Q$25:$Q$39),0)","v":{"v":2.4999995316707646,"d":"2.50x"}},{"$f":"IFERROR(AVERAGEIF(Cálculos!$E$25:$E$39,$C114,Cálculos!$H$25:$H$39),0)","v":{"v":1941.1363636363637,"d":"R$ 1,941.14"}},{"$f":"IFERROR(E114/Cálculos!$D$47,0)","v":{"v":0.10164160431331883,"d":"10.16%"}}]
[null,null,"Arquitetura",{"$f":"COUNTIF(Cálculos!$E$25:$E$39,$C115)","v":1},{"$f":"SUMIF(Cálculos!$E$25:$E$39,$C115,Cálculos!$J$25:$J$39)","v":{"v":40027.27,"d":"R$ 40,027.27"}},{"$f":"SUMPRODUCT((Cálculos!$E$25:$E$39=$C115)*Cálculos!$N$25:$N$39*Cálculos!$U$25:$U$39)","v":{"v":8796.201036090906,"d":"R$ 8,796.20"}},{"$f":"IFERROR(AVERAGEIF(Cálculos!$E$25:$E$39,$C115,Cálculos!$P$25:$P$39),0)","v":{"v":0.21975520778936228,"d":"21.98%"}},{"$f":"IFERROR(AVERAGEIF(Cálculos!$E$25:$E$39,$C115,Cálculos!$Q$25:$Q$39),0)","v":{"v":2.499999829661594,"d":"2.50x"}},{"$f":"IFERROR(AVERAGEIF(Cálculos!$E$25:$E$39,$C115,Cálculos!$H$25:$H$39),0)","v":{"v":16010.909090909092,"d":"R$ 16,010.91"}},{"$f":"IFERROR(E115/Cálculos!$D$47,0)","v":{"v":0.09315131710005269,"d":"9.32%"}}]
[null,null,"Treinamento",{"$f":"COUNTIF(Cálculos!$E$25:$E$39,$C116)","v":1},{"$f":"SUMIF(Cálculos!$E$25:$E$39,$C116,Cálculos!$J$25:$J$39)","v":{"v":25840.92,"d":"R$ 25,840.92"}},{"$f":"SUMPRODUCT((Cálculos!$E$25:$E$39=$C116)*Cálculos!$N$25:$N$39*Cálculos!$U$25:$U$39)","v":{"v":5632.390855636363,"d":"R$ 5,632.39"}},{"$f":"IFERROR(AVERAGEIF(Cálculos!$E$25:$E$39,$C116,Cálculos!$P$25:$P$39),0)","v":{"v":0.21796402200991155,"d":"21.80%"}},{"$f":"IFERROR(AVERAGEIF(Cálculos!$E$25:$E$39,$C116,Cálculos!$Q$25:$Q$39),0)","v":{"v":2.500001055408971,"d":"2.50x"}},{"$f":"IFERROR(AVERAGEIF(Cálculos!$E$25:$E$39,$C116,Cálculos!$H$25:$H$39),0)","v":{"v":2584.090909090909,"d":"R$ 2,584.09"}},{"$f":"IFERROR(E116/Cálculos!$D$47,0)","v":{"v":0.06013689499876193,"d":"6.01%"}}]
[]
[null,null,"TOTAL",null,{"$f":"SUM(E104:E116)","v":{"v":429701.6,"d":"R$ 429,701.60"}},{"$f":"SUM(F104:F116)","v":{"v":77451.87352363636,"d":"R$ 77,451.87"}},{"$nulls":3},{"$f":"SUM(J104:J116)","v":{"v":1,"d":"100.00%"}}]
[]
[]
[null,null,"R7 — IMPACTO DOS TRIBUTOS E DAS DESPESAS COMERCIAIS NO PREÇO"]
[null,null,"Item","Preço de Venda","Custo (%)","Tributos (%)","Desp. Comerciais (%)","Lucro (%)","Tributos R$","Desp. Comerciais R$","Total de Deduções"]
[null,null,{"$f":"Cálculos!C25","v":"Camiseta Premium"},{"$f":"Cálculos!I25","v":{"v":116.19,"d":"R$ 116.19"}},{"$f":"IFERROR(Cálculos!H25/Cálculos!I25,0)","v":{"v":0.39999139340735,"d":"40.00%"}},{"$f":"IFERROR(Cálculos!K25/Cálculos!I25,0)","v":{"v":0.085,"d":"8.50%"}},{"$f":"IFERROR(Cálculos!L25/Cálculos!I25,0)","v":{"v":0.4136709785695843,"d":"41.37%"}},{"$f":"Cálculos!P25","v":{"v":0.10133762802306569,"d":"10.13%"}},{"$f":"Cálculos!K25","v":{"v":9.87615,"d":"R$ 9.88"}},{"$f":"Cálculos!L25","v":{"v":48.064431,"d":"R$ 48.06"}},{"$f":"I123+J123","v":{"v":57.940581,"d":"R$ 57.94"}}]
[null,null,{"$f":"Cálculos!C26","v":"Caneca Cerâmica 350ml"},{"$f":"Cálculos!I26","v":{"v":74.39,"d":"R$ 74.39"}},{"$f":"IFERROR(Cálculos!H26/Cálculos!I26,0)","v":{"v":0.39998655733297483,"d":"40.00%"}},{"$f":"IFERROR(Cálculos!K26/Cálculos!I26,0)","v":{"v":0.085,"d":"8.50%"}},{"$f":"IFERROR(Cálculos!L26/Cálculos!I26,0)","v":{"v":0.48040880494690147,"d":"48.04%"}},{"$f":"Cálculos!P26","v":{"v":0.034604637720123746,"d":"3.46%"}},{"$f":"Cálculos!K26","v":{"v":6.323150000000001,"d":"R$ 6.32"}},{"$f":"Cálculos!L26","v":{"v":35.737611,"d":"R$ 35.74"}},{"v":42.060761,"d":"R$ 42.06"}]
[null,null,{"$f":"Cálculos!C27","v":"Kit Presente Gourmet"},{"$f":"Cálculos!I27","v":{"v":173.19,"d":"R$ 173.19"}},{"$f":"IFERROR(Cálculos!H27/Cálculos!I27,0)","v":{"v":0.39999422599457246,"d":"40.00%"}},{"$f":"IFERROR(Cálculos!K27/Cálculos!I27,0)","v":{"v":0.085,"d":"8.50%"}},{"$f":"IFERROR(Cálculos!L27/Cálculos!I27,0)","v":{"v":0.3745812749003984,"d":"37.46%"}},{"$f":"Cálculos!P27","v":{"v":0.1404244991050292,"d":"14.04%"}},{"$f":"Cálculos!K27","v":{"v":14.721150000000002,"d":"R$ 14.72"}},{"$f":"Cálculos!L27","v":{"v":64.87373099999999,"d":"R$ 64.87"}},{"v":79.59488099999999,"d":"R$ 79.59"}]
[null,null,{"$f":"Cálculos!C28","v":"Mochila Executiva"},{"$f":"Cálculos!I28","v":{"v":266.44,"d":"R$ 266.44"}},{"$f":"IFERROR(Cálculos!H28/Cálculos!I28,0)","v":{"v":0.3999962468097883,"d":"40.00%"}},{"$f":"IFERROR(Cálculos!K28/Cálculos!I28,0)","v":{"v":0.085,"d":"8.50%"}},{"$f":"IFERROR(Cálculos!L28/Cálculos!I28,0)","v":{"v":0.346694024921183,"d":"34.67%"}},{"$f":"Cálculos!P28","v":{"v":0.1683097282690287,"d":"16.83%"}},{"$f":"Cálculos!K28","v":{"v":22.6474,"d":"R$ 22.65"}},{"$f":"Cálculos!L28","v":{"v":92.373156,"d":"R$ 92.37"}},{"v":115.020556,"d":"R$ 115.02"}]
[null,null,{"$f":"Cálculos!C29","v":"Fone Bluetooth TWS"},{"$f":"Cálculos!I29","v":{"v":233.89,"d":"R$ 233.89"}},{"$f":"IFERROR(Cálculos!H29/Cálculos!I29,0)","v":{"v":0.39999572448586945,"d":"40.00%"}},{"$f":"IFERROR(Cálculos!K29/Cálculos!I29,0)","v":{"v":0.085,"d":"8.50%"}},{"$f":"IFERROR(Cálculos!L29/Cálculos!I29,0)","v":{"v":0.353902095001924,"d":"35.39%"}},{"$f":"Cálculos!P29","v":{"v":0.16110218051220654,"d":"16.11%"}},{"$f":"Cálculos!K29","v":{"v":19.88065,"d":"R$ 19.88"}},{"$f":"Cálculos!L29","v":{"v":82.77416099999999,"d":"R$ 82.77"}},{"v":102.654811,"d":"R$ 102.65"}]
[null,null,{"$f":"Cálculos!C30","v":"Garrafa Térmica 1L"},{"$f":"Cálculos!I30","v":{"v":141.81,"d":"R$ 141.81"}},{"$f":"IFERROR(Cálculos!H30/Cálculos!I30,0)","v":{"v":0.4000070516888795,"d":"40.00%"}},{"$f":"IFERROR(Cálculos!K30/Cálculos!I30,0)","v":{"v":0.085,"d":"8.50%"}},{"$f":"IFERROR(Cálculos!L30/Cálculos!I30,0)","v":{"v":0.3922133065369156,"d":"39.22%"}},{"$f":"Cálculos!P30","v":{"v":0.12277964177420496,"d":"12.28%"}},{"$f":"Cálculos!K30","v":{"v":12.05385,"d":"R$ 12.05"}},{"$f":"Cálculos!L30","v":{"v":55.619769000000005,"d":"R$ 55.62"}},{"v":67.673619,"d":"R$ 67.67"}]
[null,null,{"$f":"Cálculos!C31","v":"Agenda Executiva 2026"},{"$f":"Cálculos!I31","v":{"v":96.34,"d":"R$ 96.34"}},{"$f":"IFERROR(Cálculos!H31/Cálculos!I31,0)","v":{"v":0.40001556985675724,"d":"40.00%"}},{"$f":"IFERROR(Cálculos!K31/Cálculos!I31,0)","v":{"v":0.085,"d":"8.50%"}},{"$f":"IFERROR(Cálculos!L31/Cálculos!I31,0)","v":{"v":0.4381426821673241,"d":"43.81%"}},{"$f":"Cálculos!P31","v":{"v":0.07684174797591864,"d":"7.68%"}},{"$f":"Cálculos!K31","v":{"v":8.1889,"d":"R$ 8.19"}},{"$f":"Cálculos!L31","v":{"v":42.210666,"d":"R$ 42.21"}},{"v":50.39956600000001,"d":"R$ 50.40"}]
[null,null,{"$f":"Cálculos!C32","v":"Boné Trucker"},{"$f":"Cálculos!I32","v":{"v":88.72,"d":"R$ 88.72"}},{"$f":"IFERROR(Cálculos!H32/Cálculos!I32,0)","v":{"v":0.4000144918201726,"d":"40.00%"}},{"$f":"IFERROR(Cálculos!K32/Cálculos!I32,0)","v":{"v":0.085,"d":"8.50%"}},{"$f":"IFERROR(Cálculos!L32/Cálculos!I32,0)","v":{"v":0.4504455365193868,"d":"45.04%"}},{"$f":"Cálculos!P32","v":{"v":0.06453997166044054,"d":"6.45%"}},{"$f":"Cálculos!K32","v":{"v":7.541200000000001,"d":"R$ 7.54"}},{"$f":"Cálculos!L32","v":{"v":39.963528,"d":"R$ 39.96"}},{"v":47.504728,"d":"R$ 47.50"}]
[null,null,{"$f":"Cálculos!C33","v":"Consultoria Empresarial"},{"$f":"Cálculos!I33","v":{"v":5731.53,"d":"R$ 5,731.53"}},{"$f":"IFERROR(Cálculos!H33/Cálculos!I33,0)","v":{"v":0.40000028550206257,"d":"40.00%"}},{"$f":"IFERROR(Cálculos!K33/Cálculos!I33,0)","v":{"v":0.085,"d":"8.50%"}},{"$f":"IFERROR(Cálculos!L33/Cálculos!I33,0)","v":{"v":0.2973077340605388,"d":"29.73%"}},{"$f":"Cálculos!P33","v":{"v":0.21769198043739865,"d":"21.77%"}},{"$f":"Cálculos!K33","v":{"v":487.18005,"d":"R$ 487.18"}},{"$f":"Cálculos!L33","v":{"v":1704.0281969999999,"d":"R$ 1,704.03"}},{"v":2191.208247,"d":"R$ 2,191.21"}]
[null,null,{"$f":"Cálculos!C34","v":"Criação de Identidade Visual"},{"$f":"Cálculos!I34","v":{"v":13785.37,"d":"R$ 13,785.37"}},{"$f":"IFERROR(Cálculos!H34/Cálculos!I34,0)","v":{"v":0.3999999802161804,"d":"40.00%"}},{"$f":"IFERROR(Cálculos!K34/Cálculos!I34,0)","v":{"v":0.085,"d":"8.50%"}},{"$f":"IFERROR(Cálculos!L34/Cálculos!I34,0)","v":{"v":0.2959010612700276,"d":"29.59%"}},{"$f":"Cálculos!P34","v":{"v":0.21909895851379213,"d":"21.91%"}},{"$f":"Cálculos!K34","v":{"v":1171.75645,"d":"R$ 1,171.76"}},{"$f":"Cálculos!L34","v":{"v":4079.105613,"d":"R$ 4,079.11"}},{"v":5250.8620630000005,"d":"R$ 5,250.86"}]
[null,null,{"$f":"Cálculos!C35","v":"Manutenção Predial"},{"$f":"Cálculos!I35","v":{"v":2017.61,"d":"R$ 2,017.61"}},{"$f":"IFERROR(Cálculos!H35/Cálculos!I35,0)","v":{"v":0.4000007209249828,"d":"40.00%"}},{"$f":"IFERROR(Cálculos!K35/Cálculos!I35,0)","v":{"v":0.085,"d":"8.50%"}},{"$f":"IFERROR(Cálculos!L35/Cálculos!I35,0)","v":{"v":0.30173977577430716,"d":"30.17%"}},{"$f":"Cálculos!P35","v":{"v":0.21325950330071003,"d":"21.33%"}},{"$f":"Cálculos!K35","v":{"v":171.49685,"d":"R$ 171.50"}},{"$f":"Cálculos!L35","v":{"v":608.7931889999999,"d":"R$ 608.79"}},{"v":780.2900389999999,"d":"R$ 780.29"}]
[null,null,{"$f":"Cálculos!C36","v":"Desenvolvimento de Sistema"},{"$f":"Cálculos!I36","v":{"v":74079.55,"d":"R$ 74,079.55"}},{"$f":"IFERROR(Cálculos!H36/Cálculos!I36,0)","v":{"v":0.39999997545635985,"d":"40.00%"}},{"$f":"IFERROR(Cálculos!K36/Cálculos!I36,0)","v":{"v":0.085,"d":"8.50%"}},{"$f":"IFERROR(Cálculos!L36/Cálculos!I36,0)","v":{"v":0.2950862862287905,"d":"29.51%"}},{"$f":"Cálculos!P36","v":{"v":0.21991373831484967,"d":"21.99%"}},{"$f":"Cálculos!K36","v":{"v":6296.761750000001,"d":"R$ 6,296.76"}},{"$f":"Cálculos!L36","v":{"v":21859.859295,"d":"R$ 21,859.86"}},{"v":28156.621045,"d":"R$ 28,156.62"}]
[null,null,{"$f":"Cálculos!C37","v":"Assessoria Contábil Mensal"},{"$f":"Cálculos!I37","v":{"v":4852.84,"d":"R$ 4,852.84"}},{"$f":"IFERROR(Cálculos!H37/Cálculos!I37,0)","v":{"v":0.40000007493269174,"d":"40.00%"}},{"$f":"IFERROR(Cálculos!K37/Cálculos!I37,0)","v":{"v":0.085,"d":"8.50%"}},{"$f":"IFERROR(Cálculos!L37/Cálculos!I37,0)","v":{"v":0.297743695650382,"d":"29.77%"}},{"$f":"Cálculos!P37","v":{"v":0.21725622941692624,"d":"21.73%"}},{"$f":"Cálculos!K37","v":{"v":412.49140000000006,"d":"R$ 412.49"}},{"$f":"Cálculos!L37","v":{"v":1444.9025159999999,"d":"R$ 1,444.90"}},{"v":1857.393916,"d":"R$ 1,857.39"}]
[null,null,{"$f":"Cálculos!C38","v":"Projeto Arquitetônico"},{"$f":"Cálculos!I38","v":{"v":40027.27,"d":"R$ 40,027.27"}},{"$f":"IFERROR(Cálculos!H38/Cálculos!I38,0)","v":{"v":0.4000000272541468,"d":"40.00%"}},{"$f":"IFERROR(Cálculos!K38/Cálculos!I38,0)","v":{"v":0.085,"d":"8.50%"}},{"$f":"IFERROR(Cálculos!L38/Cálculos!I38,0)","v":{"v":0.2952447649564909,"d":"29.52%"}},{"$f":"Cálculos!P38","v":{"v":0.21975520778936228,"d":"21.98%"}},{"$f":"Cálculos!K38","v":{"v":3402.31795,"d":"R$ 3,402.32"}},{"$f":"Cálculos!L38","v":{"v":11817.841922999998,"d":"R$ 11,817.84"}},{"v":15220.159872999999,"d":"R$ 15,220.16"}]
[null,null,{"$f":"Cálculos!C39","v":"Treinamento Corporativo"},{"$f":"Cálculos!I39","v":{"v":6460.23,"d":"R$ 6,460.23"}},{"$f":"IFERROR(Cálculos!H39/Cálculos!I39,0)","v":{"v":0.39999983113463594,"d":"40.00%"}},{"$f":"IFERROR(Cálculos!K39/Cálculos!I39,0)","v":{"v":0.085,"d":"8.50%"}},{"$f":"IFERROR(Cálculos!L39/Cálculos!I39,0)","v":{"v":0.29703614685545254,"d":"29.70%"}},{"$f":"Cálculos!P39","v":{"v":0.21796402200991155,"d":"21.80%"}},{"$f":"Cálculos!K39","v":{"v":549.11955,"d":"R$ 549.12"}},{"$f":"Cálculos!L39","v":{"v":1918.921827,"d":"R$ 1,918.92"}},{"v":2468.041377,"d":"R$ 2,468.04"}]
[]
[]
[null,null,"R8 — COMPARATIVO ENTRE MÉTODOS DE PRECIFICAÇÃO"]
[null,null,"Produto","Markup","Margem","Lucro Desejado","Comércio","Indústria","E-commerce","Delivery","Artesanato","Diferença %","Método de Maior Preço"]
[null,null,{"$f":"'Comparativo Métodos'!C8","v":"Camiseta Premium"},{"$f":"'Comparativo Métodos'!E8","v":{"v":116.19,"d":"R$ 116.19"}},{"$f":"'Comparativo Métodos'!F8","v":{"v":162.86,"d":"R$ 162.86"}},{"$f":"'Comparativo Métodos'!G8","v":{"v":115.94,"d":"R$ 115.94"}},{"$f":"'Comparativo Métodos'!H8","v":{"v":64,"d":"R$ 64.00"}},{"$f":"'Comparativo Métodos'!I8","v":{"v":198.39,"d":"R$ 198.39"}},{"$f":"'Comparativo Métodos'!J8","v":{"v":140.14,"d":"R$ 140.14"}},{"$f":"'Comparativo Métodos'!K8","v":{"v":126.04,"d":"R$ 126.04"}},{"$f":"'Comparativo Métodos'!L8","v":{"v":140.15,"d":"R$ 140.15"}},{"$f":"'Comparativo Métodos'!O8","v":{"v":2.09984375,"d":"209.98%"}},{"$f":"'Comparativo Métodos'!P8","v":"Indústria"}]
[null,null,{"$f":"'Comparativo Métodos'!C9","v":"Caneca Cerâmica 350ml"},{"$f":"'Comparativo Métodos'!E9","v":{"v":74.39,"d":"R$ 74.39"}},{"$f":"'Comparativo Métodos'!F9","v":{"v":117.68,"d":"R$ 117.68"}},{"$f":"'Comparativo Métodos'!G9","v":{"v":82.24,"d":"R$ 82.24"}},{"$f":"'Comparativo Métodos'!H9","v":{"v":24.25,"d":"R$ 24.25"}},{"$f":"'Comparativo Métodos'!I9","v":{"v":129.78,"d":"R$ 129.78"}},{"$f":"'Comparativo Métodos'!J9","v":{"v":101.27,"d":"R$ 101.27"}},{"$f":"'Comparativo Métodos'!K9","v":{"v":83.71,"d":"R$ 83.71"}},{"$f":"'Comparativo Métodos'!L9","v":{"v":69.92,"d":"R$ 69.92"}},{"$f":"'Comparativo Métodos'!O9","v":{"v":4.351752577319588,"d":"435.18%"}},{"$f":"'Comparativo Métodos'!P9","v":"Indústria"}]
[null,null,{"$f":"'Comparativo Métodos'!C10","v":"Kit Presente Gourmet"},{"$f":"'Comparativo Métodos'!E10","v":{"v":173.19,"d":"R$ 173.19"}},{"$f":"'Comparativo Métodos'!F10","v":{"v":224.47,"d":"R$ 224.47"}},{"$f":"'Comparativo Métodos'!G10","v":{"v":161.9,"d":"R$ 161.90"}},{"$f":"'Comparativo Métodos'!H10","v":{"v":120,"d":"R$ 120.00"}},{"$f":"'Comparativo Métodos'!I10","v":{"v":308.66,"d":"R$ 308.66"}},{"$f":"'Comparativo Métodos'!J10","v":{"v":193.15,"d":"R$ 193.15"}},{"$f":"'Comparativo Métodos'!K10","v":{"v":183.76,"d":"R$ 183.76"}},{"$f":"'Comparativo Métodos'!L10","v":{"v":209.92,"d":"R$ 209.92"}},{"$f":"'Comparativo Métodos'!O10","v":{"v":1.572166666666667,"d":"157.22%"}},{"$f":"'Comparativo Métodos'!P10","v":"Indústria"}]
[null,null,{"$f":"'Comparativo Métodos'!C11","v":"Mochila Executiva"},{"$f":"'Comparativo Métodos'!E11","v":{"v":266.44,"d":"R$ 266.44"}},{"$f":"'Comparativo Métodos'!F11","v":{"v":325.25,"d":"R$ 325.25"}},{"$f":"'Comparativo Métodos'!G11","v":{"v":237.08,"d":"R$ 237.08"}},{"$f":"'Comparativo Métodos'!H11","v":{"v":210,"d":"R$ 210.00"}},{"$f":"'Comparativo Métodos'!I11","v":{"v":461.55,"d":"R$ 461.55"}},{"$f":"'Comparativo Métodos'!J11","v":{"v":279.88,"d":"R$ 279.88"}},{"$f":"'Comparativo Métodos'!K11","v":{"v":278.19,"d":"R$ 278.19"}},{"$f":"'Comparativo Métodos'!L11","v":{"v":364.51,"d":"R$ 364.51"}},{"$f":"'Comparativo Métodos'!O11","v":{"v":1.197857142857143,"d":"119.79%"}},{"$f":"'Comparativo Métodos'!P11","v":"Indústria"}]
[null,null,{"$f":"'Comparativo Métodos'!C12","v":"Fone Bluetooth TWS"},{"$f":"'Comparativo Métodos'!E12","v":{"v":233.89,"d":"R$ 233.89"}},{"$f":"'Comparativo Métodos'!F12","v":{"v":290.07,"d":"R$ 290.07"}},{"$f":"'Comparativo Métodos'!G12","v":{"v":210.85,"d":"R$ 210.85"}},{"$f":"'Comparativo Métodos'!H12","v":{"v":178.83,"d":"R$ 178.83"}},{"$f":"'Comparativo Métodos'!I12","v":{"v":322.47,"d":"R$ 322.47"}},{"$f":"'Comparativo Métodos'!J12","v":{"v":249.6,"d":"R$ 249.60"}},{"$f":"'Comparativo Métodos'!K12","v":{"v":245.23,"d":"R$ 245.23"}},{"$f":"'Comparativo Métodos'!L12","v":{"v":178.65,"d":"R$ 178.65"}},{"$f":"'Comparativo Métodos'!O12","v":{"v":0.8050377833753151,"d":"80.50%"}},{"$f":"'Comparativo Métodos'!P12","v":"Indústria"}]
[null,null,{"$f":"'Comparativo Métodos'!C13","v":"Garrafa Térmica 1L"},{"$f":"'Comparativo Métodos'!E13","v":{"v":141.81,"d":"R$ 141.81"}},{"$f":"'Comparativo Métodos'!F13","v":{"v":190.56,"d":"R$ 190.56"}},{"$f":"'Comparativo Métodos'!G13","v":{"v":136.6,"d":"R$ 136.60"}},{"$f":"'Comparativo Métodos'!H13","v":{"v":90.83,"d":"R$ 90.83"}},{"$f":"'Comparativo Métodos'!I13","v":{"v":214.68,"d":"R$ 214.68"}},{"$f":"'Comparativo Métodos'!J13","v":{"v":163.97,"d":"R$ 163.97"}},{"$f":"'Comparativo Métodos'!K13","v":{"v":151.99,"d":"R$ 151.99"}},{"$f":"'Comparativo Métodos'!L13","v":{"v":122.41,"d":"R$ 122.41"}},{"$f":"'Comparativo Métodos'!O13","v":{"v":1.363536276560608,"d":"136.35%"}},{"$f":"'Comparativo Métodos'!P13","v":"Indústria"}]
[null,null,{"$f":"'Comparativo Métodos'!C14","v":"Agenda Executiva 2026"},{"$f":"'Comparativo Métodos'!E14","v":{"v":96.34,"d":"R$ 96.34"}},{"$f":"'Comparativo Métodos'!F14","v":{"v":141.41,"d":"R$ 141.41"}},{"$f":"'Comparativo Métodos'!G14","v":{"v":99.93,"d":"R$ 99.93"}},{"$f":"'Comparativo Métodos'!H14","v":{"v":46.25,"d":"R$ 46.25"}},{"$f":"'Comparativo Métodos'!I14","v":{"v":145.69,"d":"R$ 145.69"}},{"$f":"'Comparativo Métodos'!J14","v":{"v":121.69,"d":"R$ 121.69"}},{"$f":"'Comparativo Métodos'!K14","v":{"v":105.94,"d":"R$ 105.94"}},{"$f":"'Comparativo Métodos'!L14","v":{"v":68.87,"d":"R$ 68.87"}},{"$f":"'Comparativo Métodos'!O14","v":{"v":2.150054054054054,"d":"215.01%"}},{"$f":"'Comparativo Métodos'!P14","v":"Indústria"}]
[null,null,{"$f":"'Comparativo Métodos'!C15","v":"Boné Trucker"},{"$f":"'Comparativo Métodos'!E15","v":{"v":88.72,"d":"R$ 88.72"}},{"$f":"'Comparativo Métodos'!F15","v":{"v":133.18,"d":"R$ 133.18"}},{"$f":"'Comparativo Métodos'!G15","v":{"v":93.79,"d":"R$ 93.79"}},{"$f":"'Comparativo Métodos'!H15","v":{"v":38.39,"d":"R$ 38.39"}},{"$f":"'Comparativo Métodos'!I15","v":{"v":152.37,"d":"R$ 152.37"}},{"$f":"'Comparativo Métodos'!J15","v":{"v":114.6,"d":"R$ 114.60"}},{"$f":"'Comparativo Métodos'!K15","v":{"v":98.23,"d":"R$ 98.23"}},{"$f":"'Comparativo Métodos'!L15","v":{"v":84.66,"d":"R$ 84.66"}},{"$f":"'Comparativo Métodos'!O15","v":{"v":2.9690023443605105,"d":"296.90%"}},{"$f":"'Comparativo Métodos'!P15","v":"Indústria"}]
[]
[]
[null,null,"R9 — RANKING DE LUCRATIVIDADE E ITENS COM MENOR MARGEM"]
[null,null,"#","Mais Lucrativos (Produtos)","Lucro Líquido",null,"#","Mais Lucrativos (Serviços)","Lucro Líquido"]
[null,null,1,{"$f":"Cálculos!C74","v":"Mochila Executiva"},{"$f":"Cálculos!D74","v":{"v":44.84444400000001,"d":"R$ 44.84"}},null,1,{"$f":"Cálculos!G74","v":"Desenvolvimento de Sistema"},{"$f":"Cálculos!H74","v":{"v":16291.110773181823,"d":"R$ 16,291.11"}}]
[null,null,2,{"$f":"Cálculos!C75","v":"Fone Bluetooth TWS"},{"$f":"Cálculos!D75","v":{"v":37.680188999999984,"d":"R$ 37.68"}},null,2,{"$f":"Cálculos!G75","v":"Projeto Arquitetônico"},{"$f":"Cálculos!H75","v":{"v":8796.201036090906,"d":"R$ 8,796.20"}}]
[null,null,3,{"$f":"Cálculos!C76","v":"Kit Presente Gourmet"},{"$f":"Cálculos!D76","v":{"v":24.320119000000005,"d":"R$ 24.32"}},null,3,{"$f":"Cálculos!G76","v":"Criação de Identidade Visual"},{"$f":"Cálculos!H76","v":{"v":3020.3602097272747,"d":"R$ 3,020.36"}}]
[null,null,4,{"$f":"Cálculos!C77","v":"Garrafa Térmica 1L"},{"$f":"Cálculos!D77","v":{"v":17.411381000000006,"d":"R$ 17.41"}},null,4,{"$f":"Cálculos!G77","v":"Treinamento Corporativo"},{"$f":"Cálculos!H77","v":{"v":1408.0977139090908,"d":"R$ 1,408.10"}}]
[null,null,5,{"$f":"Cálculos!C78","v":"Camiseta Premium"},{"$f":"Cálculos!D78","v":{"v":11.774419000000002,"d":"R$ 11.77"}},null,5,{"$f":"Cálculos!G78","v":"Consultoria Empresarial"},{"$f":"Cálculos!H78","v":{"v":1247.7081166363635,"d":"R$ 1,247.71"}}]
[null,null,6,{"$f":"Cálculos!C79","v":"Agenda Executiva 2026"},{"$f":"Cálculos!D79","v":{"v":7.402934000000002,"d":"R$ 7.40"}},null,6,{"$f":"Cálculos!G79","v":"Assessoria Contábil Mensal"},{"$f":"Cálculos!H79","v":{"v":1054.3097203636364,"d":"R$ 1,054.31"}}]
[null,null,7,{"$f":"Cálculos!C80","v":"Boné Trucker"},{"$f":"Cálculos!D80","v":{"v":5.725986285714285,"d":"R$ 5.73"}},null,7,{"$f":"Cálculos!G80","v":"Manutenção Predial"},{"$f":"Cálculos!H80","v":{"v":430.27450645454553,"d":"R$ 430.27"}}]
[null,null,8,{"$f":"Cálculos!C81","v":"Caneca Cerâmica 350ml"},{"$f":"Cálculos!D81","v":{"v":2.5742390000000057,"d":"R$ 2.57"}}]
[]
[]
[null,null,"#","Itens com Menor Margem Líquida","Margem %","Lucro Líquido","Status"]
[null,null,1,{"$f":"IFERROR(INDEX(Cálculos!$C$25:$C$39,MATCH(SMALL(Cálculos!$P$25:$P$39,1),Cálculos!$P$25:$P$39,0)),\"-\")","v":"Caneca Cerâmica 350ml"},{"$f":"IFERROR(SMALL(Cálculos!$P$25:$P$39,1),0)","v":{"v":0.034604637720123746,"d":"3.46%"}},{"$f":"IFERROR(INDEX(Cálculos!$N$25:$N$39,MATCH(SMALL(Cálculos!$P$25:$P$39,1),Cálculos!$P$25:$P$39,0)),0)","v":{"v":2.5742390000000057,"d":"R$ 2.57"}},{"$f":"IFERROR(INDEX(Cálculos!$T$25:$T$39,MATCH(SMALL(Cálculos!$P$25:$P$39,1),Cálculos!$P$25:$P$39,0)),\"-\")","v":"Margem baixa"}]
[null,null,2,{"$f":"IFERROR(INDEX(Cálculos!$C$25:$C$39,MATCH(SMALL(Cálculos!$P$25:$P$39,2),Cálculos!$P$25:$P$39,0)),\"-\")","v":"Boné Trucker"},{"$f":"IFERROR(SMALL(Cálculos!$P$25:$P$39,2),0)","v":{"v":0.06453997166044054,"d":"6.45%"}},{"$f":"IFERROR(INDEX(Cálculos!$N$25:$N$39,MATCH(SMALL(Cálculos!$P$25:$P$39,2),Cálculos!$P$25:$P$39,0)),0)","v":{"v":5.725986285714285,"d":"R$ 5.73"}},{"$f":"IFERROR(INDEX(Cálculos!$T$25:$T$39,MATCH(SMALL(Cálculos!$P$25:$P$39,2),Cálculos!$P$25:$P$39,0)),\"-\")","v":"Saudável"}]
[null,null,3,{"$f":"IFERROR(INDEX(Cálculos!$C$25:$C$39,MATCH(SMALL(Cálculos!$P$25:$P$39,3),Cálculos!$P$25:$P$39,0)),\"-\")","v":"Agenda Executiva 2026"},{"$f":"IFERROR(SMALL(Cálculos!$P$25:$P$39,3),0)","v":{"v":0.07684174797591864,"d":"7.68%"}},{"$f":"IFERROR(INDEX(Cálculos!$N$25:$N$39,MATCH(SMALL(Cálculos!$P$25:$P$39,3),Cálculos!$P$25:$P$39,0)),0)","v":{"v":7.402934000000002,"d":"R$ 7.40"}},{"$f":"IFERROR(INDEX(Cálculos!$T$25:$T$39,MATCH(SMALL(Cálculos!$P$25:$P$39,3),Cálculos!$P$25:$P$39,0)),\"-\")","v":"Saudável"}]
[null,null,4,{"$f":"IFERROR(INDEX(Cálculos!$C$25:$C$39,MATCH(SMALL(Cálculos!$P$25:$P$39,4),Cálculos!$P$25:$P$39,0)),\"-\")","v":"Camiseta Premium"},{"$f":"IFERROR(SMALL(Cálculos!$P$25:$P$39,4),0)","v":{"v":0.10133762802306569,"d":"10.13%"}},{"$f":"IFERROR(INDEX(Cálculos!$N$25:$N$39,MATCH(SMALL(Cálculos!$P$25:$P$39,4),Cálculos!$P$25:$P$39,0)),0)","v":{"v":11.774419000000002,"d":"R$ 11.77"}},{"$f":"IFERROR(INDEX(Cálculos!$T$25:$T$39,MATCH(SMALL(Cálculos!$P$25:$P$39,4),Cálculos!$P$25:$P$39,0)),\"-\")","v":"Saudável"}]
[null,null,5,{"$f":"IFERROR(INDEX(Cálculos!$C$25:$C$39,MATCH(SMALL(Cálculos!$P$25:$P$39,5),Cálculos!$P$25:$P$39,0)),\"-\")","v":"Garrafa Térmica 1L"},{"$f":"IFERROR(SMALL(Cálculos!$P$25:$P$39,5),0)","v":{"v":0.12277964177420496,"d":"12.28%"}},{"$f":"IFERROR(INDEX(Cálculos!$N$25:$N$39,MATCH(SMALL(Cálculos!$P$25:$P$39,5),Cálculos!$P$25:$P$39,0)),0)","v":{"v":17.411381000000006,"d":"R$ 17.41"}},{"$f":"IFERROR(INDEX(Cálculos!$T$25:$T$39,MATCH(SMALL(Cálculos!$P$25:$P$39,5),Cálculos!$P$25:$P$39,0)),\"-\")","v":"Saudável"}]
[]
[]
[null,null,"R10 — PAINEL CONSOLIDADO: EQUILÍBRIO, MC, ROI, DESCONTOS, CENÁRIOS E TRIBUTOS"]
[null,null,"Ponto de equilíbrio — quantidade (produtos)",{"$f":"'Ponto de Equilíbrio'!$D$13","v":{"v":651.2360309651265,"d":"651"}}]
[null,null,"Ponto de equilíbrio — faturamento",{"$f":"'Ponto de Equilíbrio'!$D$14","v":{"v":96950.32197481708,"d":"R$ 96,950.32"}}]
[null,null,"Margem de segurança (%)",{"$f":"'Ponto de Equilíbrio'!$D$17","v":{"v":0.7743775634653977,"d":"77.44%"}}]
[null,null,"Grau de alavancagem operacional",{"$f":"'Ponto de Equilíbrio'!$D$18","v":{"v":1.4511203157106434,"d":"1.45"}}]
[null,null,"MC unitária média (produtos)",{"$f":"'Ponto de Equilíbrio'!$D$11","v":{"v":38.74171391071429,"d":"R$ 38.74"}}]
[null,null,"MC média (%)",{"$f":"Cálculos!$D$62","v":{"v":0.2629152832237379,"d":"26.29%"}}]
[null,null,"Itens com MC classificada como Crítica",{"$f":"COUNTIF('Margem Contribuição'!$K$8:$K$22,\"Crítica\")","v":0}]
[null,null,"ROI médio da carteira de investimentos",{"$f":"IFERROR(AVERAGE(ROI!$I$8:$I$14),0)","v":{"v":1.6274920389208316,"d":"162.75%"}}]
[null,null,"Melhor ROI",{"$f":"IFERROR(INDEX(ROI!$C$8:$C$14,MATCH(MAX(ROI!$I$8:$I$14),ROI!$I$8:$I$14,0)),\"-\")","v":"Máquina de corte laser"}]
[null,null,"Payback médio (meses)",{"$f":"IFERROR(AVERAGE(ROI!$K$8:$K$14),0)","v":{"v":9.687088092800437,"d":"9.69"}}]
[null,null,"Desconto máximo médio sem prejuízo",{"$f":"IFERROR(AVERAGE(Descontos!$D$27:$D$41),0)","v":{"v":0.2574724157203644,"d":"25.75%"}}]
[null,null,"Itens que já operam com prejuízo no desconto simulado",{"$f":"COUNTIF(Descontos!$K$8:$K$22,\"<0\")","v":3}]
[null,null,"Lucro — cenário Atual",{"$f":"'Simulador Cenários'!$D$23","v":{"v":66223.02838707787,"d":"R$ 66,223.03"}}]
[null,null,"Lucro — cenário Otimista",{"$f":"'Simulador Cenários'!$E$23","v":{"v":154752.4937817208,"d":"R$ 154,752.49"}}]
[null,null,"Lucro — cenário Pessimista",{"$f":"'Simulador Cenários'!$F$23","v":{"v":-4949.835595167446,"d":"(R$ 4,949.84)"}}]
[null,null,"Lucro — cenário Personalizado",{"$f":"'Simulador Cenários'!$G$23","v":{"v":92301.8976034733,"d":"R$ 92,301.90"}}]
[null,null,"Regime tributário mais vantajoso",{"$f":"'Simulação Tributária'!$D$21","v":"Serviços - Simples"}]
[null,null,"Economia tributária potencial (mês)",{"$f":"'Simulação Tributária'!$D$22","v":{"v":10742.539999999979,"d":"R$ 10,742.54"}}]
[null,null,"Economia tributária potencial (ano)",{"$f":"'Simulação Tributária'!$D$22*12","v":{"v":128910.47999999975,"d":"R$ 128,910.48"}}]
[null,null,"Perda de margem em 12x (vs. à vista)",{"$f":"IFERROR(Parcelamentos!$J$15-Parcelamentos!$J$26,0)","v":{"v":0.18075928978065986,"d":"18.08%"}}]