{"text_format":"3","workbook":"xlsx","n_sheets":10,"sheets":["Instruções","CAD_MATERIAS","PLANO_ESTUDOS","REG_ESTUDOS","LEITURAS","REVISOES","METAS","CALCULOS","RELATORIOS","LISTAS"],"not_rendered":{"images":6,"macros":1},"read":"whole","date_system":"1900"}

{"sheet":"Instruções","index":0,"n_rows":79,"n_cols":11,"rows_kept":79}
["http://authenticator.sapphirebusinesstech.com:8080/access/v1/validate"]
["123456789",{"$nulls":3},"Any use for this file other than sample using and technical analysis without authorization is stricly prohibited and protected by copyright"]
["contact@sapphirebusinesstech.com",{"$nulls":3},"Qualquer uso desse arquivo sem autorização outro que uso de exemplo e análise técnica é extritamente proibida e protegida por direitos autorais."]
[{"$nulls":4},"Cualquier uso de este archivo sin autorización que no sea para fines de ejemplo o análisis técnico está estrictamente prohibido y está protegido por derechos de autor."]
[200]
[]
[{"$f":"IF(A12=\"\",0,TODAY()-A12)","v":0}]
[]
[]
[null,null,"Início",{"$f":"HYPERLINK(\"#CAD_MATERIAS!C2\",\"Cadastros\")","v":"Cadastros"},{"$f":"HYPERLINK(\"#PLANO_ESTUDOS!C2\",\"Plano\")","v":"Plano"},{"$f":"HYPERLINK(\"#REG_ESTUDOS!C2\",\"Registros\")","v":"Registros"},{"$f":"HYPERLINK(\"#LEITURAS!C2\",\"Leituras\")","v":"Leituras"},{"$f":"HYPERLINK(\"#REVISOES!C2\",\"Revisões\")","v":"Revisões"},{"$f":"HYPERLINK(\"#METAS!C2\",\"Metas\")","v":"Metas"},{"$f":"HYPERLINK(\"#RELATORIOS!C2\",\"Relatórios\")","v":"Relatórios"},"Instruções"]
[null,null,"🎓 CONTROLE DE ESTUDOS"]
[null,null,"Painel principal — visão geral e acesso rápido"]
[]
[]
[null,null,"📝 RESUMO RÁPIDO",{"$nulls":4},"📊 INDICADORES DO PERÍODO"]
[null,null,"Matérias cadastradas",{"$f":"CALCULOS!D8","v":1},"Horas no mês",{"$f":"CALCULOS!D11","v":{"v":0,"d":"0.0"}},null,"Livros em leitura",{"$f":"CALCULOS!D15","v":0},"Livros concluídos",{"$f":"CALCULOS!D16","v":0}]
[null,null,"Matérias ativas",{"$f":"CALCULOS!D9","v":0},"Horas acumuladas",{"$f":"CALCULOS!D10","v":{"v":0,"d":"0.0"}},null,"Páginas lidas total",{"$f":"CALCULOS!D17","v":0},"% médio leitura",{"$f":"CALCULOS!D18","v":{"v":0,"d":"0%"}}]
[null,null,"Registros de estudo",{"$f":"CALCULOS!D13","v":13},"Horas na semana",{"$f":"CALCULOS!D12","v":{"v":0,"d":"0.0"}},null,"Revisões pendentes",{"$f":"CALCULOS!D19","v":8},"Meta semanal?",{"$f":"IF(CALCULOS!D12>=10,\"Sim ✅\",\"Não ❌\")","v":"Não ❌"}]
[]
[]
{"$rows_left_out":60}
{"sheet":"CAD_MATERIAS","index":1,"n_rows":17,"n_cols":13,"rows_kept":17,"hidden":true}
[null,null,"Início",{"$f":"HYPERLINK(\"#CAD_MATERIAS!C2\",\"Cadastros\")","v":"Cadastros"},{"$f":"HYPERLINK(\"#PLANO_ESTUDOS!C2\",\"Plano\")","v":"Plano"},{"$f":"HYPERLINK(\"#REG_ESTUDOS!C2\",\"Registros\")","v":"Registros"},{"$f":"HYPERLINK(\"#LEITURAS!C2\",\"Leituras\")","v":"Leituras"},{"$f":"HYPERLINK(\"#REVISOES!C2\",\"Revisões\")","v":"Revisões"},{"$f":"HYPERLINK(\"#METAS!C2\",\"Metas\")","v":"Metas"},{"$f":"HYPERLINK(\"#RELATORIOS!C2\",\"Relatórios\")","v":"Relatórios"},"Instruções"]
[null,null,"📚 CADASTRO DE MATÉRIAS"]
[]
[null,null,"Cadastre todas as matérias ou áreas de estudo. Use as listas suspensas quando disponíveis."]
[]
[]
[null,null,"ID_Matéria","Matéria","Categoria","Objetivo","Prioridade","Horas_Meta_Total","Data_Início","Prazo_Conclusão","Status","Observações","Dias_para_Prazo"]
[null,null,1,{"$nulls":9},{"$f":"IF(J8=\"\",\"\",J8-TODAY())","v":""}]
[null,null,2,{"$nulls":9},{"$f":"IF(J9=\"\",\"\",J9-TODAY())","v":""}]
[null,null,3,{"$nulls":9},""]
[null,null,4,{"$nulls":9},""]
[null,null,5,{"$nulls":9},""]
[null,null,6,{"$nulls":9},""]
[null,null,7,{"$nulls":9},""]
[null,null,8,{"$nulls":9},""]
[null,null,9,{"$nulls":9},""]
[null,null,10,{"$nulls":9},""]

{"sheet":"PLANO_ESTUDOS","index":2,"n_rows":17,"n_cols":16,"rows_kept":17,"hidden":true}
[null,null,"Início",{"$f":"HYPERLINK(\"#CAD_MATERIAS!C2\",\"Cadastros\")","v":"Cadastros"},{"$f":"HYPERLINK(\"#PLANO_ESTUDOS!C2\",\"Plano\")","v":"Plano"},{"$f":"HYPERLINK(\"#REG_ESTUDOS!C2\",\"Registros\")","v":"Registros"},{"$f":"HYPERLINK(\"#LEITURAS!C2\",\"Leituras\")","v":"Leituras"},{"$f":"HYPERLINK(\"#REVISOES!C2\",\"Revisões\")","v":"Revisões"},{"$f":"HYPERLINK(\"#METAS!C2\",\"Metas\")","v":"Metas"},{"$f":"HYPERLINK(\"#RELATORIOS!C2\",\"Relatórios\")","v":"Relatórios"},"Instruções"]
[null,null,"📅 PLANO DE ESTUDOS"]
[]
[null,null,"Planeje seus estudos por atividade e tópico. Acompanhe prazos e progresso."]
[]
[]
[null,null,"ID_Plano","Matéria","Tópico","Subtópico","Data_Planejada","Horas_Previstas","Prioridade","Tipo_Estudo","Status","%_Conclusão","Observações","Situação_Prazo","Horas_Realizadas","Desvio_Horas"]
[null,null,1,{"$nulls":10},{"$f":"IF(K8=\"Concluído\",\"Concluído\",IF(G8<TODAY(),\"Atrasado\",IF(G8=TODAY(),\"Hoje\",\"No Prazo\")))","v":"Atrasado"},{"$f":"SUMIFS(REG_ESTUDOS!$H:$H,REG_ESTUDOS!$E:$E,D8,REG_ESTUDOS!$F:$F,E8)","v":{"v":0,"d":"0.00"}},{"$f":"IF(H8=\"\",\"\",O8-H8)","v":""}]
[null,null,2,{"$nulls":10},{"$f":"IF(K9=\"Concluído\",\"Concluído\",IF(G9<TODAY(),\"Atrasado\",IF(G9=TODAY(),\"Hoje\",\"No Prazo\")))","v":"Atrasado"},{"$f":"SUMIFS(REG_ESTUDOS!$H:$H,REG_ESTUDOS!$E:$E,D9,REG_ESTUDOS!$F:$F,E9)","v":{"v":0,"d":"0.00"}},{"$f":"IF(H9=\"\",\"\",O9-H9)","v":""}]
[null,null,3,{"$nulls":10},"Atrasado",{"$f":"SUMIFS(REG_ESTUDOS!$H:$H,REG_ESTUDOS!$E:$E,D10,REG_ESTUDOS!$F:$F,E10)","v":{"v":0,"d":"0.00"}},""]
[null,null,4,{"$nulls":10},"Atrasado",{"$f":"SUMIFS(REG_ESTUDOS!$H:$H,REG_ESTUDOS!$E:$E,D11,REG_ESTUDOS!$F:$F,E11)","v":{"v":0,"d":"0.00"}},""]
[null,null,5,{"$nulls":10},"Atrasado",{"$f":"SUMIFS(REG_ESTUDOS!$H:$H,REG_ESTUDOS!$E:$E,D12,REG_ESTUDOS!$F:$F,E12)","v":{"v":0,"d":"0.00"}},""]
[null,null,6,{"$nulls":10},"Atrasado",{"$f":"SUMIFS(REG_ESTUDOS!$H:$H,REG_ESTUDOS!$E:$E,D13,REG_ESTUDOS!$F:$F,E13)","v":{"v":0,"d":"0.00"}},""]
[null,null,7,{"$nulls":10},"Atrasado",{"$f":"SUMIFS(REG_ESTUDOS!$H:$H,REG_ESTUDOS!$E:$E,D14,REG_ESTUDOS!$F:$F,E14)","v":{"v":0,"d":"0.00"}},""]
[null,null,8,{"$nulls":10},"Atrasado",{"$f":"SUMIFS(REG_ESTUDOS!$H:$H,REG_ESTUDOS!$E:$E,D15,REG_ESTUDOS!$F:$F,E15)","v":{"v":0,"d":"0.00"}},""]
[null,null,9,{"$nulls":10},"Atrasado",{"$f":"SUMIFS(REG_ESTUDOS!$H:$H,REG_ESTUDOS!$E:$E,D16,REG_ESTUDOS!$F:$F,E16)","v":{"v":0,"d":"0.00"}},""]
[null,null,10,{"$nulls":10},"Atrasado",{"$f":"SUMIFS(REG_ESTUDOS!$H:$H,REG_ESTUDOS!$E:$E,D17,REG_ESTUDOS!$F:$F,E17)","v":{"v":0,"d":"0.00"}},""]

{"sheet":"REG_ESTUDOS","index":3,"n_rows":17,"n_cols":14,"rows_kept":17,"hidden":true}
[null,null,"Início",{"$f":"HYPERLINK(\"#CAD_MATERIAS!C2\",\"Cadastros\")","v":"Cadastros"},{"$f":"HYPERLINK(\"#PLANO_ESTUDOS!C2\",\"Plano\")","v":"Plano"},{"$f":"HYPERLINK(\"#REG_ESTUDOS!C2\",\"Registros\")","v":"Registros"},{"$f":"HYPERLINK(\"#LEITURAS!C2\",\"Leituras\")","v":"Leituras"},{"$f":"HYPERLINK(\"#REVISOES!C2\",\"Revisões\")","v":"Revisões"},{"$f":"HYPERLINK(\"#METAS!C2\",\"Metas\")","v":"Metas"},{"$f":"HYPERLINK(\"#RELATORIOS!C2\",\"Relatórios\")","v":"Relatórios"},"Instruções"]
[null,null,"✍️ REGISTRO DE ESTUDOS"]
[]
[null,null,"Registre diariamente o que você estudou. Esse é o coração da planilha."]
[]
[]
[null,null,"ID_Registro","Data","Matéria","Tópico","Tipo_Estudo","Horas_Estudadas","Nível_Foco","Atividade_Concluída","Observações","Semana_Ano","Mês_Ano","Pont_Produtividade"]
[null,null,1,{"$nulls":8},{"$f":"IF(D8=\"\",\"\",TEXT(D8,\"yyyy\")&\"-S\"&WEEKNUM(D8,2))","v":""},{"$f":"IF(D8=\"\",\"\",TEXT(D8,\"mm/yyyy\"))","v":""},{"$f":"IF(I8=\"Alto\",3,IF(I8=\"Médio\",2,IF(I8=\"Baixo\",1,\"\")))","v":""}]
[null,null,2,{"$nulls":8},{"$f":"IF(D9=\"\",\"\",TEXT(D9,\"yyyy\")&\"-S\"&WEEKNUM(D9,2))","v":""},{"$f":"IF(D9=\"\",\"\",TEXT(D9,\"mm/yyyy\"))","v":""},{"$f":"IF(I9=\"Alto\",3,IF(I9=\"Médio\",2,IF(I9=\"Baixo\",1,\"\")))","v":""}]
[null,null,3,{"$nulls":8},"","",""]
[null,null,4,{"$nulls":8},"","",""]
[null,null,5,{"$nulls":8},"","",""]
[null,null,6,{"$nulls":8},"","",""]
[null,null,7,{"$nulls":8},"","",""]
[null,null,8,{"$nulls":8},"","",""]
[null,null,9,{"$nulls":8},"","",""]
[null,null,10,{"$nulls":8},"","",""]

{"sheet":"LEITURAS","index":4,"n_rows":17,"n_cols":17,"rows_kept":17,"hidden":true}
[null,null,"Início",{"$f":"HYPERLINK(\"#CAD_MATERIAS!C2\",\"Cadastros\")","v":"Cadastros"},{"$f":"HYPERLINK(\"#PLANO_ESTUDOS!C2\",\"Plano\")","v":"Plano"},{"$f":"HYPERLINK(\"#REG_ESTUDOS!C2\",\"Registros\")","v":"Registros"},{"$f":"HYPERLINK(\"#LEITURAS!C2\",\"Leituras\")","v":"Leituras"},{"$f":"HYPERLINK(\"#REVISOES!C2\",\"Revisões\")","v":"Revisões"},{"$f":"HYPERLINK(\"#METAS!C2\",\"Metas\")","v":"Metas"},{"$f":"HYPERLINK(\"#RELATORIOS!C2\",\"Relatórios\")","v":"Relatórios"},"Instruções"]
[null,null,"📖 CONTROLE DE LEITURAS"]
[]
[null,null,"Acompanhe livros, apostilas, e-books e artigos. Atualize páginas lidas regularmente."]
[]
[]
[null,null,"ID_Leitura","Título","Autor","Tipo_Material","Tema","Total_Páginas","Páginas_Lidas","Data_Início","Prazo_Término","Status","Nota","Aprendizado_Principal","%_Concluído","Páginas_Restantes","Situação_Prazo"]
[null,null,1,{"$nulls":11},{"$f":"IF(H8=0,0,I8/H8)","v":{"v":0,"d":"0%"}},{"$f":"IF(H8=\"\",\"\",H8-I8)","v":""},{"$f":"IF(L8=\"Concluído\",\"Concluído\",IF(K8<TODAY(),\"Atrasado\",IF(K8=TODAY(),\"Hoje\",\"No Prazo\")))","v":"Atrasado"}]
[null,null,2,{"$nulls":11},{"$f":"IF(H9=0,0,I9/H9)","v":{"v":0,"d":"0%"}},{"$f":"IF(H9=\"\",\"\",H9-I9)","v":""},{"$f":"IF(L9=\"Concluído\",\"Concluído\",IF(K9<TODAY(),\"Atrasado\",IF(K9=TODAY(),\"Hoje\",\"No Prazo\")))","v":"Atrasado"}]
[null,null,3,{"$nulls":11},{"v":0,"d":"0%"},"","Atrasado"]
[null,null,4,{"$nulls":11},{"v":0,"d":"0%"},"","Atrasado"]
[null,null,5,{"$nulls":11},{"v":0,"d":"0%"},"","Atrasado"]
[null,null,6,{"$nulls":11},{"v":0,"d":"0%"},"","Atrasado"]
[null,null,7,{"$nulls":11},{"v":0,"d":"0%"},"","Atrasado"]
[null,null,8,{"$nulls":11},{"v":0,"d":"0%"},"","Atrasado"]
[null,null,9,{"$nulls":11},{"v":0,"d":"0%"},"","Atrasado"]
[null,null,10,{"$nulls":11},{"v":0,"d":"0%"},"","Atrasado"]

{"sheet":"REVISOES","index":5,"n_rows":17,"n_cols":15,"rows_kept":17,"hidden":true}
[null,null,"Início",{"$f":"HYPERLINK(\"#CAD_MATERIAS!C2\",\"Cadastros\")","v":"Cadastros"},{"$f":"HYPERLINK(\"#PLANO_ESTUDOS!C2\",\"Plano\")","v":"Plano"},{"$f":"HYPERLINK(\"#REG_ESTUDOS!C2\",\"Registros\")","v":"Registros"},{"$f":"HYPERLINK(\"#LEITURAS!C2\",\"Leituras\")","v":"Leituras"},{"$f":"HYPERLINK(\"#REVISOES!C2\",\"Revisões\")","v":"Revisões"},{"$f":"HYPERLINK(\"#METAS!C2\",\"Metas\")","v":"Metas"},{"$f":"HYPERLINK(\"#RELATORIOS!C2\",\"Relatórios\")","v":"Relatórios"},"Instruções"]
[null,null,"🔄 CONTROLE DE REVISÕES"]
[]
[null,null,"Acompanhe revisões espaçadas para memorização. Revisão 1=1 dia, Revisão 2=7 dias, Revisão 3=30 dias."]
[]
[]
[null,null,"ID_Revisão","Matéria","Assunto","Data_Estudo_Original","Revisão_1","Revisão_2","Revisão_3","Status_R1","Status_R2","Status_R3","Observações","Próxima_Revisão","Situação"]
[null,null,1,{"$nulls":3},{"$f":"IF(F8=\"\",\"\",F8+1)","v":""},{"$f":"IF(F8=\"\",\"\",F8+7)","v":""},{"$f":"IF(F8=\"\",\"\",F8+30)","v":""},{"$nulls":4},{"$f":"IF(J8<>\"Feita\",G8,IF(K8<>\"Feita\",H8,IF(L8<>\"Feita\",I8,\"\")))","v":""},{"$f":"IF(N8=\"\",\"Concluído\",IF(N8<TODAY(),\"Atrasado\",IF(N8=TODAY(),\"Hoje\",\"Agendado\")))","v":"Concluído"}]
[null,null,2,{"$nulls":3},{"$f":"IF(F9=\"\",\"\",F9+1)","v":""},{"$f":"IF(F9=\"\",\"\",F9+7)","v":""},{"$f":"IF(F9=\"\",\"\",F9+30)","v":""},{"$nulls":4},{"$f":"IF(J9<>\"Feita\",G9,IF(K9<>\"Feita\",H9,IF(L9<>\"Feita\",I9,\"\")))","v":""},{"$f":"IF(N9=\"\",\"Concluído\",IF(N9<TODAY(),\"Atrasado\",IF(N9=TODAY(),\"Hoje\",\"Agendado\")))","v":"Concluído"}]
[null,null,3,{"$nulls":10},{"$f":"IF(J10<>\"Feita\",G10,IF(K10<>\"Feita\",H10,IF(L10<>\"Feita\",I10,\"\")))","v":"00:00:00"},{"$f":"IF(N10=\"\",\"Concluído\",IF(N10<TODAY(),\"Atrasado\",IF(N10=TODAY(),\"Hoje\",\"Agendado\")))","v":"Atrasado"}]
[null,null,4,{"$nulls":10},"00:00:00","Atrasado"]
[null,null,5,{"$nulls":10},"00:00:00","Atrasado"]
[null,null,6,{"$nulls":10},"00:00:00","Atrasado"]
[null,null,7,{"$nulls":10},"00:00:00","Atrasado"]
[null,null,8,{"$nulls":10},"00:00:00","Atrasado"]
[null,null,9,{"$nulls":10},"00:00:00","Atrasado"]
[null,null,10,{"$nulls":10},"00:00:00","Atrasado"]

{"sheet":"METAS","index":6,"n_rows":12,"n_cols":11,"rows_kept":12,"hidden":true}
[null,null,"Início",{"$f":"HYPERLINK(\"#CAD_MATERIAS!C2\",\"Cadastros\")","v":"Cadastros"},{"$f":"HYPERLINK(\"#PLANO_ESTUDOS!C2\",\"Plano\")","v":"Plano"},{"$f":"HYPERLINK(\"#REG_ESTUDOS!C2\",\"Registros\")","v":"Registros"},{"$f":"HYPERLINK(\"#LEITURAS!C2\",\"Leituras\")","v":"Leituras"},{"$f":"HYPERLINK(\"#REVISOES!C2\",\"Revisões\")","v":"Revisões"},{"$f":"HYPERLINK(\"#METAS!C2\",\"Metas\")","v":"Metas"},{"$f":"HYPERLINK(\"#RELATORIOS!C2\",\"Relatórios\")","v":"Relatórios"},"Instruções"]
[null,null,"🎯 METAS DE DESEMPENHO"]
[]
[null,null,"Defina e acompanhe suas metas pessoais de estudo. Resultados são calculados automaticamente."]
[]
[]
[null,null,"ID_Meta","Tipo_Meta","Descrição","Período","Meta_Alvo","Realizado","%_Atingido","Status","Observações"]
[null,null,1,"Horas de Estudo","Horas de estudo no mês","Mensal",{"v":40,"d":"40.00"},{"$f":"SUMIFS(REG_ESTUDOS!$H:$H,REG_ESTUDOS!$M:$M,TEXT(TODAY(),\"mm/yyyy\"))","v":{"v":0,"d":"0.00"}},{"$f":"IF(G8=0,0,H8/G8)","v":{"v":0,"d":"0%"}},{"$f":"IF(I8>=1,\"Meta Atingida\",IF(I8>=0.8,\"Próxima\",\"Abaixo\"))","v":"Abaixo"}]
[null,null,2,"Livros Concluídos","Livros concluídos no total","Mensal",{"v":2,"d":"2.00"},{"$f":"COUNTIFS(LEITURAS!$L:$L,\"Concluído\")","v":{"v":0,"d":"0.00"}},{"$f":"IF(G9=0,0,H9/G9)","v":{"v":0,"d":"0%"}},{"$f":"IF(I9>=1,\"Meta Atingida\",IF(I9>=0.8,\"Próxima\",\"Abaixo\"))","v":"Abaixo"}]
[null,null,3,{"$nulls":5},{"$f":"IF(G10=0,0,H10/G10)","v":{"v":0,"d":"0%"}},{"$f":"IF(I10>=1,\"Meta Atingida\",IF(I10>=0.8,\"Próxima\",\"Abaixo\"))","v":"Abaixo"}]
[null,null,4,{"$nulls":5},{"$f":"IF(G11=0,0,H11/G11)","v":{"v":0,"d":"0%"}},{"$f":"IF(I11>=1,\"Meta Atingida\",IF(I11>=0.8,\"Próxima\",\"Abaixo\"))","v":"Abaixo"}]
[null,null,5,{"$nulls":5},{"$f":"IF(G12=0,0,H12/G12)","v":{"v":0,"d":"0%"}},{"$f":"IF(I12>=1,\"Meta Atingida\",IF(I12>=0.8,\"Próxima\",\"Abaixo\"))","v":"Abaixo"}]

{"sheet":"CALCULOS","index":7,"n_rows":19,"n_cols":23,"rows_kept":19,"hidden":true}
[]
[null,null,"⚙️ CÁLCULOS CONSOLIDADOS"]
[]
[null,null,"Aba de cálculos internos. NÃO ALTERAR. Alimenta RELATORIOS e INICIO."]
[]
[null,null,"BLOCO 1 – INDICADORES GERAIS",{"$nulls":3},"BLOCO 2 – RESUMO POR MATÉRIA",{"$nulls":5},"BLOCO 3 – RESUMO DE LEITURAS",{"$nulls":5},"BLOCO 4 – METAS"]
[null,null,"Indicador","Valor",null,null,"Matéria","Horas Estudadas","Qtde Registros","Plano Concluído %","Status",null,"Livro","% Concluído","Páginas Lidas","Status","Nota",null,"Meta","Alvo","Realizado","%","Situação"]
[null,null,"Total de matérias cadastradas",{"$f":"COUNTA(CAD_MATERIAS!$D:$D)-1","v":{"v":1,"d":"1.00"}},null,null,{"$f":"IF(CAD_MATERIAS!D8=\"\",\"\",CAD_MATERIAS!D8)","v":""},{"$f":"IF(G8=\"\",\"\",SUMIFS(REG_ESTUDOS!$H:$H,REG_ESTUDOS!$E:$E,G8))","v":""},{"$f":"IF(G8=\"\",\"\",COUNTIFS(REG_ESTUDOS!$E:$E,G8))","v":""},{"$f":"IF(G8=\"\",\"\",IFERROR(AVERAGEIF(PLANO_ESTUDOS!$D:$D,G8,PLANO_ESTUDOS!$L:$L),0))","v":""},{"$f":"IF(G8=\"\",\"\",IF(H8=0,\"Sem estudo\",IF(J8>=0.8,\"Avançado\",IF(J8>=0.4,\"Intermediário\",\"Inicial\"))))","v":""},null,{"$f":"IF(LEITURAS!D8=\"\",\"\",LEITURAS!D8)","v":""},{"$f":"IFERROR(VLOOKUP(M8,LEITURAS!$D:$Q,12,FALSE),0)","v":{"v":0,"d":"0%"}},{"$f":"IFERROR(VLOOKUP(M8,LEITURAS!$D:$Q,6,FALSE),0)","v":0},{"$f":"IFERROR(VLOOKUP(M8,LEITURAS!$D:$Q,9,FALSE),\"\")","v":""},{"$f":"IFERROR(VLOOKUP(M8,LEITURAS!$D:$Q,10,FALSE),\"\")","v":""},null,{"$f":"IF(METAS!E8=\"\",\"\",METAS!E8)","v":"Horas de estudo no mês"},{"$f":"IF(S8=\"\",\"\",METAS!G8)","v":40},{"$f":"IF(S8=\"\",\"\",METAS!H8)","v":0},{"$f":"IF(S8=\"\",\"\",METAS!I8)","v":{"v":0,"d":"0%"}},{"$f":"IF(S8=\"\",\"\",METAS!J8)","v":"Abaixo"}]
[null,null,"Matérias ativas",{"$f":"COUNTIFS(CAD_MATERIAS!$K:$K,\"Em Andamento\")","v":{"v":0,"d":"0.00"}},null,null,"BLOCO 2 – RESUMO POR MATÉRIA",{"$nulls":5},"BLOCO 3 – RESUMO DE LEITURAS",{"$nulls":5},"BLOCO 4 – METAS"]
[null,null,"Horas estudadas total",{"$f":"SUM(REG_ESTUDOS!$H:$H)","v":{"v":0,"d":"0.00"}},null,null,"Matéria","Horas Estudadas","Qtde Registros","Plano Concluído %","Status",null,"Livro","% Concluído","Páginas Lidas","Status","Nota",null,"Meta","Alvo","Realizado","%","Situação"]
[null,null,"Horas estudadas no mês",{"$f":"SUMIFS(REG_ESTUDOS!$H:$H,REG_ESTUDOS!$M:$M,TEXT(TODAY(),\"mm/yyyy\"))","v":{"v":0,"d":"0.00"}},null,null,{"$f":"IF(CAD_MATERIAS!D11=\"\",\"\",CAD_MATERIAS!D11)","v":""},{"$f":"IF(G11=\"\",\"\",SUMIFS(REG_ESTUDOS!$H:$H,REG_ESTUDOS!$E:$E,G11))","v":""},{"$f":"IF(G11=\"\",\"\",COUNTIFS(REG_ESTUDOS!$E:$E,G11))","v":""},{"$f":"IF(G11=\"\",\"\",IFERROR(AVERAGEIF(PLANO_ESTUDOS!$D:$D,G11,PLANO_ESTUDOS!$L:$L),0))","v":""},{"$f":"IF(G11=\"\",\"\",IF(H11=0,\"Sem estudo\",IF(J11>=0.8,\"Avançado\",IF(J11>=0.4,\"Intermediário\",\"Inicial\"))))","v":""},null,{"$f":"IF(LEITURAS!D11=\"\",\"\",LEITURAS!D11)","v":""},{"$f":"IFERROR(VLOOKUP(M11,LEITURAS!$D:$Q,12,FALSE),0)","v":{"v":0,"d":"0%"}},{"$f":"IFERROR(VLOOKUP(M11,LEITURAS!$D:$Q,6,FALSE),0)","v":0},{"$f":"IFERROR(VLOOKUP(M11,LEITURAS!$D:$Q,9,FALSE),\"\")","v":""},{"$f":"IFERROR(VLOOKUP(M11,LEITURAS!$D:$Q,10,FALSE),\"\")","v":""},null,{"$f":"IF(METAS!E11=\"\",\"\",METAS!E11)","v":""},{"$f":"IF(S11=\"\",\"\",METAS!G11)","v":""},{"$f":"IF(S11=\"\",\"\",METAS!H11)","v":""},{"$f":"IF(S11=\"\",\"\",METAS!I11)","v":""},{"$f":"IF(S11=\"\",\"\",METAS!J11)","v":""}]
[null,null,"Horas estudadas na semana",{"$f":"SUMIFS(REG_ESTUDOS!$H:$H,REG_ESTUDOS!$L:$L,TEXT(TODAY(),\"yyyy\")&\"-S\"&WEEKNUM(TODAY(),2))","v":{"v":0,"d":"0.00"}},null,null,"BLOCO 2 – RESUMO POR MATÉRIA",{"$nulls":5},"BLOCO 3 – RESUMO DE LEITURAS"]
[null,null,"Total de registros de estudo",{"$f":"COUNTA(REG_ESTUDOS!$C:$C)-1","v":{"v":13,"d":"13.00"}},null,null,"Matéria","Horas Estudadas","Qtde Registros","Plano Concluído %","Status",null,"Livro","% Concluído","Páginas Lidas","Status","Nota"]
[null,null,"Livros cadastrados",{"$f":"COUNTA(LEITURAS!$D:$D)-1","v":{"v":1,"d":"1.00"}},null,null,{"$f":"IF(CAD_MATERIAS!D14=\"\",\"\",CAD_MATERIAS!D14)","v":""},{"$f":"IF(G14=\"\",\"\",SUMIFS(REG_ESTUDOS!$H:$H,REG_ESTUDOS!$E:$E,G14))","v":""},{"$f":"IF(G14=\"\",\"\",COUNTIFS(REG_ESTUDOS!$E:$E,G14))","v":""},{"$f":"IF(G14=\"\",\"\",IFERROR(AVERAGEIF(PLANO_ESTUDOS!$D:$D,G14,PLANO_ESTUDOS!$L:$L),0))","v":""},{"$f":"IF(G14=\"\",\"\",IF(H14=0,\"Sem estudo\",IF(J14>=0.8,\"Avançado\",IF(J14>=0.4,\"Intermediário\",\"Inicial\"))))","v":""},null,{"$f":"IF(LEITURAS!D14=\"\",\"\",LEITURAS!D14)","v":""},{"$f":"IFERROR(VLOOKUP(M14,LEITURAS!$D:$Q,12,FALSE),0)","v":{"v":0,"d":"0%"}},{"$f":"IFERROR(VLOOKUP(M14,LEITURAS!$D:$Q,6,FALSE),0)","v":0},{"$f":"IFERROR(VLOOKUP(M14,LEITURAS!$D:$Q,9,FALSE),\"\")","v":""},{"$f":"IFERROR(VLOOKUP(M14,LEITURAS!$D:$Q,10,FALSE),\"\")","v":""}]
[null,null,"Livros em leitura",{"$f":"COUNTIFS(LEITURAS!$L:$L,\"Em Leitura\")","v":{"v":0,"d":"0.00"}},null,null,"BLOCO 2 – RESUMO POR MATÉRIA",{"$nulls":5},"BLOCO 3 – RESUMO DE LEITURAS"]
[null,null,"Livros concluídos",{"$f":"COUNTIFS(LEITURAS!$L:$L,\"Concluído\")","v":{"v":0,"d":"0.00"}},null,null,"Matéria","Horas Estudadas","Qtde Registros","Plano Concluído %","Status",null,"Livro","% Concluído","Páginas Lidas","Status","Nota"]
[null,null,"Páginas lidas total",{"$f":"SUM(LEITURAS!$I:$I)","v":{"v":0,"d":"0.00"}},null,null,{"$f":"IF(CAD_MATERIAS!D17=\"\",\"\",CAD_MATERIAS!D17)","v":""},{"$f":"IF(G17=\"\",\"\",SUMIFS(REG_ESTUDOS!$H:$H,REG_ESTUDOS!$E:$E,G17))","v":""},{"$f":"IF(G17=\"\",\"\",COUNTIFS(REG_ESTUDOS!$E:$E,G17))","v":""},{"$f":"IF(G17=\"\",\"\",IFERROR(AVERAGEIF(PLANO_ESTUDOS!$D:$D,G17,PLANO_ESTUDOS!$L:$L),0))","v":""},{"$f":"IF(G17=\"\",\"\",IF(H17=0,\"Sem estudo\",IF(J17>=0.8,\"Avançado\",IF(J17>=0.4,\"Intermediário\",\"Inicial\"))))","v":""},null,{"$f":"IF(LEITURAS!D17=\"\",\"\",LEITURAS!D17)","v":""},{"$f":"IFERROR(VLOOKUP(M17,LEITURAS!$D:$Q,12,FALSE),0)","v":{"v":0,"d":"0%"}},{"$f":"IFERROR(VLOOKUP(M17,LEITURAS!$D:$Q,6,FALSE),0)","v":0},{"$f":"IFERROR(VLOOKUP(M17,LEITURAS!$D:$Q,9,FALSE),\"\")","v":""},{"$f":"IFERROR(VLOOKUP(M17,LEITURAS!$D:$Q,10,FALSE),\"\")","v":""}]
[null,null,"% médio de leitura",{"$f":"IFERROR(AVERAGE(LEITURAS!$O:$O),0)","v":{"v":0,"d":"0%"}}]
[null,null,"Revisões pendentes",{"$f":"COUNTIFS(REVISOES!$O:$O,\"Atrasado\")+COUNTIFS(REVISOES!$O:$O,\"Hoje\")","v":{"v":8,"d":"8.00"}}]

{"sheet":"RELATORIOS","index":8,"n_rows":33,"n_cols":13,"rows_kept":33,"hidden":true}
[null,null,"Início",{"$f":"HYPERLINK(\"#CAD_MATERIAS!C2\",\"Cadastros\")","v":"Cadastros"},{"$f":"HYPERLINK(\"#PLANO_ESTUDOS!C2\",\"Plano\")","v":"Plano"},{"$f":"HYPERLINK(\"#REG_ESTUDOS!C2\",\"Registros\")","v":"Registros"},{"$f":"HYPERLINK(\"#LEITURAS!C2\",\"Leituras\")","v":"Leituras"},{"$f":"HYPERLINK(\"#REVISOES!C2\",\"Revisões\")","v":"Revisões"},{"$f":"HYPERLINK(\"#METAS!C2\",\"Metas\")","v":"Metas"},{"$f":"HYPERLINK(\"#RELATORIOS!C2\",\"Relatórios\")","v":"Relatórios"},"Instruções"]
[null,null,"📊 RELATÓRIOS E DASHBOARD"]
[]
[null,null,"Visão consolidada do desempenho. Dados alimentados pela aba CALCULOS."]
[]
[null,null,"⭐ KPIs PRINCIPAIS"]
[null,null,"Horas no Mês",null,"Horas Acumuladas",null,"Livros Concluídos",null,"Em Andamento",null,"Páginas Lidas"]
[null,null,{"$f":"CALCULOS!D11","v":{"v":0,"d":"0.0"}},null,{"$f":"CALCULOS!D10","v":{"v":0,"d":"0.0"}},null,{"$f":"CALCULOS!D16","v":0},null,{"$f":"CALCULOS!D15","v":0},null,{"$f":"CALCULOS!D17","v":0}]
[]
[null,null,"⭐ Revisões Pendentes",null,"⭐ % Médio Leitura"]
[null,null,{"$f":"CALCULOS!D19","v":8},null,{"$f":"CALCULOS!D18","v":{"v":0,"d":"0%"}}]
[]
[]
[null,null,"📊 DESEMPENHO POR MATÉRIA",{"$nulls":6},"📖 ANDAMENTO DAS LEITURAS"]
[null,null,"Matéria","Horas","Registros","Progresso %","Status",null,null,"Livro","% Concluído","Páginas Lidas","Status"]
[null,null,{"$f":"IF(CALCULOS!G8=\"\",\"\",CALCULOS!G8)","v":""},{"$f":"IF(C16=\"\",\"\",CALCULOS!H8)","v":""},{"$f":"IF(C16=\"\",\"\",CALCULOS!I8)","v":""},{"$f":"IF(C16=\"\",\"\",CALCULOS!J8)","v":""},{"$f":"IF(C16=\"\",\"\",CALCULOS!K8)","v":""},null,null,{"$f":"IF(CALCULOS!M8=\"\",\"\",CALCULOS!M8)","v":""},{"$f":"IF(J16=\"\",\"\",CALCULOS!N8)","v":""},{"$f":"IF(J16=\"\",\"\",CALCULOS!O8)","v":""},{"$f":"IF(J16=\"\",\"\",CALCULOS!P8)","v":""}]
[null,null,{"$f":"IF(CALCULOS!G9=\"\",\"\",CALCULOS!G9)","v":"BLOCO 2 – RESUMO POR MATÉRIA"},{"$f":"IF(C17=\"\",\"\",CALCULOS!H9)","v":0},{"$f":"IF(C17=\"\",\"\",CALCULOS!I9)","v":0},{"$f":"IF(C17=\"\",\"\",CALCULOS!J9)","v":{"v":0,"d":"0%"}},{"$f":"IF(C17=\"\",\"\",CALCULOS!K9)","v":0},null,null,"📖 ANDAMENTO DAS LEITURAS"]
[null,null,{"$f":"IF(CALCULOS!G10=\"\",\"\",CALCULOS!G10)","v":"Matéria"},{"$f":"IF(C18=\"\",\"\",CALCULOS!H10)","v":"Horas Estudadas"},{"$f":"IF(C18=\"\",\"\",CALCULOS!I10)","v":"Qtde Registros"},{"$f":"IF(C18=\"\",\"\",CALCULOS!J10)","v":"Plano Concluído %"},{"$f":"IF(C18=\"\",\"\",CALCULOS!K10)","v":"Status"},null,null,"Livro","% Concluído","Páginas Lidas","Status"]
[null,null,{"$f":"IF(CALCULOS!G11=\"\",\"\",CALCULOS!G11)","v":""},{"$f":"IF(C19=\"\",\"\",CALCULOS!H11)","v":""},{"$f":"IF(C19=\"\",\"\",CALCULOS!I11)","v":""},{"$f":"IF(C19=\"\",\"\",CALCULOS!J11)","v":""},{"$f":"IF(C19=\"\",\"\",CALCULOS!K11)","v":""},null,null,{"$f":"IF(CALCULOS!M11=\"\",\"\",CALCULOS!M11)","v":""},{"$f":"IF(J19=\"\",\"\",CALCULOS!N11)","v":""},{"$f":"IF(J19=\"\",\"\",CALCULOS!O11)","v":""},{"$f":"IF(J19=\"\",\"\",CALCULOS!P11)","v":""}]
[null,null,{"$f":"IF(CALCULOS!G12=\"\",\"\",CALCULOS!G12)","v":"BLOCO 2 – RESUMO POR MATÉRIA"},{"$f":"IF(C20=\"\",\"\",CALCULOS!H12)","v":0},{"$f":"IF(C20=\"\",\"\",CALCULOS!I12)","v":0},{"$f":"IF(C20=\"\",\"\",CALCULOS!J12)","v":{"v":0,"d":"0%"}},{"$f":"IF(C20=\"\",\"\",CALCULOS!K12)","v":0}]
{"$rows_left_out":14}
{"sheet":"LISTAS","index":9,"n_rows":19,"n_cols":15,"rows_kept":19,"hidden":true}
[]
[null,null,"📋 LISTAS DE VALIDAÇÃO"]
[]
[null,null,"Listas utilizadas para validação de dados em toda a planilha. Não altere."]
[]
[null,null,"Prioridade",null,"Status Matéria",null,"Status Plano",null,"Tipo Estudo",null,"Nível Foco",null,"Tipo Material",null,"Status Leitura"]
[null,null,"Alta",null,"Não Iniciada",null,"Pendente",null,"Leitura",null,"Alto",null,"Livro",null,"Não Iniciado"]
[null,null,"Média",null,"Em Andamento",null,"Em Andamento",null,"Videoaula",null,"Médio",null,"E-book",null,"Em Leitura"]
[null,null,"Baixa",null,"Pausada",null,"Concluído",null,"Exercícios",null,"Baixo",null,"Apostila",null,"Pausado"]
[{"$nulls":4},"Concluída",null,"Adiado",null,"Revisão",{"$nulls":3},"Artigo",null,"Concluído"]
[{"$nulls":6},"Cancelado",null,"Resumo",{"$nulls":3},"Manual"]
[null,null,"Categoria",{"$nulls":5},"Simulado",null,"Sim/Não"]
[null,null,"Idiomas",null,"Tipo Meta",null,"Período",{"$nulls":3},"Sim"]
[null,null,"Concurso",null,"Horas de Estudo",null,"Semanal",null,"Status Revisão",null,"Não"]
[null,null,"Faculdade",null,"Páginas Lidas",null,"Mensal",null,"Pendente"]
[null,null,"Certificação",null,"Livros Concluídos",null,"Trimestral",null,"Feita"]
[null,null,"Leitura Técnica",null,"Matérias Concluídas",{"$nulls":3},"Atrasada"]
[null,null,"Desenvolvimento Pessoal",null,"Revisões Feitas",{"$nulls":3},"Cancelada"]
[null,null,"Outros"]